lucene-dev mailing list archives

Site index · List index
Message view « Date » · « Thread »
Top « Date » · « Thread »
From Apache Jenkins Server <jenk...@builds.apache.org>
Subject [JENKINS] Lucene-trunk - Build # 1665 - Still Failing
Date Sun, 28 Aug 2011 04:49:37 GMT
Build: https://builds.apache.org/job/Lucene-trunk/1665/

3 tests failed.
REGRESSION:  org.apache.lucene.index.TestIndexWriter.testThreadInterruptDeadlock

Error Message:
java.lang.AssertionError: Some threads threw uncaught exceptions!

Stack Trace:
java.lang.RuntimeException: java.lang.AssertionError: Some threads threw uncaught exceptions!
	at org.apache.lucene.util.LuceneTestCase.tearDown(LuceneTestCase.java:686)
	at org.apache.lucene.util.LuceneTestCaseRunner.runChild(LuceneTestCaseRunner.java:148)
	at org.apache.lucene.util.LuceneTestCaseRunner.runChild(LuceneTestCaseRunner.java:50)
	at org.apache.lucene.util.LuceneTestCase.checkUncaughtExceptionsAfter(LuceneTestCase.java:714)
	at org.apache.lucene.util.LuceneTestCase.tearDown(LuceneTestCase.java:658)


REGRESSION:  org.apache.lucene.index.TestNRTThreads.testNRTThreads

Error Message:
java.lang.AssertionError: Some threads threw uncaught exceptions!

Stack Trace:
java.lang.RuntimeException: java.lang.AssertionError: Some threads threw uncaught exceptions!
	at org.apache.lucene.util.LuceneTestCase.tearDown(LuceneTestCase.java:686)
	at org.apache.lucene.util.LuceneTestCaseRunner.runChild(LuceneTestCaseRunner.java:148)
	at org.apache.lucene.util.LuceneTestCaseRunner.runChild(LuceneTestCaseRunner.java:50)
	at org.apache.lucene.util.LuceneTestCase.checkUncaughtExceptionsAfter(LuceneTestCase.java:714)
	at org.apache.lucene.util.LuceneTestCase.tearDown(LuceneTestCase.java:658)


REGRESSION:  org.apache.lucene.util.automaton.TestCompiledAutomaton.testRandom

Error Message:
Java heap space

Stack Trace:
java.lang.OutOfMemoryError: Java heap space
	at org.apache.lucene.util.automaton.RunAutomaton.<init>(RunAutomaton.java:128)
	at org.apache.lucene.util.automaton.ByteRunAutomaton.<init>(ByteRunAutomaton.java:28)
	at org.apache.lucene.util.automaton.CompiledAutomaton.<init>(CompiledAutomaton.java:134)
	at org.apache.lucene.util.automaton.TestCompiledAutomaton.build(TestCompiledAutomaton.java:39)
	at org.apache.lucene.util.automaton.TestCompiledAutomaton.testTerms(TestCompiledAutomaton.java:55)
	at org.apache.lucene.util.automaton.TestCompiledAutomaton.testRandom(TestCompiledAutomaton.java:101)
	at org.apache.lucene.util.LuceneTestCaseRunner.runChild(LuceneTestCaseRunner.java:148)
	at org.apache.lucene.util.LuceneTestCaseRunner.runChild(LuceneTestCaseRunner.java:50)




Build Log (for compile errors):
[...truncated 13050 lines...]



---------------------------------------------------------------------
To unsubscribe, e-mail: dev-unsubscribe@lucene.apache.org
For additional commands, e-mail: dev-help@lucene.apache.org


Mime
View raw message