lucene-dev mailing list archives

Site index · List index
Message view « Date » · « Thread »
Top « Date » · « Thread »
From Apache Jenkins Server <jenk...@builds.apache.org>
Subject [JENKINS] Lucene-Solr-tests-only-trunk - Build # 10312 - Failure
Date Fri, 26 Aug 2011 01:26:49 GMT
Build: https://builds.apache.org/job/Lucene-Solr-tests-only-trunk/10312/

31 tests failed.
REGRESSION:  org.apache.solr.cloud.CloudStateUpdateTest.testCoreRegistration

Error Message:
null

Stack Trace:
org.apache.solr.common.cloud.ZooKeeperException: 
	at org.apache.solr.core.CoreContainer.initZooKeeper(CoreContainer.java:185)
	at org.apache.solr.core.CoreContainer.load(CoreContainer.java:335)
	at org.apache.solr.core.CoreContainer$Initializer.initialize(CoreContainer.java:244)
	at org.apache.solr.cloud.CloudStateUpdateTest.setUp(CloudStateUpdateTest.java:120)
	at org.apache.lucene.util.LuceneTestCase$LuceneTestCaseRunner.runChild(LuceneTestCase.java:1530)
	at org.apache.lucene.util.LuceneTestCase$LuceneTestCaseRunner.runChild(LuceneTestCase.java:1432)
Caused by: java.util.concurrent.TimeoutException: Could not connect to ZooKeeper 127.0.0.1:42831/solr
within 5000 ms
	at org.apache.solr.common.cloud.ConnectionManager.waitForConnected(ConnectionManager.java:124)
	at org.apache.solr.common.cloud.SolrZkClient.<init>(SolrZkClient.java:121)
	at org.apache.solr.common.cloud.SolrZkClient.<init>(SolrZkClient.java:69)
	at org.apache.solr.cloud.ZkController.<init>(ZkController.java:104)
	at org.apache.solr.core.CoreContainer.initZooKeeper(CoreContainer.java:166)


FAILED:  junit.framework.TestSuite.org.apache.solr.cloud.CloudStateUpdateTest

Error Message:
ensure your setUp() calls super.setUp() and your tearDown() calls super.tearDown()!!!

Stack Trace:
junit.framework.AssertionFailedError: ensure your setUp() calls super.setUp() and your tearDown()
calls super.tearDown()!!!
	at org.apache.lucene.util.LuceneTestCase.afterClassLuceneTestCaseJ4(LuceneTestCase.java:440)


FAILED:  junit.framework.TestSuite.org.apache.solr.core.IndexReaderFactoryTest

Error Message:
null

Stack Trace:
junit.framework.AssertionFailedError
	at org.apache.lucene.util.LuceneTestCase.initRandom(LuceneTestCase.java:355)
	at org.apache.lucene.util.LuceneTestCase.beforeClassLuceneTestCaseJ4(LuceneTestCase.java:366)


FAILED:  junit.framework.TestSuite.org.apache.solr.core.IndexReaderFactoryTest

Error Message:
ensure your setUp() calls super.setUp() and your tearDown() calls super.tearDown()!!!

Stack Trace:
junit.framework.AssertionFailedError: ensure your setUp() calls super.setUp() and your tearDown()
calls super.tearDown()!!!
	at org.apache.lucene.util.LuceneTestCase.afterClassLuceneTestCaseJ4(LuceneTestCase.java:440)


FAILED:  junit.framework.TestSuite.org.apache.solr.core.TestJmxMonitoredMap

Error Message:
null

Stack Trace:
junit.framework.AssertionFailedError
	at org.apache.lucene.util.LuceneTestCase.initRandom(LuceneTestCase.java:355)
	at org.apache.lucene.util.LuceneTestCase.beforeClassLuceneTestCaseJ4(LuceneTestCase.java:366)


FAILED:  junit.framework.TestSuite.org.apache.solr.core.TestJmxMonitoredMap

Error Message:
ensure your setUp() calls super.setUp() and your tearDown() calls super.tearDown()!!!

Stack Trace:
junit.framework.AssertionFailedError: ensure your setUp() calls super.setUp() and your tearDown()
calls super.tearDown()!!!
	at org.apache.lucene.util.LuceneTestCase.afterClassLuceneTestCaseJ4(LuceneTestCase.java:440)


FAILED:  junit.framework.TestSuite.org.apache.solr.core.TestSolrDeletionPolicy1

Error Message:
null

Stack Trace:
junit.framework.AssertionFailedError
	at org.apache.lucene.util.LuceneTestCase.initRandom(LuceneTestCase.java:355)
	at org.apache.lucene.util.LuceneTestCase.beforeClassLuceneTestCaseJ4(LuceneTestCase.java:366)


FAILED:  junit.framework.TestSuite.org.apache.solr.core.TestSolrDeletionPolicy1

Error Message:
ensure your setUp() calls super.setUp() and your tearDown() calls super.tearDown()!!!

Stack Trace:
junit.framework.AssertionFailedError: ensure your setUp() calls super.setUp() and your tearDown()
calls super.tearDown()!!!
	at org.apache.lucene.util.LuceneTestCase.afterClassLuceneTestCaseJ4(LuceneTestCase.java:440)


FAILED:  junit.framework.TestSuite.org.apache.solr.handler.StandardRequestHandlerTest

Error Message:
null

Stack Trace:
junit.framework.AssertionFailedError
	at org.apache.lucene.util.LuceneTestCase.initRandom(LuceneTestCase.java:355)
	at org.apache.lucene.util.LuceneTestCase.beforeClassLuceneTestCaseJ4(LuceneTestCase.java:366)


FAILED:  junit.framework.TestSuite.org.apache.solr.handler.StandardRequestHandlerTest

Error Message:
ensure your setUp() calls super.setUp() and your tearDown() calls super.tearDown()!!!

Stack Trace:
junit.framework.AssertionFailedError: ensure your setUp() calls super.setUp() and your tearDown()
calls super.tearDown()!!!
	at org.apache.lucene.util.LuceneTestCase.afterClassLuceneTestCaseJ4(LuceneTestCase.java:440)


FAILED:  junit.framework.TestSuite.org.apache.solr.handler.TestReplicationHandler

Error Message:
null

Stack Trace:
junit.framework.AssertionFailedError
	at org.apache.lucene.util.LuceneTestCase.initRandom(LuceneTestCase.java:355)
	at org.apache.lucene.util.LuceneTestCase.beforeClassLuceneTestCaseJ4(LuceneTestCase.java:366)


FAILED:  junit.framework.TestSuite.org.apache.solr.handler.TestReplicationHandler

Error Message:
null

Stack Trace:
java.lang.NullPointerException
	at org.apache.solr.handler.TestReplicationHandler.afterClass(TestReplicationHandler.java:101)


FAILED:  junit.framework.TestSuite.org.apache.solr.handler.TestReplicationHandler

Error Message:
ensure your setUp() calls super.setUp() and your tearDown() calls super.tearDown()!!!

Stack Trace:
junit.framework.AssertionFailedError: ensure your setUp() calls super.setUp() and your tearDown()
calls super.tearDown()!!!
	at org.apache.lucene.util.LuceneTestCase.afterClassLuceneTestCaseJ4(LuceneTestCase.java:440)


FAILED:  junit.framework.TestSuite.org.apache.solr.handler.component.DebugComponentTest

Error Message:
null

Stack Trace:
junit.framework.AssertionFailedError
	at org.apache.lucene.util.LuceneTestCase.initRandom(LuceneTestCase.java:355)
	at org.apache.lucene.util.LuceneTestCase.beforeClassLuceneTestCaseJ4(LuceneTestCase.java:366)


FAILED:  junit.framework.TestSuite.org.apache.solr.handler.component.DebugComponentTest

Error Message:
ensure your setUp() calls super.setUp() and your tearDown() calls super.tearDown()!!!

Stack Trace:
junit.framework.AssertionFailedError: ensure your setUp() calls super.setUp() and your tearDown()
calls super.tearDown()!!!
	at org.apache.lucene.util.LuceneTestCase.afterClassLuceneTestCaseJ4(LuceneTestCase.java:440)


FAILED:  junit.framework.TestSuite.org.apache.solr.highlight.FastVectorHighlighterTest

Error Message:
null

Stack Trace:
junit.framework.AssertionFailedError
	at org.apache.lucene.util.LuceneTestCase.initRandom(LuceneTestCase.java:355)
	at org.apache.lucene.util.LuceneTestCase.beforeClassLuceneTestCaseJ4(LuceneTestCase.java:366)


FAILED:  junit.framework.TestSuite.org.apache.solr.highlight.FastVectorHighlighterTest

Error Message:
ensure your setUp() calls super.setUp() and your tearDown() calls super.tearDown()!!!

Stack Trace:
junit.framework.AssertionFailedError: ensure your setUp() calls super.setUp() and your tearDown()
calls super.tearDown()!!!
	at org.apache.lucene.util.LuceneTestCase.afterClassLuceneTestCaseJ4(LuceneTestCase.java:440)


FAILED:  junit.framework.TestSuite.org.apache.solr.schema.IndexSchemaTest

Error Message:
null

Stack Trace:
junit.framework.AssertionFailedError
	at org.apache.lucene.util.LuceneTestCase.initRandom(LuceneTestCase.java:355)
	at org.apache.lucene.util.LuceneTestCase.beforeClassLuceneTestCaseJ4(LuceneTestCase.java:366)


FAILED:  junit.framework.TestSuite.org.apache.solr.schema.IndexSchemaTest

Error Message:
ensure your setUp() calls super.setUp() and your tearDown() calls super.tearDown()!!!

Stack Trace:
junit.framework.AssertionFailedError: ensure your setUp() calls super.setUp() and your tearDown()
calls super.tearDown()!!!
	at org.apache.lucene.util.LuceneTestCase.afterClassLuceneTestCaseJ4(LuceneTestCase.java:440)


FAILED:  junit.framework.TestSuite.org.apache.solr.search.TestLRUCache

Error Message:
null

Stack Trace:
junit.framework.AssertionFailedError
	at org.apache.lucene.util.LuceneTestCase.initRandom(LuceneTestCase.java:355)
	at org.apache.lucene.util.LuceneTestCase.beforeClassLuceneTestCaseJ4(LuceneTestCase.java:366)


FAILED:  junit.framework.TestSuite.org.apache.solr.search.TestLRUCache

Error Message:
ensure your setUp() calls super.setUp() and your tearDown() calls super.tearDown()!!!

Stack Trace:
junit.framework.AssertionFailedError: ensure your setUp() calls super.setUp() and your tearDown()
calls super.tearDown()!!!
	at org.apache.lucene.util.LuceneTestCase.afterClassLuceneTestCaseJ4(LuceneTestCase.java:440)


FAILED:  junit.framework.TestSuite.org.apache.solr.search.TestRealTimeGet

Error Message:
null

Stack Trace:
junit.framework.AssertionFailedError
	at org.apache.lucene.util.LuceneTestCase.initRandom(LuceneTestCase.java:355)
	at org.apache.lucene.util.LuceneTestCase.beforeClassLuceneTestCaseJ4(LuceneTestCase.java:366)


FAILED:  junit.framework.TestSuite.org.apache.solr.search.TestRealTimeGet

Error Message:
ensure your setUp() calls super.setUp() and your tearDown() calls super.tearDown()!!!

Stack Trace:
junit.framework.AssertionFailedError: ensure your setUp() calls super.setUp() and your tearDown()
calls super.tearDown()!!!
	at org.apache.lucene.util.LuceneTestCase.afterClassLuceneTestCaseJ4(LuceneTestCase.java:440)


FAILED:  junit.framework.TestSuite.org.apache.solr.servlet.SolrRequestParserTest

Error Message:
null

Stack Trace:
junit.framework.AssertionFailedError
	at org.apache.lucene.util.LuceneTestCase.initRandom(LuceneTestCase.java:355)
	at org.apache.lucene.util.LuceneTestCase.beforeClassLuceneTestCaseJ4(LuceneTestCase.java:366)


FAILED:  junit.framework.TestSuite.org.apache.solr.servlet.SolrRequestParserTest

Error Message:
ensure your setUp() calls super.setUp() and your tearDown() calls super.tearDown()!!!

Stack Trace:
junit.framework.AssertionFailedError: ensure your setUp() calls super.setUp() and your tearDown()
calls super.tearDown()!!!
	at org.apache.lucene.util.LuceneTestCase.afterClassLuceneTestCaseJ4(LuceneTestCase.java:440)


FAILED:  junit.framework.TestSuite.org.apache.solr.spelling.IndexBasedSpellCheckerTest

Error Message:
null

Stack Trace:
junit.framework.AssertionFailedError
	at org.apache.lucene.util.LuceneTestCase.initRandom(LuceneTestCase.java:355)
	at org.apache.lucene.util.LuceneTestCase.beforeClassLuceneTestCaseJ4(LuceneTestCase.java:366)


FAILED:  junit.framework.TestSuite.org.apache.solr.spelling.IndexBasedSpellCheckerTest

Error Message:
ensure your setUp() calls super.setUp() and your tearDown() calls super.tearDown()!!!

Stack Trace:
junit.framework.AssertionFailedError: ensure your setUp() calls super.setUp() and your tearDown()
calls super.tearDown()!!!
	at org.apache.lucene.util.LuceneTestCase.afterClassLuceneTestCaseJ4(LuceneTestCase.java:440)


FAILED:  junit.framework.TestSuite.org.apache.solr.update.DirectUpdateHandlerOptimizeTest

Error Message:
null

Stack Trace:
junit.framework.AssertionFailedError
	at org.apache.lucene.util.LuceneTestCase.initRandom(LuceneTestCase.java:355)
	at org.apache.lucene.util.LuceneTestCase.beforeClassLuceneTestCaseJ4(LuceneTestCase.java:366)


FAILED:  junit.framework.TestSuite.org.apache.solr.update.DirectUpdateHandlerOptimizeTest

Error Message:
ensure your setUp() calls super.setUp() and your tearDown() calls super.tearDown()!!!

Stack Trace:
junit.framework.AssertionFailedError: ensure your setUp() calls super.setUp() and your tearDown()
calls super.tearDown()!!!
	at org.apache.lucene.util.LuceneTestCase.afterClassLuceneTestCaseJ4(LuceneTestCase.java:440)


FAILED:  junit.framework.TestSuite.org.apache.solr.velocity.VelocityResponseWriterTest

Error Message:
null

Stack Trace:
junit.framework.AssertionFailedError
	at org.apache.lucene.util.LuceneTestCase.initRandom(LuceneTestCase.java:355)
	at org.apache.lucene.util.LuceneTestCase.beforeClassLuceneTestCaseJ4(LuceneTestCase.java:366)


FAILED:  junit.framework.TestSuite.org.apache.solr.velocity.VelocityResponseWriterTest

Error Message:
ensure your setUp() calls super.setUp() and your tearDown() calls super.tearDown()!!!

Stack Trace:
junit.framework.AssertionFailedError: ensure your setUp() calls super.setUp() and your tearDown()
calls super.tearDown()!!!
	at org.apache.lucene.util.LuceneTestCase.afterClassLuceneTestCaseJ4(LuceneTestCase.java:440)




Build Log (for compile errors):
[...truncated 8454 lines...]



---------------------------------------------------------------------
To unsubscribe, e-mail: dev-unsubscribe@lucene.apache.org
For additional commands, e-mail: dev-help@lucene.apache.org


Mime
View raw message