lucene-dev mailing list archives

Site index · List index
Message view « Date » · « Thread »
Top « Date » · « Thread »
From Apache Jenkins Server <jenk...@builds.apache.org>
Subject [JENKINS] Lucene-Solr-tests-only-trunk - Build # 10344 - Failure
Date Sun, 28 Aug 2011 22:20:55 GMT
Build: https://builds.apache.org/job/Lucene-Solr-tests-only-trunk/10344/

17 tests failed.
REGRESSION:  org.apache.solr.cloud.BasicDistributedZkTest.testDistribSearch

Error Message:
Severe errors in solr configuration.  Check your log files for more detailed information on
what may be wrong.  ------------------------------------------------------------- org.apache.solr.common.cloud.ZooKeeperException:
  at org.apache.solr.core.CoreContainer.register(CoreContainer.java:524)  at org.apache.solr.core.CoreContainer.load(CoreContainer.java:408)
 at org.apache.solr.core.CoreContainer.load(CoreContainer.java:292)  at org.apache.solr.core.CoreContainer$Initializer.initialize(CoreContainer.java:241)
 at org.apache.solr.servlet.SolrDispatchFilter.init(SolrDispatchFilter.java:93)  at org.mortbay.jetty.servlet.FilterHolder.doStart(FilterHolder.java:97)
 at org.mortbay.component.AbstractLifeCycle.start(AbstractLifeCycle.java:50)  at org.mortbay.jetty.servlet.ServletHandler.initialize(ServletHandler.java:713)
 at org.mortbay.jetty.servlet.ServletHandler.updateMappings(ServletHandler.java:1104)  at
org.mortbay.jetty.servlet.ServletHandler.setFilterMappings(ServletHandler.java:1140)  at org.mortbay.jetty.servlet.ServletHandler.addFilterWithMapping(ServletHandler.java:940)
 at org.mortbay.jetty.servlet.ServletHandler.addFilterWithMapping(ServletHandler.java:895)
 at org.mortbay.jetty.servlet.Context.addFilter(Context.java:207)  at org.apache.solr.client.solrj.embedded.JettySolrRunner$1.lifeCycleStarted(JettySolrRunner.java:98)
 at org.mortbay.component.AbstractLifeCycle.setStarted(AbstractLifeCycle.java:140)  at org.mortbay.component.AbstractLifeCycle.start(AbstractLifeCycle.java:52)
 at org.apache.solr.client.solrj.embedded.JettySolrRunner.start(JettySolrRunner.java:123)
 at org.apache.solr.client.solrj.embedded.JettySolrRunner.start(JettySolrRunner.java:118)
 at org.apache.solr.BaseDistributedSearchTestCase.createJetty(BaseDistributedSearchTestCase.java:245)
 at org.apache.solr.BaseDistributedSearchTestCase.createJetty(BaseDistributedSearchTestCase.java:236)
 at org.apache.solr.cloud.AbstractDistributedZkTestCase.createServers(AbstractDistributedZkTestCase.java:64)
 at org.apache.solr.BaseDistributedSearch  Severe errors in solr configuration.  Check your
log files for more detailed information on what may be wrong.  -------------------------------------------------------------
org.apache.solr.common.cloud.ZooKeeperException:   at org.apache.solr.core.CoreContainer.register(CoreContainer.java:524)
 at org.apache.solr.core.CoreContainer.load(CoreContainer.java:408)  at org.apache.solr.core.CoreContainer.load(CoreContainer.java:292)
 at org.apache.solr.core.CoreContainer$Initializer.initialize(CoreContainer.java:241)  at
org.apache.solr.servlet.SolrDispatchFilter.init(SolrDispatchFilter.java:93)  at org.mortbay.jetty.servlet.FilterHolder.doStart(FilterHolder.java:97)
 at org.mortbay.component.AbstractLifeCycle.start(AbstractLifeCycle.java:50)  at org.mortbay.jetty.servlet.ServletHandler.initialize(ServletHandler.java:713)
 at org.mortbay.jetty.servlet.ServletHandler.updateMappings(ServletHandler.java:1104)  at
org.mortbay.jetty.servlet.ServletHandler.setFilterMappings(ServletHandler.java:1140)  at org.mortbay.jetty.servlet.ServletHandler.addFilterWithMapping(ServletHandler.java:940)
 at org.mortbay.jetty.servlet.ServletHandler.addFilterWithMapping(ServletHandler.java:895)
 at org.mortbay.jetty.servlet.Context.addFilter(Context.java:207)  at org.apache.solr.client.solrj.embedded.JettySolrRunner$1.lifeCycleStarted(JettySolrRunner.java:98)
 at org.mortbay.component.AbstractLifeCycle.setStarted(AbstractLifeCycle.java:140)  at org.mortbay.component.AbstractLifeCycle.start(AbstractLifeCycle.java:52)
 at org.apache.solr.client.solrj.embedded.JettySolrRunner.start(JettySolrRunner.java:123)
 at org.apache.solr.client.solrj.embedded.JettySolrRunner.start(JettySolrRunner.java:118)
 at org.apache.solr.BaseDistributedSearchTestCase.createJetty(BaseDistributedSearchTestCase.java:245)
 at org.apache.solr.BaseDistributedSearchTestCase.createJetty(BaseDistributedSearchTestCase.java:236)
 at org.apache.solr.cloud.AbstractDistributedZkTestCase.createServers(AbstractDistributedZkTestCase.java:64)
 at org.apache.solr.BaseDistributedSearch  request: http://localhost:20729/solr/update?wt=javabin&version=2

Stack Trace:


request: http://localhost:20729/solr/update?wt=javabin&version=2
	at org.apache.solr.client.solrj.impl.CommonsHttpSolrServer.request(CommonsHttpSolrServer.java:434)
	at org.apache.solr.client.solrj.impl.CommonsHttpSolrServer.request(CommonsHttpSolrServer.java:244)
	at org.apache.solr.client.solrj.request.AbstractUpdateRequest.process(AbstractUpdateRequest.java:104)
	at org.apache.solr.client.solrj.SolrServer.deleteByQuery(SolrServer.java:111)
	at org.apache.solr.BaseDistributedSearchTestCase.del(BaseDistributedSearchTestCase.java:307)
	at org.apache.solr.cloud.BasicDistributedZkTest.doTest(BasicDistributedZkTest.java:87)
	at org.apache.solr.BaseDistributedSearchTestCase.testDistribSearch(BaseDistributedSearchTestCase.java:593)
	at org.apache.lucene.util.LuceneTestCaseRunner.runChild(LuceneTestCaseRunner.java:148)
	at org.apache.lucene.util.LuceneTestCaseRunner.runChild(LuceneTestCaseRunner.java:50)


REGRESSION:  org.apache.solr.cloud.CloudStateUpdateTest.testCoreRegistration

Error Message:
null

Stack Trace:
org.apache.solr.common.cloud.ZooKeeperException: 
	at org.apache.solr.core.CoreContainer.initZooKeeper(CoreContainer.java:185)
	at org.apache.solr.core.CoreContainer.load(CoreContainer.java:335)
	at org.apache.solr.core.CoreContainer$Initializer.initialize(CoreContainer.java:244)
	at org.apache.solr.cloud.CloudStateUpdateTest.setUp(CloudStateUpdateTest.java:113)
	at org.apache.lucene.util.LuceneTestCaseRunner.runChild(LuceneTestCaseRunner.java:148)
	at org.apache.lucene.util.LuceneTestCaseRunner.runChild(LuceneTestCaseRunner.java:50)
Caused by: java.util.concurrent.TimeoutException: Could not connect to ZooKeeper 127.0.0.1:20709/solr
within 5000 ms
	at org.apache.solr.common.cloud.ConnectionManager.waitForConnected(ConnectionManager.java:124)
	at org.apache.solr.common.cloud.SolrZkClient.<init>(SolrZkClient.java:121)
	at org.apache.solr.common.cloud.SolrZkClient.<init>(SolrZkClient.java:69)
	at org.apache.solr.cloud.ZkController.<init>(ZkController.java:104)
	at org.apache.solr.core.CoreContainer.initZooKeeper(CoreContainer.java:166)


FAILED:  junit.framework.TestSuite.org.apache.solr.cloud.CloudStateUpdateTest

Error Message:
java.lang.AssertionError: ensure your setUp() calls super.setUp() and your tearDown() calls
super.tearDown()!!!

Stack Trace:
java.lang.RuntimeException: java.lang.AssertionError: ensure your setUp() calls super.setUp()
and your tearDown() calls super.tearDown()!!!
	at org.apache.lucene.util.LuceneTestCase.afterClassLuceneTestCaseJ4(LuceneTestCase.java:463)
	at org.apache.lucene.util.LuceneTestCase.afterClassLuceneTestCaseJ4(LuceneTestCase.java:407)


REGRESSION:  org.apache.solr.core.IndexReaderFactoryTest.testAltReaderUsed

Error Message:
org.apache.solr.common.cloud.ZooKeeperException: 

Stack Trace:
java.lang.RuntimeException: org.apache.solr.common.cloud.ZooKeeperException: 
	at org.apache.solr.util.TestHarness.<init>(TestHarness.java:152)
	at org.apache.solr.util.TestHarness.<init>(TestHarness.java:135)
	at org.apache.solr.util.TestHarness.<init>(TestHarness.java:125)
	at org.apache.solr.util.AbstractSolrTestCase.setUp(AbstractSolrTestCase.java:145)
	at org.apache.lucene.util.LuceneTestCaseRunner.runChild(LuceneTestCaseRunner.java:148)
	at org.apache.lucene.util.LuceneTestCaseRunner.runChild(LuceneTestCaseRunner.java:50)
Caused by: org.apache.solr.common.cloud.ZooKeeperException: 
	at org.apache.solr.core.CoreContainer.initZooKeeper(CoreContainer.java:185)
	at org.apache.solr.util.TestHarness$Initializer$1.<init>(TestHarness.java:209)
	at org.apache.solr.util.TestHarness$Initializer.initialize(TestHarness.java:204)
	at org.apache.solr.util.TestHarness.<init>(TestHarness.java:140)
Caused by: java.util.concurrent.TimeoutException: Could not connect to ZooKeeper 127.0.0.1:20709/solr
within 5000 ms
	at org.apache.solr.common.cloud.ConnectionManager.waitForConnected(ConnectionManager.java:124)
	at org.apache.solr.common.cloud.SolrZkClient.<init>(SolrZkClient.java:121)
	at org.apache.solr.common.cloud.SolrZkClient.<init>(SolrZkClient.java:69)
	at org.apache.solr.cloud.ZkController.<init>(ZkController.java:104)
	at org.apache.solr.core.CoreContainer.initZooKeeper(CoreContainer.java:166)


FAILED:  junit.framework.TestSuite.org.apache.solr.core.TestSolrDeletionPolicy1

Error Message:
org.apache.solr.common.cloud.ZooKeeperException: 

Stack Trace:
java.lang.RuntimeException: org.apache.solr.common.cloud.ZooKeeperException: 
	at org.apache.solr.util.TestHarness.<init>(TestHarness.java:152)
	at org.apache.solr.util.TestHarness.<init>(TestHarness.java:135)
	at org.apache.solr.util.TestHarness.<init>(TestHarness.java:125)
	at org.apache.solr.SolrTestCaseJ4.initCore(SolrTestCaseJ4.java:263)
	at org.apache.solr.SolrTestCaseJ4.initCore(SolrTestCaseJ4.java:106)
	at org.apache.solr.SolrTestCaseJ4.initCore(SolrTestCaseJ4.java:95)
	at org.apache.solr.core.TestSolrDeletionPolicy1.beforeClass(TestSolrDeletionPolicy1.java:34)
Caused by: org.apache.solr.common.cloud.ZooKeeperException: 
	at org.apache.solr.core.CoreContainer.initZooKeeper(CoreContainer.java:185)
	at org.apache.solr.util.TestHarness$Initializer$1.<init>(TestHarness.java:209)
	at org.apache.solr.util.TestHarness$Initializer.initialize(TestHarness.java:204)
	at org.apache.solr.util.TestHarness.<init>(TestHarness.java:140)
Caused by: java.util.concurrent.TimeoutException: Could not connect to ZooKeeper 127.0.0.1:20709/solr
within 5000 ms
	at org.apache.solr.common.cloud.ConnectionManager.waitForConnected(ConnectionManager.java:124)
	at org.apache.solr.common.cloud.SolrZkClient.<init>(SolrZkClient.java:121)
	at org.apache.solr.common.cloud.SolrZkClient.<init>(SolrZkClient.java:69)
	at org.apache.solr.cloud.ZkController.<init>(ZkController.java:104)
	at org.apache.solr.core.CoreContainer.initZooKeeper(CoreContainer.java:166)


REGRESSION:  org.apache.solr.handler.StandardRequestHandlerTest.testSorting

Error Message:
org.apache.solr.common.cloud.ZooKeeperException: 

Stack Trace:
java.lang.RuntimeException: org.apache.solr.common.cloud.ZooKeeperException: 
	at org.apache.solr.util.TestHarness.<init>(TestHarness.java:152)
	at org.apache.solr.util.TestHarness.<init>(TestHarness.java:135)
	at org.apache.solr.util.TestHarness.<init>(TestHarness.java:125)
	at org.apache.solr.util.AbstractSolrTestCase.setUp(AbstractSolrTestCase.java:145)
	at org.apache.solr.handler.StandardRequestHandlerTest.setUp(StandardRequestHandlerTest.java:40)
	at org.apache.lucene.util.LuceneTestCaseRunner.runChild(LuceneTestCaseRunner.java:148)
	at org.apache.lucene.util.LuceneTestCaseRunner.runChild(LuceneTestCaseRunner.java:50)
Caused by: org.apache.solr.common.cloud.ZooKeeperException: 
	at org.apache.solr.core.CoreContainer.initZooKeeper(CoreContainer.java:185)
	at org.apache.solr.util.TestHarness$Initializer$1.<init>(TestHarness.java:209)
	at org.apache.solr.util.TestHarness$Initializer.initialize(TestHarness.java:204)
	at org.apache.solr.util.TestHarness.<init>(TestHarness.java:140)
Caused by: java.util.concurrent.TimeoutException: Could not connect to ZooKeeper 127.0.0.1:20709/solr
within 5000 ms
	at org.apache.solr.common.cloud.ConnectionManager.waitForConnected(ConnectionManager.java:124)
	at org.apache.solr.common.cloud.SolrZkClient.<init>(SolrZkClient.java:121)
	at org.apache.solr.common.cloud.SolrZkClient.<init>(SolrZkClient.java:69)
	at org.apache.solr.cloud.ZkController.<init>(ZkController.java:104)
	at org.apache.solr.core.CoreContainer.initZooKeeper(CoreContainer.java:166)


REGRESSION:  org.apache.solr.handler.TestReplicationHandler.test

Error Message:
Severe errors in solr configuration.  Check your log files for more detailed information on
what may be wrong.  ------------------------------------------------------------- org.apache.solr.common.cloud.ZooKeeperException:
  at org.apache.solr.core.CoreContainer.register(CoreContainer.java:524)  at org.apache.solr.core.CoreContainer.load(CoreContainer.java:408)
 at org.apache.solr.core.CoreContainer$Initializer.initialize(CoreContainer.java:244)  at
org.apache.solr.cloud.CloudStateUpdateTest.setUp(CloudStateUpdateTest.java:107)  at sun.reflect.GeneratedMethodAccessor1.invoke(Unknown
Source)  at sun.reflect.DelegatingMethodAccessorImpl.invoke(DelegatingMethodAccessorImpl.java:43)
 at java.lang.reflect.Method.invoke(Method.java:616)  at org.junit.runners.model.FrameworkMethod$1.runReflectiveCall(FrameworkMethod.java:44)
 at org.junit.internal.runners.model.ReflectiveCallable.run(ReflectiveCallable.java:15)  at
org.junit.runners.model.FrameworkMethod.invokeExplosively(FrameworkMethod.java:41)  at org.junit.internal.runners.statements.RunBefores.evaluate(RunBefores.java:27)
 at org.junit.internal.runners.statements.RunAfters.evaluate(RunAfters.java:31)  at org.junit.runners.BlockJUnit4ClassRunner.runChild(BlockJUnit4ClassRunner.java:76)
 at org.apache.lucene.util.LuceneTestCaseRunner.runChild(LuceneTestCaseRunner.java:148)  at
org.apache.lucene.util.LuceneTestCaseRunner.runChild(LuceneTestCaseRunner.java:50)  at org.junit.runners.ParentRunner$3.run(ParentRunner.java:193)
 at org.junit.runners.ParentRunner$1.schedule(ParentRunner.java:52)  at org.junit.runners.ParentRunner.runChildren(ParentRunner.java:191)
 at org.junit.runners.ParentRunner.access$000(ParentRunner.java:42)  at org.junit.runners.ParentRunner$2.evaluate(ParentRunner.java:184)
 at org.junit.internal.runners.statements.RunBefores.evaluate(RunBefores.java:28)  at org.junit.internal.runners.statements.RunAfters.evaluate(RunAfters.java:31)
 at org.junit.runners.ParentRunner.run(ParentRunner.java:236)  at junit.framework.JUnit4TestAdapter.run(JUnit4TestAdapt
 Severe errors in solr configuration.  Check your log files for more detailed information
on what may be wrong.  ------------------------------------------------------------- org.apache.solr.common.cloud.ZooKeeperException:
  at org.apache.solr.core.CoreContainer.register(CoreContainer.java:524)  at org.apache.solr.core.CoreContainer.load(CoreContainer.java:408)
 at org.apache.solr.core.CoreContainer$Initializer.initialize(CoreContainer.java:244)  at
org.apache.solr.cloud.CloudStateUpdateTest.setUp(CloudStateUpdateTest.java:107)  at sun.reflect.GeneratedMethodAccessor1.invoke(Unknown
Source)  at sun.reflect.DelegatingMethodAccessorImpl.invoke(DelegatingMethodAccessorImpl.java:43)
 at java.lang.reflect.Method.invoke(Method.java:616)  at org.junit.runners.model.FrameworkMethod$1.runReflectiveCall(FrameworkMethod.java:44)
 at org.junit.internal.runners.model.ReflectiveCallable.run(ReflectiveCallable.java:15)  at
org.junit.runners.model.FrameworkMethod.invokeExplosively(FrameworkMethod.java:41)  at org.junit.internal.runners.statements.RunBefores.evaluate(RunBefores.java:27)
 at org.junit.internal.runners.statements.RunAfters.evaluate(RunAfters.java:31)  at org.junit.runners.BlockJUnit4ClassRunner.runChild(BlockJUnit4ClassRunner.java:76)
 at org.apache.lucene.util.LuceneTestCaseRunner.runChild(LuceneTestCaseRunner.java:148)  at
org.apache.lucene.util.LuceneTestCaseRunner.runChild(LuceneTestCaseRunner.java:50)  at org.junit.runners.ParentRunner$3.run(ParentRunner.java:193)
 at org.junit.runners.ParentRunner$1.schedule(ParentRunner.java:52)  at org.junit.runners.ParentRunner.runChildren(ParentRunner.java:191)
 at org.junit.runners.ParentRunner.access$000(ParentRunner.java:42)  at org.junit.runners.ParentRunner$2.evaluate(ParentRunner.java:184)
 at org.junit.internal.runners.statements.RunBefores.evaluate(RunBefores.java:28)  at org.junit.internal.runners.statements.RunAfters.evaluate(RunAfters.java:31)
 at org.junit.runners.ParentRunner.run(ParentRunner.java:236)  at junit.framework.JUnit4TestAdapter.run(JUnit4TestAdapt
 request: http://localhost:21020/solr/update?wt=javabin&version=2

Stack Trace:


request: http://localhost:21020/solr/update?wt=javabin&version=2
	at org.apache.solr.client.solrj.impl.CommonsHttpSolrServer.request(CommonsHttpSolrServer.java:434)
	at org.apache.solr.client.solrj.impl.CommonsHttpSolrServer.request(CommonsHttpSolrServer.java:244)
	at org.apache.solr.client.solrj.request.AbstractUpdateRequest.process(AbstractUpdateRequest.java:104)
	at org.apache.solr.client.solrj.SolrServer.deleteByQuery(SolrServer.java:111)
	at org.apache.solr.handler.TestReplicationHandler.doTestReplicateAfterCoreReload(TestReplicationHandler.java:590)
	at org.apache.solr.handler.TestReplicationHandler.test(TestReplicationHandler.java:233)
	at org.apache.lucene.util.LuceneTestCaseRunner.runChild(LuceneTestCaseRunner.java:148)
	at org.apache.lucene.util.LuceneTestCaseRunner.runChild(LuceneTestCaseRunner.java:50)


REGRESSION:  org.apache.solr.handler.XsltUpdateRequestHandlerTest.testUpdate

Error Message:
Could not load the propery file 'output_xml.properties' for output method 'xml' (check CLASSPATH)

Stack Trace:
com.sun.org.apache.xml.internal.serializer.utils.WrappedRuntimeException: Could not load the
propery file 'output_xml.properties' for output method 'xml' (check CLASSPATH)
	at com.sun.org.apache.xml.internal.serializer.OutputPropertiesFactory.getDefaultMethodProperties(OutputPropertiesFactory.java:324)
	at com.sun.org.apache.xalan.internal.xsltc.trax.TransformerImpl.setDefaults(TransformerImpl.java:1123)
	at com.sun.org.apache.xalan.internal.xsltc.trax.TransformerImpl.createOutputProperties(TransformerImpl.java:1084)
	at com.sun.org.apache.xalan.internal.xsltc.trax.TransformerImpl.<init>(TransformerImpl.java:250)
	at com.sun.org.apache.xalan.internal.xsltc.trax.TemplatesImpl.newTransformer(TemplatesImpl.java:386)
	at org.apache.solr.util.xslt.TransformerProvider.getTransformer(TransformerProvider.java:83)
	at org.apache.solr.handler.XsltXMLLoader.getTransformer(XsltXMLLoader.java:112)
	at org.apache.solr.handler.XsltXMLLoader.load(XsltXMLLoader.java:67)
	at org.apache.solr.handler.ContentStreamHandlerBase.handleRequestBody(ContentStreamHandlerBase.java:67)
	at org.apache.solr.handler.XsltUpdateRequestHandlerTest.testUpdate(XsltUpdateRequestHandlerTest.java:79)
	at org.apache.lucene.util.LuceneTestCaseRunner.runChild(LuceneTestCaseRunner.java:148)
	at org.apache.lucene.util.LuceneTestCaseRunner.runChild(LuceneTestCaseRunner.java:50)


FAILED:  junit.framework.TestSuite.org.apache.solr.handler.admin.ShowFileRequestHandlerTest

Error Message:
no net in java.library.path

Stack Trace:
java.lang.UnsatisfiedLinkError: no net in java.library.path
	at java.lang.ClassLoader.loadLibrary(ClassLoader.java:1681)
	at java.lang.Runtime.loadLibrary0(Runtime.java:840)
	at java.lang.System.loadLibrary(System.java:1047)
	at sun.security.action.LoadLibraryAction.run(LoadLibraryAction.java:67)
	at sun.security.action.LoadLibraryAction.run(LoadLibraryAction.java:47)
	at java.security.AccessController.doPrivileged(Native Method)
	at java.net.AbstractPlainSocketImpl.<clinit>(AbstractPlainSocketImpl.java:81)
	at java.net.ServerSocket.setImpl(ServerSocket.java:253)
	at java.net.ServerSocket.<init>(ServerSocket.java:195)
	at java.net.ServerSocket.<init>(ServerSocket.java:158)
	at org.mortbay.jetty.bio.SocketConnector.newServerSocket(SocketConnector.java:80)
	at org.mortbay.jetty.bio.SocketConnector.open(SocketConnector.java:73)
	at org.mortbay.jetty.AbstractConnector.doStart(AbstractConnector.java:283)
	at org.mortbay.jetty.bio.SocketConnector.doStart(SocketConnector.java:147)
	at org.mortbay.component.AbstractLifeCycle.start(AbstractLifeCycle.java:50)
	at org.mortbay.jetty.Server.doStart(Server.java:235)
	at org.mortbay.component.AbstractLifeCycle.start(AbstractLifeCycle.java:50)
	at org.apache.solr.client.solrj.embedded.JettySolrRunner.start(JettySolrRunner.java:123)
	at org.apache.solr.client.solrj.embedded.JettySolrRunner.start(JettySolrRunner.java:118)
	at org.apache.solr.SolrJettyTestBase.createJetty(SolrJettyTestBase.java:54)
	at org.apache.solr.handler.admin.ShowFileRequestHandlerTest.beforeTest(ShowFileRequestHandlerTest.java:43)


FAILED:  junit.framework.TestSuite.org.apache.solr.handler.component.DebugComponentTest

Error Message:
org.apache.solr.common.cloud.ZooKeeperException: 

Stack Trace:
java.lang.RuntimeException: org.apache.solr.common.cloud.ZooKeeperException: 
	at org.apache.solr.util.TestHarness.<init>(TestHarness.java:152)
	at org.apache.solr.util.TestHarness.<init>(TestHarness.java:135)
	at org.apache.solr.util.TestHarness.<init>(TestHarness.java:125)
	at org.apache.solr.SolrTestCaseJ4.initCore(SolrTestCaseJ4.java:263)
	at org.apache.solr.SolrTestCaseJ4.initCore(SolrTestCaseJ4.java:106)
	at org.apache.solr.SolrTestCaseJ4.initCore(SolrTestCaseJ4.java:95)
	at org.apache.solr.handler.component.DebugComponentTest.beforeClass(DebugComponentTest.java:32)
Caused by: org.apache.solr.common.cloud.ZooKeeperException: 
	at org.apache.solr.core.CoreContainer.initZooKeeper(CoreContainer.java:185)
	at org.apache.solr.util.TestHarness$Initializer$1.<init>(TestHarness.java:209)
	at org.apache.solr.util.TestHarness$Initializer.initialize(TestHarness.java:204)
	at org.apache.solr.util.TestHarness.<init>(TestHarness.java:140)
Caused by: java.util.concurrent.TimeoutException: Could not connect to ZooKeeper 127.0.0.1:20709/solr
within 5000 ms
	at org.apache.solr.common.cloud.ConnectionManager.waitForConnected(ConnectionManager.java:124)
	at org.apache.solr.common.cloud.SolrZkClient.<init>(SolrZkClient.java:121)
	at org.apache.solr.common.cloud.SolrZkClient.<init>(SolrZkClient.java:69)
	at org.apache.solr.cloud.ZkController.<init>(ZkController.java:104)
	at org.apache.solr.core.CoreContainer.initZooKeeper(CoreContainer.java:166)


FAILED:  junit.framework.TestSuite.org.apache.solr.highlight.FastVectorHighlighterTest

Error Message:
org.apache.solr.common.cloud.ZooKeeperException: 

Stack Trace:
java.lang.RuntimeException: org.apache.solr.common.cloud.ZooKeeperException: 
	at org.apache.solr.util.TestHarness.<init>(TestHarness.java:152)
	at org.apache.solr.util.TestHarness.<init>(TestHarness.java:135)
	at org.apache.solr.util.TestHarness.<init>(TestHarness.java:125)
	at org.apache.solr.SolrTestCaseJ4.initCore(SolrTestCaseJ4.java:263)
	at org.apache.solr.SolrTestCaseJ4.initCore(SolrTestCaseJ4.java:106)
	at org.apache.solr.SolrTestCaseJ4.initCore(SolrTestCaseJ4.java:95)
	at org.apache.solr.highlight.FastVectorHighlighterTest.beforeClass(FastVectorHighlighterTest.java:32)
Caused by: org.apache.solr.common.cloud.ZooKeeperException: 
	at org.apache.solr.core.CoreContainer.initZooKeeper(CoreContainer.java:185)
	at org.apache.solr.util.TestHarness$Initializer$1.<init>(TestHarness.java:209)
	at org.apache.solr.util.TestHarness$Initializer.initialize(TestHarness.java:204)
	at org.apache.solr.util.TestHarness.<init>(TestHarness.java:140)
Caused by: java.util.concurrent.TimeoutException: Could not connect to ZooKeeper 127.0.0.1:20709/solr
within 5000 ms
	at org.apache.solr.common.cloud.ConnectionManager.waitForConnected(ConnectionManager.java:124)
	at org.apache.solr.common.cloud.SolrZkClient.<init>(SolrZkClient.java:121)
	at org.apache.solr.common.cloud.SolrZkClient.<init>(SolrZkClient.java:69)
	at org.apache.solr.cloud.ZkController.<init>(ZkController.java:104)
	at org.apache.solr.core.CoreContainer.initZooKeeper(CoreContainer.java:166)


FAILED:  junit.framework.TestSuite.org.apache.solr.schema.IndexSchemaTest

Error Message:
org.apache.solr.common.cloud.ZooKeeperException: 

Stack Trace:
java.lang.RuntimeException: org.apache.solr.common.cloud.ZooKeeperException: 
	at org.apache.solr.util.TestHarness.<init>(TestHarness.java:152)
	at org.apache.solr.util.TestHarness.<init>(TestHarness.java:135)
	at org.apache.solr.util.TestHarness.<init>(TestHarness.java:125)
	at org.apache.solr.SolrTestCaseJ4.initCore(SolrTestCaseJ4.java:263)
	at org.apache.solr.SolrTestCaseJ4.initCore(SolrTestCaseJ4.java:106)
	at org.apache.solr.SolrTestCaseJ4.initCore(SolrTestCaseJ4.java:95)
	at org.apache.solr.schema.IndexSchemaTest.beforeClass(IndexSchemaTest.java:38)
Caused by: org.apache.solr.common.cloud.ZooKeeperException: 
	at org.apache.solr.core.CoreContainer.initZooKeeper(CoreContainer.java:185)
	at org.apache.solr.util.TestHarness$Initializer$1.<init>(TestHarness.java:209)
	at org.apache.solr.util.TestHarness$Initializer.initialize(TestHarness.java:204)
	at org.apache.solr.util.TestHarness.<init>(TestHarness.java:140)
Caused by: java.util.concurrent.TimeoutException: Could not connect to ZooKeeper 127.0.0.1:20709/solr
within 5000 ms
	at org.apache.solr.common.cloud.ConnectionManager.waitForConnected(ConnectionManager.java:124)
	at org.apache.solr.common.cloud.SolrZkClient.<init>(SolrZkClient.java:121)
	at org.apache.solr.common.cloud.SolrZkClient.<init>(SolrZkClient.java:69)
	at org.apache.solr.cloud.ZkController.<init>(ZkController.java:104)
	at org.apache.solr.core.CoreContainer.initZooKeeper(CoreContainer.java:166)


FAILED:  junit.framework.TestSuite.org.apache.solr.search.TestRealTimeGet

Error Message:
org.apache.solr.common.cloud.ZooKeeperException: 

Stack Trace:
java.lang.RuntimeException: org.apache.solr.common.cloud.ZooKeeperException: 
	at org.apache.solr.util.TestHarness.<init>(TestHarness.java:152)
	at org.apache.solr.util.TestHarness.<init>(TestHarness.java:135)
	at org.apache.solr.util.TestHarness.<init>(TestHarness.java:125)
	at org.apache.solr.SolrTestCaseJ4.initCore(SolrTestCaseJ4.java:263)
	at org.apache.solr.SolrTestCaseJ4.initCore(SolrTestCaseJ4.java:106)
	at org.apache.solr.SolrTestCaseJ4.initCore(SolrTestCaseJ4.java:95)
	at org.apache.solr.search.TestRealTimeGet.beforeClass(TestRealTimeGet.java:35)
Caused by: org.apache.solr.common.cloud.ZooKeeperException: 
	at org.apache.solr.core.CoreContainer.initZooKeeper(CoreContainer.java:185)
	at org.apache.solr.util.TestHarness$Initializer$1.<init>(TestHarness.java:209)
	at org.apache.solr.util.TestHarness$Initializer.initialize(TestHarness.java:204)
	at org.apache.solr.util.TestHarness.<init>(TestHarness.java:140)
Caused by: java.util.concurrent.TimeoutException: Could not connect to ZooKeeper 127.0.0.1:20709/solr
within 5000 ms
	at org.apache.solr.common.cloud.ConnectionManager.waitForConnected(ConnectionManager.java:124)
	at org.apache.solr.common.cloud.SolrZkClient.<init>(SolrZkClient.java:121)
	at org.apache.solr.common.cloud.SolrZkClient.<init>(SolrZkClient.java:69)
	at org.apache.solr.cloud.ZkController.<init>(ZkController.java:104)
	at org.apache.solr.core.CoreContainer.initZooKeeper(CoreContainer.java:166)


FAILED:  junit.framework.TestSuite.org.apache.solr.servlet.SolrRequestParserTest

Error Message:
org.apache.solr.common.cloud.ZooKeeperException: 

Stack Trace:
java.lang.RuntimeException: org.apache.solr.common.cloud.ZooKeeperException: 
	at org.apache.solr.util.TestHarness.<init>(TestHarness.java:152)
	at org.apache.solr.util.TestHarness.<init>(TestHarness.java:135)
	at org.apache.solr.util.TestHarness.<init>(TestHarness.java:125)
	at org.apache.solr.SolrTestCaseJ4.initCore(SolrTestCaseJ4.java:263)
	at org.apache.solr.SolrTestCaseJ4.initCore(SolrTestCaseJ4.java:106)
	at org.apache.solr.SolrTestCaseJ4.initCore(SolrTestCaseJ4.java:95)
	at org.apache.solr.servlet.SolrRequestParserTest.beforeClass(SolrRequestParserTest.java:50)
Caused by: org.apache.solr.common.cloud.ZooKeeperException: 
	at org.apache.solr.core.CoreContainer.initZooKeeper(CoreContainer.java:185)
	at org.apache.solr.util.TestHarness$Initializer$1.<init>(TestHarness.java:209)
	at org.apache.solr.util.TestHarness$Initializer.initialize(TestHarness.java:204)
	at org.apache.solr.util.TestHarness.<init>(TestHarness.java:140)
Caused by: java.util.concurrent.TimeoutException: Could not connect to ZooKeeper 127.0.0.1:20709/solr
within 5000 ms
	at org.apache.solr.common.cloud.ConnectionManager.waitForConnected(ConnectionManager.java:124)
	at org.apache.solr.common.cloud.SolrZkClient.<init>(SolrZkClient.java:121)
	at org.apache.solr.common.cloud.SolrZkClient.<init>(SolrZkClient.java:69)
	at org.apache.solr.cloud.ZkController.<init>(ZkController.java:104)
	at org.apache.solr.core.CoreContainer.initZooKeeper(CoreContainer.java:166)


FAILED:  junit.framework.TestSuite.org.apache.solr.spelling.IndexBasedSpellCheckerTest

Error Message:
org.apache.solr.common.cloud.ZooKeeperException: 

Stack Trace:
java.lang.RuntimeException: org.apache.solr.common.cloud.ZooKeeperException: 
	at org.apache.solr.util.TestHarness.<init>(TestHarness.java:152)
	at org.apache.solr.util.TestHarness.<init>(TestHarness.java:135)
	at org.apache.solr.util.TestHarness.<init>(TestHarness.java:125)
	at org.apache.solr.SolrTestCaseJ4.initCore(SolrTestCaseJ4.java:263)
	at org.apache.solr.SolrTestCaseJ4.initCore(SolrTestCaseJ4.java:106)
	at org.apache.solr.SolrTestCaseJ4.initCore(SolrTestCaseJ4.java:95)
	at org.apache.solr.spelling.IndexBasedSpellCheckerTest.beforeClass(IndexBasedSpellCheckerTest.java:68)
Caused by: org.apache.solr.common.cloud.ZooKeeperException: 
	at org.apache.solr.core.CoreContainer.initZooKeeper(CoreContainer.java:185)
	at org.apache.solr.util.TestHarness$Initializer$1.<init>(TestHarness.java:209)
	at org.apache.solr.util.TestHarness$Initializer.initialize(TestHarness.java:204)
	at org.apache.solr.util.TestHarness.<init>(TestHarness.java:140)
Caused by: java.util.concurrent.TimeoutException: Could not connect to ZooKeeper 127.0.0.1:20709/solr
within 5000 ms
	at org.apache.solr.common.cloud.ConnectionManager.waitForConnected(ConnectionManager.java:124)
	at org.apache.solr.common.cloud.SolrZkClient.<init>(SolrZkClient.java:121)
	at org.apache.solr.common.cloud.SolrZkClient.<init>(SolrZkClient.java:69)
	at org.apache.solr.cloud.ZkController.<init>(ZkController.java:104)
	at org.apache.solr.core.CoreContainer.initZooKeeper(CoreContainer.java:166)


REGRESSION:  org.apache.solr.update.DirectUpdateHandlerOptimizeTest.testOptimize

Error Message:
org.apache.solr.common.cloud.ZooKeeperException: 

Stack Trace:
java.lang.RuntimeException: org.apache.solr.common.cloud.ZooKeeperException: 
	at org.apache.solr.util.TestHarness.<init>(TestHarness.java:152)
	at org.apache.solr.util.TestHarness.<init>(TestHarness.java:135)
	at org.apache.solr.util.TestHarness.<init>(TestHarness.java:125)
	at org.apache.solr.util.AbstractSolrTestCase.setUp(AbstractSolrTestCase.java:145)
	at org.apache.lucene.util.LuceneTestCaseRunner.runChild(LuceneTestCaseRunner.java:148)
	at org.apache.lucene.util.LuceneTestCaseRunner.runChild(LuceneTestCaseRunner.java:50)
Caused by: org.apache.solr.common.cloud.ZooKeeperException: 
	at org.apache.solr.core.CoreContainer.initZooKeeper(CoreContainer.java:185)
	at org.apache.solr.util.TestHarness$Initializer$1.<init>(TestHarness.java:209)
	at org.apache.solr.util.TestHarness$Initializer.initialize(TestHarness.java:204)
	at org.apache.solr.util.TestHarness.<init>(TestHarness.java:140)
Caused by: java.util.concurrent.TimeoutException: Could not connect to ZooKeeper 127.0.0.1:20709/solr
within 5000 ms
	at org.apache.solr.common.cloud.ConnectionManager.waitForConnected(ConnectionManager.java:124)
	at org.apache.solr.common.cloud.SolrZkClient.<init>(SolrZkClient.java:121)
	at org.apache.solr.common.cloud.SolrZkClient.<init>(SolrZkClient.java:69)
	at org.apache.solr.cloud.ZkController.<init>(ZkController.java:104)
	at org.apache.solr.core.CoreContainer.initZooKeeper(CoreContainer.java:166)


REGRESSION:  org.apache.solr.velocity.VelocityResponseWriterTest.testTemplateName

Error Message:
org.apache.solr.common.cloud.ZooKeeperException: 

Stack Trace:
java.lang.RuntimeException: org.apache.solr.common.cloud.ZooKeeperException: 
	at org.apache.solr.util.TestHarness.<init>(TestHarness.java:152)
	at org.apache.solr.util.TestHarness.<init>(TestHarness.java:135)
	at org.apache.solr.util.TestHarness.<init>(TestHarness.java:125)
	at org.apache.solr.util.AbstractSolrTestCase.setUp(AbstractSolrTestCase.java:145)
	at org.apache.lucene.util.LuceneTestCaseRunner.runChild(LuceneTestCaseRunner.java:148)
	at org.apache.lucene.util.LuceneTestCaseRunner.runChild(LuceneTestCaseRunner.java:50)
Caused by: org.apache.solr.common.cloud.ZooKeeperException: 
	at org.apache.solr.core.CoreContainer.initZooKeeper(CoreContainer.java:185)
	at org.apache.solr.util.TestHarness$Initializer$1.<init>(TestHarness.java:209)
	at org.apache.solr.util.TestHarness$Initializer.initialize(TestHarness.java:204)
	at org.apache.solr.util.TestHarness.<init>(TestHarness.java:140)
Caused by: java.util.concurrent.TimeoutException: Could not connect to ZooKeeper 127.0.0.1:20709/solr
within 5000 ms
	at org.apache.solr.common.cloud.ConnectionManager.waitForConnected(ConnectionManager.java:124)
	at org.apache.solr.common.cloud.SolrZkClient.<init>(SolrZkClient.java:121)
	at org.apache.solr.common.cloud.SolrZkClient.<init>(SolrZkClient.java:69)
	at org.apache.solr.cloud.ZkController.<init>(ZkController.java:104)
	at org.apache.solr.core.CoreContainer.initZooKeeper(CoreContainer.java:166)




Build Log (for compile errors):
[...truncated 9312 lines...]



---------------------------------------------------------------------
To unsubscribe, e-mail: dev-unsubscribe@lucene.apache.org
For additional commands, e-mail: dev-help@lucene.apache.org


Mime
View raw message