lucene-dev mailing list archives

Site index · List index
Message view « Date » · « Thread »
Top « Date » · « Thread »
From Apache Jenkins Server <jenk...@builds.apache.org>
Subject [JENKINS] Lucene-Solr-tests-only-trunk-java7 - Build # 260 - Failure
Date Wed, 17 Aug 2011 21:29:30 GMT
Build: https://builds.apache.org/job/Lucene-Solr-tests-only-trunk-java7/260/

3 tests failed.
REGRESSION:  org.apache.solr.update.AutoCommitTest.testSoftAndHardCommitMaxTime

Error Message:
expected:<2> but was:<3>

Stack Trace:
junit.framework.AssertionFailedError: expected:<2> but was:<3>
	at org.apache.lucene.util.LuceneTestCase$LuceneTestCaseRunner.runChild(LuceneTestCase.java:1526)
	at org.apache.lucene.util.LuceneTestCase$LuceneTestCaseRunner.runChild(LuceneTestCase.java:1428)
	at org.apache.solr.update.AutoCommitTest.testSoftAndHardCommitMaxTime(AutoCommitTest.java:438)


FAILED:  <init>.org.apache.solr.client.solrj.response.FacetFieldTest

Error Message:
org.apache.solr.client.solrj.response.FacetFieldTest

Stack Trace:
java.lang.ClassNotFoundException: org.apache.solr.client.solrj.response.FacetFieldTest
	at java.net.URLClassLoader$1.run(URLClassLoader.java:366)
	at java.net.URLClassLoader$1.run(URLClassLoader.java:355)
	at java.security.AccessController.doPrivileged(Native Method)
	at java.net.URLClassLoader.findClass(URLClassLoader.java:354)
	at java.lang.ClassLoader.loadClass(ClassLoader.java:423)
	at sun.misc.Launcher$AppClassLoader.loadClass(Launcher.java:308)
	at java.lang.ClassLoader.loadClass(ClassLoader.java:356)
	at java.lang.Class.forName0(Native Method)
	at java.lang.Class.forName(Class.java:186)


FAILED:  <init>.org.apache.solr.common.util.FileUtilsTest

Error Message:
org.apache.solr.common.util.FileUtilsTest

Stack Trace:
java.lang.ClassNotFoundException: org.apache.solr.common.util.FileUtilsTest
	at java.net.URLClassLoader$1.run(URLClassLoader.java:366)
	at java.net.URLClassLoader$1.run(URLClassLoader.java:355)
	at java.security.AccessController.doPrivileged(Native Method)
	at java.net.URLClassLoader.findClass(URLClassLoader.java:354)
	at java.lang.ClassLoader.loadClass(ClassLoader.java:423)
	at sun.misc.Launcher$AppClassLoader.loadClass(Launcher.java:308)
	at java.lang.ClassLoader.loadClass(ClassLoader.java:356)
	at java.lang.Class.forName0(Native Method)
	at java.lang.Class.forName(Class.java:186)




Build Log (for compile errors):
[...truncated 11145 lines...]



---------------------------------------------------------------------
To unsubscribe, e-mail: dev-unsubscribe@lucene.apache.org
For additional commands, e-mail: dev-help@lucene.apache.org


Mime
View raw message