lucene-dev mailing list archives

Site index · List index
Message view « Date » · « Thread »
Top « Date » · « Thread »
From Apache Jenkins Server <jenk...@builds.apache.org>
Subject [JENKINS] Lucene-Solr-tests-only-trunk - Build # 10378 - Failure
Date Tue, 30 Aug 2011 02:01:03 GMT
Build: https://builds.apache.org/job/Lucene-Solr-tests-only-trunk/10378/

1 tests failed.
REGRESSION:  org.apache.lucene.index.TestIndexWriter.testThreadInterruptDeadlock

Error Message:
java.lang.AssertionError: Some threads threw uncaught exceptions!

Stack Trace:
java.lang.RuntimeException: java.lang.AssertionError: Some threads threw uncaught exceptions!
	at org.apache.lucene.util.LuceneTestCase.tearDown(LuceneTestCase.java:689)
	at org.apache.lucene.util.LuceneTestCaseRunner.runChild(LuceneTestCaseRunner.java:148)
	at org.apache.lucene.util.LuceneTestCaseRunner.runChild(LuceneTestCaseRunner.java:50)
	at org.apache.lucene.util.LuceneTestCase.checkUncaughtExceptionsAfter(LuceneTestCase.java:717)
	at org.apache.lucene.util.LuceneTestCase.tearDown(LuceneTestCase.java:661)




Build Log (for compile errors):
[...truncated 1261 lines...]



---------------------------------------------------------------------
To unsubscribe, e-mail: dev-unsubscribe@lucene.apache.org
For additional commands, e-mail: dev-help@lucene.apache.org


Mime
View raw message