lucene-dev mailing list archives

Site index · List index
Message view « Date » · « Thread »
Top « Date » · « Thread »
From Apache Jenkins Server <jenk...@builds.apache.org>
Subject [JENKINS] Lucene-Solr-tests-only-trunk-java7 - Build # 3 - Still Failing
Date Sat, 23 Jul 2011 12:27:16 GMT
Build: https://builds.apache.org/job/Lucene-Solr-tests-only-trunk-java7/3/

7 tests failed.
FAILED:  org.apache.lucene.analysis.icu.TestICUTransformFilter.testOptimizerSurrogate

Error Message:
null

Stack Trace:
java.lang.ExceptionInInitializerError
	at com.ibm.icu.impl.ICUResourceBundle.instantiateBundle(ICUResourceBundle.java:824)
	at com.ibm.icu.impl.ICUResourceBundle.getBundleInstance(ICUResourceBundle.java:815)
	at com.ibm.icu.util.UResourceBundle.getRootType(UResourceBundle.java:489)
	at com.ibm.icu.util.UResourceBundle.instantiateBundle(UResourceBundle.java:536)
	at com.ibm.icu.util.UResourceBundle.getBundleInstance(UResourceBundle.java:144)
	at com.ibm.icu.util.UResourceBundle.getBundleInstance(UResourceBundle.java:107)
	at com.ibm.icu.text.Transliterator.<clinit>(Transliterator.java:1879)
	at org.apache.lucene.analysis.icu.TestICUTransformFilter.testOptimizerSurrogate(TestICUTransformFilter.java:81)
	at org.apache.lucene.util.LuceneTestCase$LuceneTestCaseRunner.runChild(LuceneTestCase.java:1486)
	at org.apache.lucene.util.LuceneTestCase$LuceneTestCaseRunner.runChild(LuceneTestCase.java:1404)
Caused by: java.lang.NullPointerException
	at com.ibm.icu.impl.ICUResourceBundle.instantiateBundle(ICUResourceBundle.java:840)
	at com.ibm.icu.impl.ICUResourceBundle.getBundleInstance(ICUResourceBundle.java:815)
	at com.ibm.icu.util.UResourceBundle.getRootType(UResourceBundle.java:489)
	at com.ibm.icu.util.UResourceBundle.instantiateBundle(UResourceBundle.java:536)
	at com.ibm.icu.util.UResourceBundle.getBundleInstance(UResourceBundle.java:144)
	at com.ibm.icu.util.UResourceBundle.getBundleInstance(UResourceBundle.java:124)
	at com.ibm.icu.util.ULocale.bcp47ToLDMLKey(ULocale.java:3410)
	at com.ibm.icu.util.ULocale.access$400(ULocale.java:107)
	at com.ibm.icu.util.ULocale$JDKLocaleMapper.toULocale7(ULocale.java:3691)
	at com.ibm.icu.util.ULocale$JDKLocaleMapper.toULocale(ULocale.java:3566)
	at com.ibm.icu.util.ULocale.forLocale(ULocale.java:399)
	at com.ibm.icu.util.ULocale.<init>(ULocale.java:380)
	at com.ibm.icu.util.ULocale.<clinit>(ULocale.java:516)


FAILED:  org.apache.lucene.analysis.icu.TestICUTransformFilter.testCustomFunctionality

Error Message:
Could not initialize class com.ibm.icu.text.Transliterator

Stack Trace:
java.lang.NoClassDefFoundError: Could not initialize class com.ibm.icu.text.Transliterator
	at org.apache.lucene.analysis.icu.TestICUTransformFilter.testCustomFunctionality(TestICUTransformFilter.java:58)
	at org.apache.lucene.util.LuceneTestCase$LuceneTestCaseRunner.runChild(LuceneTestCase.java:1486)
	at org.apache.lucene.util.LuceneTestCase$LuceneTestCaseRunner.runChild(LuceneTestCase.java:1404)


FAILED:  org.apache.lucene.analysis.icu.TestICUTransformFilter.testCustomFunctionality2

Error Message:
Could not initialize class com.ibm.icu.text.Transliterator

Stack Trace:
java.lang.NoClassDefFoundError: Could not initialize class com.ibm.icu.text.Transliterator
	at org.apache.lucene.analysis.icu.TestICUTransformFilter.testCustomFunctionality2(TestICUTransformFilter.java:63)
	at org.apache.lucene.util.LuceneTestCase$LuceneTestCaseRunner.runChild(LuceneTestCase.java:1486)
	at org.apache.lucene.util.LuceneTestCase$LuceneTestCaseRunner.runChild(LuceneTestCase.java:1404)


FAILED:  org.apache.lucene.analysis.icu.TestICUTransformFilter.testBasicFunctionality

Error Message:
Could not initialize class com.ibm.icu.text.Transliterator

Stack Trace:
java.lang.NoClassDefFoundError: Could not initialize class com.ibm.icu.text.Transliterator
	at org.apache.lucene.analysis.icu.TestICUTransformFilter.testBasicFunctionality(TestICUTransformFilter.java:42)
	at org.apache.lucene.util.LuceneTestCase$LuceneTestCaseRunner.runChild(LuceneTestCase.java:1486)
	at org.apache.lucene.util.LuceneTestCase$LuceneTestCaseRunner.runChild(LuceneTestCase.java:1404)


FAILED:  org.apache.lucene.analysis.icu.TestICUTransformFilter.testOptimizer2

Error Message:
Could not initialize class com.ibm.icu.text.Transliterator

Stack Trace:
java.lang.NoClassDefFoundError: Could not initialize class com.ibm.icu.text.Transliterator
	at org.apache.lucene.analysis.icu.TestICUTransformFilter.testOptimizer2(TestICUTransformFilter.java:75)
	at org.apache.lucene.util.LuceneTestCase$LuceneTestCaseRunner.runChild(LuceneTestCase.java:1486)
	at org.apache.lucene.util.LuceneTestCase$LuceneTestCaseRunner.runChild(LuceneTestCase.java:1404)


FAILED:  org.apache.lucene.analysis.icu.TestICUTransformFilter.testOptimizer

Error Message:
Could not initialize class com.ibm.icu.text.Transliterator

Stack Trace:
java.lang.NoClassDefFoundError: Could not initialize class com.ibm.icu.text.Transliterator
	at org.apache.lucene.analysis.icu.TestICUTransformFilter.testOptimizer(TestICUTransformFilter.java:68)
	at org.apache.lucene.util.LuceneTestCase$LuceneTestCaseRunner.runChild(LuceneTestCase.java:1486)
	at org.apache.lucene.util.LuceneTestCase$LuceneTestCaseRunner.runChild(LuceneTestCase.java:1404)


FAILED:  org.apache.lucene.analysis.icu.TestICUTransformFilter.testRandomStrings

Error Message:
Could not initialize class com.ibm.icu.text.Transliterator

Stack Trace:
java.lang.NoClassDefFoundError: Could not initialize class com.ibm.icu.text.Transliterator
	at org.apache.lucene.analysis.icu.TestICUTransformFilter.testRandomStrings(TestICUTransformFilter.java:94)
	at org.apache.lucene.util.LuceneTestCase$LuceneTestCaseRunner.runChild(LuceneTestCase.java:1486)
	at org.apache.lucene.util.LuceneTestCase$LuceneTestCaseRunner.runChild(LuceneTestCase.java:1404)




Build Log (for compile errors):
[...truncated 5372 lines...]



---------------------------------------------------------------------
To unsubscribe, e-mail: dev-unsubscribe@lucene.apache.org
For additional commands, e-mail: dev-help@lucene.apache.org


Mime
View raw message