lucene-dev mailing list archives

Site index · List index
Message view « Date » · « Thread »
Top « Date » · « Thread »
From Apache Jenkins Server <jenk...@builds.apache.org>
Subject [JENKINS] Solr-3.x - Build # 414 - Failure
Date Fri, 22 Jul 2011 18:20:14 GMT
Build: https://builds.apache.org/job/Solr-3.x/414/

15 tests failed.
FAILED:  junit.framework.TestSuite.org.apache.solr.client.solrj.SolrExampleBinaryTest

Error Message:
null

Stack Trace:
java.lang.ExceptionInInitializerError
	at org.apache.solr.client.solrj.SolrExampleBinaryTest.beforeTest(SolrExampleBinaryTest.java:36)
Caused by: java.lang.RuntimeException: Cannot find resource: solr/conf
	at org.apache.solr.SolrTestCaseJ4.getFile(SolrTestCaseJ4.java:1101)
	at org.apache.solr.util.ExternalPaths.determineSourceHome(ExternalPaths.java:40)
	at org.apache.solr.util.ExternalPaths.<clinit>(ExternalPaths.java:30)


FAILED:  junit.framework.TestSuite.org.apache.solr.client.solrj.TestBatchUpdate

Error Message:
Could not initialize class org.apache.solr.util.ExternalPaths

Stack Trace:
java.lang.NoClassDefFoundError: Could not initialize class org.apache.solr.util.ExternalPaths
	at org.apache.solr.client.solrj.TestBatchUpdate.beforeTest(TestBatchUpdate.java:43)


REGRESSION:  org.apache.solr.client.solrj.embedded.JettyWebappTest.testJSP

Error Message:
null

Stack Trace:
java.lang.ExceptionInInitializerError
	at org.apache.solr.client.solrj.embedded.JettyWebappTest.setUp(JettyWebappTest.java:50)
	at org.apache.lucene.util.LuceneTestCase$LuceneTestCaseRunner.runChild(LuceneTestCase.java:1299)
	at org.apache.lucene.util.LuceneTestCase$LuceneTestCaseRunner.runChild(LuceneTestCase.java:1217)
Caused by: java.lang.RuntimeException: Cannot find resource: solr/conf
	at org.apache.solr.SolrTestCaseJ4.getFile(SolrTestCaseJ4.java:1101)
	at org.apache.solr.util.ExternalPaths.determineSourceHome(ExternalPaths.java:40)
	at org.apache.solr.util.ExternalPaths.<clinit>(ExternalPaths.java:30)


FAILED:  junit.framework.TestSuite.org.apache.solr.client.solrj.embedded.LargeVolumeBinaryJettyTest

Error Message:
Could not initialize class org.apache.solr.util.ExternalPaths

Stack Trace:
java.lang.NoClassDefFoundError: Could not initialize class org.apache.solr.util.ExternalPaths
	at org.apache.solr.client.solrj.embedded.LargeVolumeBinaryJettyTest.beforeTest(LargeVolumeBinaryJettyTest.java:30)


FAILED:  junit.framework.TestSuite.org.apache.solr.client.solrj.embedded.LargeVolumeEmbeddedTest

Error Message:
null

Stack Trace:
java.lang.ExceptionInInitializerError
	at org.apache.solr.client.solrj.embedded.LargeVolumeEmbeddedTest.beforeTest(LargeVolumeEmbeddedTest.java:27)
Caused by: java.lang.RuntimeException: Cannot find resource: solr/conf
	at org.apache.solr.SolrTestCaseJ4.getFile(SolrTestCaseJ4.java:1101)
	at org.apache.solr.util.ExternalPaths.determineSourceHome(ExternalPaths.java:40)
	at org.apache.solr.util.ExternalPaths.<clinit>(ExternalPaths.java:30)


FAILED:  junit.framework.TestSuite.org.apache.solr.client.solrj.embedded.LargeVolumeJettyTest

Error Message:
null

Stack Trace:
java.lang.ExceptionInInitializerError
	at org.apache.solr.client.solrj.embedded.LargeVolumeJettyTest.beforeTest(LargeVolumeJettyTest.java:27)
Caused by: java.lang.RuntimeException: Cannot find resource: solr/conf
	at org.apache.solr.SolrTestCaseJ4.getFile(SolrTestCaseJ4.java:1101)
	at org.apache.solr.util.ExternalPaths.determineSourceHome(ExternalPaths.java:40)
	at org.apache.solr.util.ExternalPaths.<clinit>(ExternalPaths.java:30)


REGRESSION:  org.apache.solr.client.solrj.embedded.MergeIndexesEmbeddedTest.testMergeIndexesByDirName

Error Message:
null

Stack Trace:
java.lang.ExceptionInInitializerError
	at org.apache.solr.client.solrj.MergeIndexesExampleTestBase.getSolrHome(MergeIndexesExampleTestBase.java:44)
	at org.apache.solr.client.solrj.MergeIndexesExampleTestBase.getSolrConfigFile(MergeIndexesExampleTestBase.java:54)
	at org.apache.solr.util.AbstractSolrTestCase.setUp(AbstractSolrTestCase.java:137)
	at org.apache.solr.client.solrj.SolrExampleTestBase.setUp(SolrExampleTestBase.java:43)
	at org.apache.solr.client.solrj.MergeIndexesExampleTestBase.setUp(MergeIndexesExampleTestBase.java:59)
	at org.apache.solr.client.solrj.embedded.MergeIndexesEmbeddedTest.setUp(MergeIndexesEmbeddedTest.java:38)
	at org.apache.lucene.util.LuceneTestCase$LuceneTestCaseRunner.runChild(LuceneTestCase.java:1299)
	at org.apache.lucene.util.LuceneTestCase$LuceneTestCaseRunner.runChild(LuceneTestCase.java:1217)
Caused by: java.lang.RuntimeException: Cannot find resource: solr/conf
	at org.apache.solr.SolrTestCaseJ4.getFile(SolrTestCaseJ4.java:1101)
	at org.apache.solr.util.ExternalPaths.determineSourceHome(ExternalPaths.java:40)
	at org.apache.solr.util.ExternalPaths.<clinit>(ExternalPaths.java:30)


REGRESSION:  org.apache.solr.client.solrj.embedded.MergeIndexesEmbeddedTest.testMergeIndexesByCoreName

Error Message:
Could not initialize class org.apache.solr.util.ExternalPaths

Stack Trace:
java.lang.NoClassDefFoundError: Could not initialize class org.apache.solr.util.ExternalPaths
	at org.apache.solr.client.solrj.MergeIndexesExampleTestBase.getSolrHome(MergeIndexesExampleTestBase.java:44)
	at org.apache.solr.client.solrj.MergeIndexesExampleTestBase.getSolrConfigFile(MergeIndexesExampleTestBase.java:54)
	at org.apache.solr.util.AbstractSolrTestCase.setUp(AbstractSolrTestCase.java:137)
	at org.apache.solr.client.solrj.SolrExampleTestBase.setUp(SolrExampleTestBase.java:43)
	at org.apache.solr.client.solrj.MergeIndexesExampleTestBase.setUp(MergeIndexesExampleTestBase.java:59)
	at org.apache.solr.client.solrj.embedded.MergeIndexesEmbeddedTest.setUp(MergeIndexesEmbeddedTest.java:38)
	at org.apache.lucene.util.LuceneTestCase$LuceneTestCaseRunner.runChild(LuceneTestCase.java:1299)
	at org.apache.lucene.util.LuceneTestCase$LuceneTestCaseRunner.runChild(LuceneTestCase.java:1217)


REGRESSION:  org.apache.solr.client.solrj.embedded.MultiCoreEmbeddedTest.testMultiCore

Error Message:
null

Stack Trace:
java.lang.ExceptionInInitializerError
	at org.apache.solr.client.solrj.MultiCoreExampleTestBase.getSolrHome(MultiCoreExampleTestBase.java:43)
	at org.apache.solr.client.solrj.MultiCoreExampleTestBase.getSolrConfigFile(MultiCoreExampleTestBase.java:46)
	at org.apache.solr.util.AbstractSolrTestCase.setUp(AbstractSolrTestCase.java:137)
	at org.apache.solr.client.solrj.SolrExampleTestBase.setUp(SolrExampleTestBase.java:43)
	at org.apache.solr.client.solrj.MultiCoreExampleTestBase.setUp(MultiCoreExampleTestBase.java:49)
	at org.apache.solr.client.solrj.embedded.MultiCoreEmbeddedTest.setUp(MultiCoreEmbeddedTest.java:37)
	at org.apache.lucene.util.LuceneTestCase$LuceneTestCaseRunner.runChild(LuceneTestCase.java:1299)
	at org.apache.lucene.util.LuceneTestCase$LuceneTestCaseRunner.runChild(LuceneTestCase.java:1217)
Caused by: java.lang.RuntimeException: Cannot find resource: solr/conf
	at org.apache.solr.SolrTestCaseJ4.getFile(SolrTestCaseJ4.java:1101)
	at org.apache.solr.util.ExternalPaths.determineSourceHome(ExternalPaths.java:40)
	at org.apache.solr.util.ExternalPaths.<clinit>(ExternalPaths.java:30)


REGRESSION:  org.apache.solr.client.solrj.embedded.MultiCoreExampleJettyTest.testMultiCore

Error Message:
Could not initialize class org.apache.solr.util.ExternalPaths

Stack Trace:
java.lang.NoClassDefFoundError: Could not initialize class org.apache.solr.util.ExternalPaths
	at org.apache.solr.client.solrj.MultiCoreExampleTestBase.getSolrHome(MultiCoreExampleTestBase.java:43)
	at org.apache.solr.client.solrj.MultiCoreExampleTestBase.getSolrConfigFile(MultiCoreExampleTestBase.java:46)
	at org.apache.solr.util.AbstractSolrTestCase.setUp(AbstractSolrTestCase.java:137)
	at org.apache.solr.client.solrj.SolrExampleTestBase.setUp(SolrExampleTestBase.java:43)
	at org.apache.solr.client.solrj.MultiCoreExampleTestBase.setUp(MultiCoreExampleTestBase.java:49)
	at org.apache.solr.client.solrj.embedded.MultiCoreExampleJettyTest.setUp(MultiCoreExampleJettyTest.java:43)
	at org.apache.lucene.util.LuceneTestCase$LuceneTestCaseRunner.runChild(LuceneTestCase.java:1299)
	at org.apache.lucene.util.LuceneTestCase$LuceneTestCaseRunner.runChild(LuceneTestCase.java:1217)


FAILED:  junit.framework.TestSuite.org.apache.solr.client.solrj.embedded.SolrExampleEmbeddedTest

Error Message:
null

Stack Trace:
java.lang.ExceptionInInitializerError
	at org.apache.solr.client.solrj.embedded.SolrExampleEmbeddedTest.beforeTest(SolrExampleEmbeddedTest.java:34)
Caused by: java.lang.RuntimeException: Cannot find resource: solr/conf
	at org.apache.solr.SolrTestCaseJ4.getFile(SolrTestCaseJ4.java:1101)
	at org.apache.solr.util.ExternalPaths.determineSourceHome(ExternalPaths.java:40)
	at org.apache.solr.util.ExternalPaths.<clinit>(ExternalPaths.java:30)


FAILED:  junit.framework.TestSuite.org.apache.solr.client.solrj.embedded.SolrExampleJettyTest

Error Message:
Could not initialize class org.apache.solr.util.ExternalPaths

Stack Trace:
java.lang.NoClassDefFoundError: Could not initialize class org.apache.solr.util.ExternalPaths
	at org.apache.solr.client.solrj.embedded.SolrExampleJettyTest.beforeTest(SolrExampleJettyTest.java:37)


FAILED:  junit.framework.TestSuite.org.apache.solr.client.solrj.embedded.SolrExampleStreamingTest

Error Message:
Could not initialize class org.apache.solr.util.ExternalPaths

Stack Trace:
java.lang.NoClassDefFoundError: Could not initialize class org.apache.solr.util.ExternalPaths
	at org.apache.solr.client.solrj.embedded.SolrExampleStreamingTest.beforeTest(SolrExampleStreamingTest.java:36)


FAILED:  junit.framework.TestSuite.org.apache.solr.client.solrj.response.TermsResponseTest

Error Message:
Could not initialize class org.apache.solr.util.ExternalPaths

Stack Trace:
java.lang.NoClassDefFoundError: Could not initialize class org.apache.solr.util.ExternalPaths
	at org.apache.solr.client.solrj.response.TermsResponseTest.beforeTest(TermsResponseTest.java:38)


FAILED:  junit.framework.TestSuite.org.apache.solr.client.solrj.response.TestSpellCheckResponse

Error Message:
Could not initialize class org.apache.solr.util.ExternalPaths

Stack Trace:
java.lang.NoClassDefFoundError: Could not initialize class org.apache.solr.util.ExternalPaths
	at org.apache.solr.client.solrj.response.TestSpellCheckResponse.beforeTest(TestSpellCheckResponse.java:44)




Build Log (for compile errors):
[...truncated 20380 lines...]



---------------------------------------------------------------------
To unsubscribe, e-mail: dev-unsubscribe@lucene.apache.org
For additional commands, e-mail: dev-help@lucene.apache.org


Mime
View raw message