lucene-dev mailing list archives

Site index · List index
Message view « Date » · « Thread »
Top « Date » · « Thread »
From Apache Jenkins Server <jenk...@builds.apache.org>
Subject [JENKINS] Lucene-Solr-tests-only-flexscoring-branch - Build # 102 - Failure
Date Wed, 06 Jul 2011 12:33:01 GMT
Build: https://builds.apache.org/job/Lucene-Solr-tests-only-flexscoring-branch/102/

134 tests failed.
REGRESSION:  org.apache.lucene.index.TestIndexReaderReopen.testThreadSafety

Error Message:
Error occurred in thread Thread-73: Lock obtain timed out: org.apache.lucene.store.MockLockFactoryWrapper$MockLock@725857cc

Stack Trace:
junit.framework.AssertionFailedError: Error occurred in thread Thread-73:
Lock obtain timed out: org.apache.lucene.store.MockLockFactoryWrapper$MockLock@725857cc
	at org.apache.lucene.util.LuceneTestCase$LuceneTestCaseRunner.runChild(LuceneTestCase.java:1413)
	at org.apache.lucene.util.LuceneTestCase$LuceneTestCaseRunner.runChild(LuceneTestCase.java:1331)
Lock obtain timed out: org.apache.lucene.store.MockLockFactoryWrapper$MockLock@725857cc
	at org.apache.lucene.index.TestIndexReaderReopen.testThreadSafety(TestIndexReaderReopen.java:822)


REGRESSION:  org.apache.lucene.index.TestIndexWriterMergePolicy.testNoOverMerge

Error Message:
directory '/usr/home/hudson/hudson-slave/workspace/Lucene-Solr-tests-only-flexscoring-branch/checkout/lucene/build/test/8/test5070850714tmp' exists and is a directory, but cannot be listed: list() returned null

Stack Trace:
java.io.IOException: directory '/usr/home/hudson/hudson-slave/workspace/Lucene-Solr-tests-only-flexscoring-branch/checkout/lucene/build/test/8/test5070850714tmp' exists and is a directory, but cannot be listed: list() returned null
	at org.apache.lucene.store.FSDirectory.listAll(FSDirectory.java:228)
	at org.apache.lucene.store.FSDirectory.listAll(FSDirectory.java:239)
	at org.apache.lucene.store.MockDirectoryWrapper.listAll(MockDirectoryWrapper.java:588)
	at org.apache.lucene.index.IndexFileDeleter.refresh(IndexFileDeleter.java:350)
	at org.apache.lucene.index.DocumentsWriterPerThread.flush(DocumentsWriterPerThread.java:497)
	at org.apache.lucene.index.DocumentsWriter.doFlush(DocumentsWriter.java:421)
	at org.apache.lucene.index.DocumentsWriter.postUpdate(DocumentsWriter.java:313)
	at org.apache.lucene.index.DocumentsWriter.updateDocument(DocumentsWriter.java:385)
	at org.apache.lucene.index.IndexWriter.updateDocument(IndexWriter.java:1474)
	at org.apache.lucene.index.IndexWriter.addDocument(IndexWriter.java:1234)
	at org.apache.lucene.index.IndexWriter.addDocument(IndexWriter.java:1215)
	at org.apache.lucene.index.TestIndexWriterMergePolicy.addDoc(TestIndexWriterMergePolicy.java:224)
	at org.apache.lucene.index.TestIndexWriterMergePolicy.testNoOverMerge(TestIndexWriterMergePolicy.java:59)
	at org.apache.lucene.util.LuceneTestCase$LuceneTestCaseRunner.runChild(LuceneTestCase.java:1413)
	at org.apache.lucene.util.LuceneTestCase$LuceneTestCaseRunner.runChild(LuceneTestCase.java:1331)


REGRESSION:  org.apache.lucene.index.TestIndexWriterMerging.testExpungeDeletes

Error Message:
/usr/home/hudson/hudson-slave/workspace/Lucene-Solr-tests-only-flexscoring-branch/checkout/lucene/build/test/8/test5070850715tmp/_2.fdx (Too many open files in system)

Stack Trace:
java.io.FileNotFoundException: /usr/home/hudson/hudson-slave/workspace/Lucene-Solr-tests-only-flexscoring-branch/checkout/lucene/build/test/8/test5070850715tmp/_2.fdx (Too many open files in system)
	at java.io.RandomAccessFile.open(Native Method)
	at java.io.RandomAccessFile.<init>(RandomAccessFile.java:233)
	at org.apache.lucene.store.SimpleFSDirectory$SimpleFSIndexInput$Descriptor.<init>(SimpleFSDirectory.java:69)
	at org.apache.lucene.store.SimpleFSDirectory$SimpleFSIndexInput.<init>(SimpleFSDirectory.java:90)
	at org.apache.lucene.store.SimpleFSDirectory.openInput(SimpleFSDirectory.java:56)
	at org.apache.lucene.store.FSDirectory.openInput(FSDirectory.java:326)
	at org.apache.lucene.store.MockDirectoryWrapper.openInput(MockDirectoryWrapper.java:415)
	at org.apache.lucene.store.Directory.openInput(Directory.java:118)
	at org.apache.lucene.index.FieldsReader.<init>(FieldsReader.java:124)
	at org.apache.lucene.index.SegmentCoreReaders.openDocStores(SegmentCoreReaders.java:188)
	at org.apache.lucene.index.SegmentReader.get(SegmentReader.java:118)
	at org.apache.lucene.index.SegmentReader.get(SegmentReader.java:93)
	at org.apache.lucene.index.DirectoryReader.<init>(DirectoryReader.java:124)
	at org.apache.lucene.index.DirectoryReader$1.doBody(DirectoryReader.java:90)
	at org.apache.lucene.index.SegmentInfos$FindSegmentsFile.run(SegmentInfos.java:698)
	at org.apache.lucene.index.DirectoryReader.open(DirectoryReader.java:85)
	at org.apache.lucene.index.IndexReader.open(IndexReader.java:505)
	at org.apache.lucene.index.IndexReader.open(IndexReader.java:298)
	at org.apache.lucene.index.TestIndexWriterMerging.testExpungeDeletes(TestIndexWriterMerging.java:143)
	at org.apache.lucene.util.LuceneTestCase$LuceneTestCaseRunner.runChild(LuceneTestCase.java:1413)
	at org.apache.lucene.util.LuceneTestCase$LuceneTestCaseRunner.runChild(LuceneTestCase.java:1331)


REGRESSION:  org.apache.lucene.index.TestIndexWriterOnJRECrash.testNRTThreads

Error Message:
org/apache/lucene/util/LuceneTestCase$TwoLongs

Stack Trace:
java.lang.NoClassDefFoundError: org/apache/lucene/util/LuceneTestCase$TwoLongs
	at org.apache.lucene.util.LuceneTestCase.reportAdditionalFailureInfo(LuceneTestCase.java:1295)
	at org.apache.lucene.util.LuceneTestCase$1.failed(LuceneTestCase.java:515)
	at org.apache.lucene.util.LuceneTestCase$LuceneTestCaseRunner.runChild(LuceneTestCase.java:1413)
	at org.apache.lucene.util.LuceneTestCase$LuceneTestCaseRunner.runChild(LuceneTestCase.java:1331)
Caused by: java.lang.ClassNotFoundException: org.apache.lucene.util.LuceneTestCase$TwoLongs
	at java.net.URLClassLoader$1.run(URLClassLoader.java:214)
	at java.security.AccessController.doPrivileged(Native Method)
	at java.net.URLClassLoader.findClass(URLClassLoader.java:205)
	at java.lang.ClassLoader.loadClass(ClassLoader.java:321)
	at sun.misc.Launcher$AppClassLoader.loadClass(Launcher.java:294)
	at java.lang.ClassLoader.loadClass(ClassLoader.java:266)
Caused by: java.io.FileNotFoundException: /usr/home/hudson/hudson-slave/workspace/Lucene-Solr-tests-only-flexscoring-branch/checkout/lucene/build/classes/test-framework/org/apache/lucene/util/LuceneTestCase$TwoLongs.class (Too many open files in system)
	at java.io.FileInputStream.open(Native Method)
	at java.io.FileInputStream.<init>(FileInputStream.java:137)
	at sun.misc.URLClassPath$FileLoader$1.getInputStream(URLClassPath.java:1005)
	at sun.misc.Resource.cachedInputStream(Resource.java:77)
	at sun.misc.Resource.getByteBuffer(Resource.java:160)
	at java.net.URLClassLoader.defineClass(URLClassLoader.java:266)
	at java.net.URLClassLoader.access$000(URLClassLoader.java:73)
	at java.net.URLClassLoader$1.run(URLClassLoader.java:212)


REGRESSION:  org.apache.lucene.index.TestStressIndexing2.testMultiConfig

Error Message:
Some threads threw uncaught exceptions!

Stack Trace:
junit.framework.AssertionFailedError: Some threads threw uncaught exceptions!
	at org.apache.lucene.util.LuceneTestCase$LuceneTestCaseRunner.runChild(LuceneTestCase.java:1413)
	at org.apache.lucene.util.LuceneTestCase$LuceneTestCaseRunner.runChild(LuceneTestCase.java:1331)
	at org.apache.lucene.util.LuceneTestCase.tearDown(LuceneTestCase.java:604)


REGRESSION:  org.apache.lucene.index.values.TestDocValues.testInts

Error Message:
java.io.IOException: Too many open files in system

Stack Trace:
java.lang.RuntimeException: java.io.IOException: Too many open files in system
	at org.apache.lucene.util.LuceneTestCase.newDirectoryImpl(LuceneTestCase.java:1219)
	at org.apache.lucene.util.LuceneTestCase.newDirectory(LuceneTestCase.java:991)
	at org.apache.lucene.util.LuceneTestCase.newDirectory(LuceneTestCase.java:983)
	at org.apache.lucene.index.values.TestDocValues.testInts(TestDocValues.java:186)
	at org.apache.lucene.util.LuceneTestCase$LuceneTestCaseRunner.runChild(LuceneTestCase.java:1413)
	at org.apache.lucene.util.LuceneTestCase$LuceneTestCaseRunner.runChild(LuceneTestCase.java:1331)
Caused by: java.io.IOException: Too many open files in system
	at java.io.UnixFileSystem.createFileExclusively(Native Method)
	at java.io.File.createNewFile(File.java:900)
	at org.apache.lucene.util._TestUtil.createTempFile(_TestUtil.java:442)
	at org.apache.lucene.util.LuceneTestCase.newDirectoryImpl(LuceneTestCase.java:1209)


REGRESSION:  org.apache.lucene.search.TestBooleanOr.testFlat

Error Message:
CheckIndex failed

Stack Trace:
java.lang.RuntimeException: CheckIndex failed
	at org.apache.lucene.util._TestUtil.checkIndex(_TestUtil.java:161)
	at org.apache.lucene.util._TestUtil.checkIndex(_TestUtil.java:147)
	at org.apache.lucene.store.MockDirectoryWrapper.close(MockDirectoryWrapper.java:477)
	at org.apache.lucene.search.TestBooleanOr.tearDown(TestBooleanOr.java:165)
	at org.apache.lucene.util.LuceneTestCase$LuceneTestCaseRunner.runChild(LuceneTestCase.java:1413)
	at org.apache.lucene.util.LuceneTestCase$LuceneTestCaseRunner.runChild(LuceneTestCase.java:1331)


REGRESSION:  org.apache.lucene.search.TestBooleanOr.testParenthesisMust

Error Message:
null

Stack Trace:
java.lang.NullPointerException
	at org.apache.lucene.search.TestBooleanOr.tearDown(TestBooleanOr.java:163)
	at org.apache.lucene.util.LuceneTestCase$LuceneTestCaseRunner.runChild(LuceneTestCase.java:1413)
	at org.apache.lucene.util.LuceneTestCase$LuceneTestCaseRunner.runChild(LuceneTestCase.java:1331)


REGRESSION:  org.apache.lucene.search.TestBooleanOr.testParenthesisMust2

Error Message:
null

Stack Trace:
java.lang.NullPointerException
	at org.apache.lucene.search.TestBooleanOr.tearDown(TestBooleanOr.java:163)
	at org.apache.lucene.util.LuceneTestCase$LuceneTestCaseRunner.runChild(LuceneTestCase.java:1413)
	at org.apache.lucene.util.LuceneTestCase$LuceneTestCaseRunner.runChild(LuceneTestCase.java:1331)


REGRESSION:  org.apache.lucene.search.TestBooleanOr.testParenthesisShould

Error Message:
null

Stack Trace:
java.lang.NullPointerException
	at org.apache.lucene.search.TestBooleanOr.tearDown(TestBooleanOr.java:163)
	at org.apache.lucene.util.LuceneTestCase$LuceneTestCaseRunner.runChild(LuceneTestCase.java:1413)
	at org.apache.lucene.util.LuceneTestCase$LuceneTestCaseRunner.runChild(LuceneTestCase.java:1331)


FAILED:  junit.framework.TestSuite.org.apache.lucene.search.TestBooleanOr

Error Message:
ensure your setUp() calls super.setUp() and your tearDown() calls super.tearDown()!!!

Stack Trace:
junit.framework.AssertionFailedError: ensure your setUp() calls super.setUp() and your tearDown() calls super.tearDown()!!!
	at org.apache.lucene.util.LuceneTestCase.afterClassLuceneTestCaseJ4(LuceneTestCase.java:402)


REGRESSION:  org.apache.lucene.search.TestBooleanQuery.testNullOrSubScorer

Error Message:
CheckIndex failed

Stack Trace:
java.lang.RuntimeException: CheckIndex failed
	at org.apache.lucene.util._TestUtil.checkIndex(_TestUtil.java:161)
	at org.apache.lucene.util._TestUtil.checkIndex(_TestUtil.java:147)
	at org.apache.lucene.store.MockDirectoryWrapper.close(MockDirectoryWrapper.java:477)
	at org.apache.lucene.search.TestBooleanQuery.testNullOrSubScorer(TestBooleanQuery.java:126)
	at org.apache.lucene.util.LuceneTestCase$LuceneTestCaseRunner.runChild(LuceneTestCase.java:1413)
	at org.apache.lucene.util.LuceneTestCase$LuceneTestCaseRunner.runChild(LuceneTestCase.java:1331)


REGRESSION:  org.apache.lucene.search.TestDocValuesScoring.testSimple

Error Message:
org/apache/lucene/search/QueryUtils$1

Stack Trace:
java.lang.NoClassDefFoundError: org/apache/lucene/search/QueryUtils$1
	at org.apache.lucene.search.TestDocValuesScoring.testSimple(TestDocValuesScoring.java:84)
	at org.apache.lucene.util.LuceneTestCase$LuceneTestCaseRunner.runChild(LuceneTestCase.java:1413)
	at org.apache.lucene.util.LuceneTestCase$LuceneTestCaseRunner.runChild(LuceneTestCase.java:1331)
Caused by: java.lang.ClassNotFoundException: org.apache.lucene.search.QueryUtils$1
	at java.net.URLClassLoader$1.run(URLClassLoader.java:214)
	at java.security.AccessController.doPrivileged(Native Method)
	at java.net.URLClassLoader.findClass(URLClassLoader.java:205)
	at java.lang.ClassLoader.loadClass(ClassLoader.java:321)
	at sun.misc.Launcher$AppClassLoader.loadClass(Launcher.java:294)
	at java.lang.ClassLoader.loadClass(ClassLoader.java:266)
Caused by: java.io.FileNotFoundException: /usr/home/hudson/hudson-slave/workspace/Lucene-Solr-tests-only-flexscoring-branch/checkout/lucene/build/classes/test-framework/org/apache/lucene/search/QueryUtils$1.class (Too many open files in system)
	at java.io.FileInputStream.open(Native Method)
	at java.io.FileInputStream.<init>(FileInputStream.java:137)
	at sun.misc.URLClassPath$FileLoader$1.getInputStream(URLClassPath.java:1005)
	at sun.misc.Resource.cachedInputStream(Resource.java:77)
	at sun.misc.Resource.getByteBuffer(Resource.java:160)
	at java.net.URLClassLoader.defineClass(URLClassLoader.java:266)
	at java.net.URLClassLoader.access$000(URLClassLoader.java:73)
	at java.net.URLClassLoader$1.run(URLClassLoader.java:212)


REGRESSION:  org.apache.lucene.search.TestFieldCache.test

Error Message:
CheckIndex failed

Stack Trace:
java.lang.RuntimeException: CheckIndex failed
	at org.apache.lucene.util._TestUtil.checkIndex(_TestUtil.java:161)
	at org.apache.lucene.util._TestUtil.checkIndex(_TestUtil.java:147)
	at org.apache.lucene.store.MockDirectoryWrapper.close(MockDirectoryWrapper.java:477)
	at org.apache.lucene.search.TestFieldCache.tearDown(TestFieldCache.java:91)
	at org.apache.lucene.util.LuceneTestCase$LuceneTestCaseRunner.runChild(LuceneTestCase.java:1413)
	at org.apache.lucene.util.LuceneTestCase$LuceneTestCaseRunner.runChild(LuceneTestCase.java:1331)


REGRESSION:  org.apache.lucene.search.TestFieldCache.testInfoStream

Error Message:
null

Stack Trace:
java.lang.NullPointerException
	at org.apache.lucene.search.TestFieldCache.tearDown(TestFieldCache.java:90)
	at org.apache.lucene.util.LuceneTestCase$LuceneTestCaseRunner.runChild(LuceneTestCase.java:1413)
	at org.apache.lucene.util.LuceneTestCase$LuceneTestCaseRunner.runChild(LuceneTestCase.java:1331)


REGRESSION:  org.apache.lucene.search.TestFieldCache.testEmptyIndex

Error Message:
null

Stack Trace:
java.lang.NullPointerException
	at org.apache.lucene.search.TestFieldCache.tearDown(TestFieldCache.java:90)
	at org.apache.lucene.util.LuceneTestCase$LuceneTestCaseRunner.runChild(LuceneTestCase.java:1413)
	at org.apache.lucene.util.LuceneTestCase$LuceneTestCaseRunner.runChild(LuceneTestCase.java:1331)


FAILED:  junit.framework.TestSuite.org.apache.lucene.search.TestFieldCache

Error Message:
ensure your setUp() calls super.setUp() and your tearDown() calls super.tearDown()!!!

Stack Trace:
junit.framework.AssertionFailedError: ensure your setUp() calls super.setUp() and your tearDown() calls super.tearDown()!!!
	at org.apache.lucene.util.LuceneTestCase.afterClassLuceneTestCaseJ4(LuceneTestCase.java:402)


FAILED:  junit.framework.TestSuite.org.apache.lucene.search.TestFieldCacheRangeFilter

Error Message:
CheckIndex failed

Stack Trace:
java.lang.RuntimeException: CheckIndex failed
	at org.apache.lucene.util._TestUtil.checkIndex(_TestUtil.java:161)
	at org.apache.lucene.util._TestUtil.checkIndex(_TestUtil.java:147)
	at org.apache.lucene.store.MockDirectoryWrapper.close(MockDirectoryWrapper.java:477)
	at org.apache.lucene.search.BaseTestRangeFilter.afterClassBaseTestRangeFilter(BaseTestRangeFilter.java:106)


FAILED:  junit.framework.TestSuite.org.apache.lucene.search.TestFieldCacheRangeFilter

Error Message:
directory of test was not closed, opened from: org.apache.lucene.search.BaseTestRangeFilter$TestIndex.<init>(BaseTestRangeFilter.java:58)

Stack Trace:
junit.framework.AssertionFailedError: directory of test was not closed, opened from: org.apache.lucene.search.BaseTestRangeFilter$TestIndex.<init>(BaseTestRangeFilter.java:58)
	at org.apache.lucene.util.LuceneTestCase.afterClassLuceneTestCaseJ4(LuceneTestCase.java:445)


REGRESSION:  org.apache.lucene.search.TestFieldCacheTermsFilter.testMissingTerms

Error Message:
CheckIndex failed

Stack Trace:
java.lang.RuntimeException: CheckIndex failed
	at org.apache.lucene.util._TestUtil.checkIndex(_TestUtil.java:161)
	at org.apache.lucene.util._TestUtil.checkIndex(_TestUtil.java:147)
	at org.apache.lucene.store.MockDirectoryWrapper.close(MockDirectoryWrapper.java:477)
	at org.apache.lucene.search.TestFieldCacheTermsFilter.testMissingTerms(TestFieldCacheTermsFilter.java:73)
	at org.apache.lucene.util.LuceneTestCase$LuceneTestCaseRunner.runChild(LuceneTestCase.java:1413)
	at org.apache.lucene.util.LuceneTestCase$LuceneTestCaseRunner.runChild(LuceneTestCase.java:1331)


REGRESSION:  org.apache.lucene.search.TestPhrasePrefixQuery.testPhrasePrefix

Error Message:
CheckIndex failed

Stack Trace:
java.lang.RuntimeException: CheckIndex failed
	at org.apache.lucene.util._TestUtil.checkIndex(_TestUtil.java:161)
	at org.apache.lucene.util._TestUtil.checkIndex(_TestUtil.java:147)
	at org.apache.lucene.store.MockDirectoryWrapper.close(MockDirectoryWrapper.java:477)
	at org.apache.lucene.search.TestPhrasePrefixQuery.testPhrasePrefix(TestPhrasePrefixQuery.java:103)
	at org.apache.lucene.util.LuceneTestCase$LuceneTestCaseRunner.runChild(LuceneTestCase.java:1413)
	at org.apache.lucene.util.LuceneTestCase$LuceneTestCaseRunner.runChild(LuceneTestCase.java:1331)


REGRESSION:  org.apache.lucene.search.TestSimpleExplanations.testT2

Error Message:
/usr/home/hudson/hudson-slave/workspace/Lucene-Solr-tests-only-flexscoring-branch/checkout/lucene/build/test/2/test5678356794tmp/_0_1.tib (Too many open files in system)

Stack Trace:
java.io.FileNotFoundException: /usr/home/hudson/hudson-slave/workspace/Lucene-Solr-tests-only-flexscoring-branch/checkout/lucene/build/test/2/test5678356794tmp/_0_1.tib (Too many open files in system)
	at java.io.RandomAccessFile.open(Native Method)
	at java.io.RandomAccessFile.<init>(RandomAccessFile.java:233)
	at org.apache.lucene.store.FSDirectory$FSIndexOutput.<init>(FSDirectory.java:416)
	at org.apache.lucene.store.FSDirectory.createOutput(FSDirectory.java:293)
	at org.apache.lucene.store.MockDirectoryWrapper.createOutput(MockDirectoryWrapper.java:375)
	at org.apache.lucene.index.codecs.BlockTermsWriter.<init>(BlockTermsWriter.java:75)
	at org.apache.lucene.index.codecs.mockintblock.MockFixedIntBlockCodec.fieldsConsumer(MockFixedIntBlockCodec.java:145)
	at org.apache.lucene.index.PerFieldCodecWrapper$FieldsWriter.<init>(PerFieldCodecWrapper.java:73)
	at org.apache.lucene.index.PerFieldCodecWrapper.fieldsConsumer(PerFieldCodecWrapper.java:61)
	at org.apache.lucene.index.FreqProxTermsWriter.flush(FreqProxTermsWriter.java:58)
	at org.apache.lucene.index.TermsHash.flush(TermsHash.java:117)
	at org.apache.lucene.index.DocInverter.flush(DocInverter.java:80)
	at org.apache.lucene.index.DocFieldProcessor.flush(DocFieldProcessor.java:79)
	at org.apache.lucene.index.DocumentsWriterPerThread.flush(DocumentsWriterPerThread.java:459)
	at org.apache.lucene.index.DocumentsWriter.doFlush(DocumentsWriter.java:421)
	at org.apache.lucene.index.DocumentsWriter.flushAllThreads(DocumentsWriter.java:548)
	at org.apache.lucene.index.IndexWriter.getReader(IndexWriter.java:374)
	at org.apache.lucene.index.RandomIndexWriter.getReader(RandomIndexWriter.java:345)
	at org.apache.lucene.index.RandomIndexWriter.getReader(RandomIndexWriter.java:308)
	at org.apache.lucene.search.TestExplanations.setUp(TestExplanations.java:84)
	at org.apache.lucene.util.LuceneTestCase$LuceneTestCaseRunner.runChild(LuceneTestCase.java:1413)
	at org.apache.lucene.util.LuceneTestCase$LuceneTestCaseRunner.runChild(LuceneTestCase.java:1331)


REGRESSION:  org.apache.lucene.search.TestSimpleExplanations.testMA1

Error Message:
null

Stack Trace:
java.lang.NullPointerException
	at org.apache.lucene.search.TestExplanations.tearDown(TestExplanations.java:64)
	at org.apache.lucene.util.LuceneTestCase$LuceneTestCaseRunner.runChild(LuceneTestCase.java:1413)
	at org.apache.lucene.util.LuceneTestCase$LuceneTestCaseRunner.runChild(LuceneTestCase.java:1331)


REGRESSION:  org.apache.lucene.search.TestSimpleExplanations.testMA2

Error Message:
null

Stack Trace:
java.lang.NullPointerException
	at org.apache.lucene.search.TestExplanations.tearDown(TestExplanations.java:64)
	at org.apache.lucene.util.LuceneTestCase$LuceneTestCaseRunner.runChild(LuceneTestCase.java:1413)
	at org.apache.lucene.util.LuceneTestCase$LuceneTestCaseRunner.runChild(LuceneTestCase.java:1331)


REGRESSION:  org.apache.lucene.search.TestSimpleExplanations.testP1

Error Message:
null

Stack Trace:
java.lang.NullPointerException
	at org.apache.lucene.search.TestExplanations.tearDown(TestExplanations.java:64)
	at org.apache.lucene.util.LuceneTestCase$LuceneTestCaseRunner.runChild(LuceneTestCase.java:1413)
	at org.apache.lucene.util.LuceneTestCase$LuceneTestCaseRunner.runChild(LuceneTestCase.java:1331)


REGRESSION:  org.apache.lucene.search.TestSimpleExplanations.testP2

Error Message:
null

Stack Trace:
java.lang.NullPointerException
	at org.apache.lucene.search.TestExplanations.tearDown(TestExplanations.java:64)
	at org.apache.lucene.util.LuceneTestCase$LuceneTestCaseRunner.runChild(LuceneTestCase.java:1413)
	at org.apache.lucene.util.LuceneTestCase$LuceneTestCaseRunner.runChild(LuceneTestCase.java:1331)


REGRESSION:  org.apache.lucene.search.TestSimpleExplanations.testP3

Error Message:
null

Stack Trace:
java.lang.NullPointerException
	at org.apache.lucene.search.TestExplanations.tearDown(TestExplanations.java:64)
	at org.apache.lucene.util.LuceneTestCase$LuceneTestCaseRunner.runChild(LuceneTestCase.java:1413)
	at org.apache.lucene.util.LuceneTestCase$LuceneTestCaseRunner.runChild(LuceneTestCase.java:1331)


REGRESSION:  org.apache.lucene.search.TestSimpleExplanations.testP4

Error Message:
null

Stack Trace:
java.lang.NullPointerException
	at org.apache.lucene.search.TestExplanations.tearDown(TestExplanations.java:64)
	at org.apache.lucene.util.LuceneTestCase$LuceneTestCaseRunner.runChild(LuceneTestCase.java:1413)
	at org.apache.lucene.util.LuceneTestCase$LuceneTestCaseRunner.runChild(LuceneTestCase.java:1331)


REGRESSION:  org.apache.lucene.search.TestSimpleExplanations.testP5

Error Message:
null

Stack Trace:
java.lang.NullPointerException
	at org.apache.lucene.search.TestExplanations.tearDown(TestExplanations.java:64)
	at org.apache.lucene.util.LuceneTestCase$LuceneTestCaseRunner.runChild(LuceneTestCase.java:1413)
	at org.apache.lucene.util.LuceneTestCase$LuceneTestCaseRunner.runChild(LuceneTestCase.java:1331)


REGRESSION:  org.apache.lucene.search.TestSimpleExplanations.testP6

Error Message:
null

Stack Trace:
java.lang.NullPointerException
	at org.apache.lucene.search.TestExplanations.tearDown(TestExplanations.java:64)
	at org.apache.lucene.util.LuceneTestCase$LuceneTestCaseRunner.runChild(LuceneTestCase.java:1413)
	at org.apache.lucene.util.LuceneTestCase$LuceneTestCaseRunner.runChild(LuceneTestCase.java:1331)


REGRESSION:  org.apache.lucene.search.TestSimpleExplanations.testP7

Error Message:
null

Stack Trace:
java.lang.NullPointerException
	at org.apache.lucene.search.TestExplanations.tearDown(TestExplanations.java:64)
	at org.apache.lucene.util.LuceneTestCase$LuceneTestCaseRunner.runChild(LuceneTestCase.java:1413)
	at org.apache.lucene.util.LuceneTestCase$LuceneTestCaseRunner.runChild(LuceneTestCase.java:1331)


REGRESSION:  org.apache.lucene.search.TestSimpleExplanations.testFQ1

Error Message:
null

Stack Trace:
java.lang.NullPointerException
	at org.apache.lucene.search.TestExplanations.tearDown(TestExplanations.java:64)
	at org.apache.lucene.util.LuceneTestCase$LuceneTestCaseRunner.runChild(LuceneTestCase.java:1413)
	at org.apache.lucene.util.LuceneTestCase$LuceneTestCaseRunner.runChild(LuceneTestCase.java:1331)


REGRESSION:  org.apache.lucene.search.TestSimpleExplanations.testFQ2

Error Message:
null

Stack Trace:
java.lang.NullPointerException
	at org.apache.lucene.search.TestExplanations.tearDown(TestExplanations.java:64)
	at org.apache.lucene.util.LuceneTestCase$LuceneTestCaseRunner.runChild(LuceneTestCase.java:1413)
	at org.apache.lucene.util.LuceneTestCase$LuceneTestCaseRunner.runChild(LuceneTestCase.java:1331)


REGRESSION:  org.apache.lucene.search.TestSimpleExplanations.testFQ3

Error Message:
null

Stack Trace:
java.lang.NullPointerException
	at org.apache.lucene.search.TestExplanations.tearDown(TestExplanations.java:64)
	at org.apache.lucene.util.LuceneTestCase$LuceneTestCaseRunner.runChild(LuceneTestCase.java:1413)
	at org.apache.lucene.util.LuceneTestCase$LuceneTestCaseRunner.runChild(LuceneTestCase.java:1331)


REGRESSION:  org.apache.lucene.search.TestSimpleExplanations.testFQ4

Error Message:
null

Stack Trace:
java.lang.NullPointerException
	at org.apache.lucene.search.TestExplanations.tearDown(TestExplanations.java:64)
	at org.apache.lucene.util.LuceneTestCase$LuceneTestCaseRunner.runChild(LuceneTestCase.java:1413)
	at org.apache.lucene.util.LuceneTestCase$LuceneTestCaseRunner.runChild(LuceneTestCase.java:1331)


REGRESSION:  org.apache.lucene.search.TestSimpleExplanations.testFQ6

Error Message:
null

Stack Trace:
java.lang.NullPointerException
	at org.apache.lucene.search.TestExplanations.tearDown(TestExplanations.java:64)
	at org.apache.lucene.util.LuceneTestCase$LuceneTestCaseRunner.runChild(LuceneTestCase.java:1413)
	at org.apache.lucene.util.LuceneTestCase$LuceneTestCaseRunner.runChild(LuceneTestCase.java:1331)


REGRESSION:  org.apache.lucene.search.TestSimpleExplanations.testCSQ1

Error Message:
null

Stack Trace:
java.lang.NullPointerException
	at org.apache.lucene.search.TestExplanations.tearDown(TestExplanations.java:64)
	at org.apache.lucene.util.LuceneTestCase$LuceneTestCaseRunner.runChild(LuceneTestCase.java:1413)
	at org.apache.lucene.util.LuceneTestCase$LuceneTestCaseRunner.runChild(LuceneTestCase.java:1331)


REGRESSION:  org.apache.lucene.search.TestSimpleExplanations.testCSQ2

Error Message:
null

Stack Trace:
java.lang.NullPointerException
	at org.apache.lucene.search.TestExplanations.tearDown(TestExplanations.java:64)
	at org.apache.lucene.util.LuceneTestCase$LuceneTestCaseRunner.runChild(LuceneTestCase.java:1413)
	at org.apache.lucene.util.LuceneTestCase$LuceneTestCaseRunner.runChild(LuceneTestCase.java:1331)


REGRESSION:  org.apache.lucene.search.TestSimpleExplanations.testCSQ3

Error Message:
null

Stack Trace:
java.lang.NullPointerException
	at org.apache.lucene.search.TestExplanations.tearDown(TestExplanations.java:64)
	at org.apache.lucene.util.LuceneTestCase$LuceneTestCaseRunner.runChild(LuceneTestCase.java:1413)
	at org.apache.lucene.util.LuceneTestCase$LuceneTestCaseRunner.runChild(LuceneTestCase.java:1331)


REGRESSION:  org.apache.lucene.search.TestSimpleExplanations.testDMQ1

Error Message:
null

Stack Trace:
java.lang.NullPointerException
	at org.apache.lucene.search.TestExplanations.tearDown(TestExplanations.java:64)
	at org.apache.lucene.util.LuceneTestCase$LuceneTestCaseRunner.runChild(LuceneTestCase.java:1413)
	at org.apache.lucene.util.LuceneTestCase$LuceneTestCaseRunner.runChild(LuceneTestCase.java:1331)


REGRESSION:  org.apache.lucene.search.TestSimpleExplanations.testDMQ2

Error Message:
null

Stack Trace:
java.lang.NullPointerException
	at org.apache.lucene.search.TestExplanations.tearDown(TestExplanations.java:64)
	at org.apache.lucene.util.LuceneTestCase$LuceneTestCaseRunner.runChild(LuceneTestCase.java:1413)
	at org.apache.lucene.util.LuceneTestCase$LuceneTestCaseRunner.runChild(LuceneTestCase.java:1331)


REGRESSION:  org.apache.lucene.search.TestSimpleExplanations.testDMQ3

Error Message:
null

Stack Trace:
java.lang.NullPointerException
	at org.apache.lucene.search.TestExplanations.tearDown(TestExplanations.java:64)
	at org.apache.lucene.util.LuceneTestCase$LuceneTestCaseRunner.runChild(LuceneTestCase.java:1413)
	at org.apache.lucene.util.LuceneTestCase$LuceneTestCaseRunner.runChild(LuceneTestCase.java:1331)


REGRESSION:  org.apache.lucene.search.TestSimpleExplanations.testDMQ4

Error Message:
null

Stack Trace:
java.lang.NullPointerException
	at org.apache.lucene.search.TestExplanations.tearDown(TestExplanations.java:64)
	at org.apache.lucene.util.LuceneTestCase$LuceneTestCaseRunner.runChild(LuceneTestCase.java:1413)
	at org.apache.lucene.util.LuceneTestCase$LuceneTestCaseRunner.runChild(LuceneTestCase.java:1331)


REGRESSION:  org.apache.lucene.search.TestSimpleExplanations.testDMQ5

Error Message:
null

Stack Trace:
java.lang.NullPointerException
	at org.apache.lucene.search.TestExplanations.tearDown(TestExplanations.java:64)
	at org.apache.lucene.util.LuceneTestCase$LuceneTestCaseRunner.runChild(LuceneTestCase.java:1413)
	at org.apache.lucene.util.LuceneTestCase$LuceneTestCaseRunner.runChild(LuceneTestCase.java:1331)


REGRESSION:  org.apache.lucene.search.TestSimpleExplanations.testDMQ6

Error Message:
null

Stack Trace:
java.lang.NullPointerException
	at org.apache.lucene.search.TestExplanations.tearDown(TestExplanations.java:64)
	at org.apache.lucene.util.LuceneTestCase$LuceneTestCaseRunner.runChild(LuceneTestCase.java:1413)
	at org.apache.lucene.util.LuceneTestCase$LuceneTestCaseRunner.runChild(LuceneTestCase.java:1331)


REGRESSION:  org.apache.lucene.search.TestSimpleExplanations.testDMQ7

Error Message:
null

Stack Trace:
java.lang.NullPointerException
	at org.apache.lucene.search.TestExplanations.tearDown(TestExplanations.java:64)
	at org.apache.lucene.util.LuceneTestCase$LuceneTestCaseRunner.runChild(LuceneTestCase.java:1413)
	at org.apache.lucene.util.LuceneTestCase$LuceneTestCaseRunner.runChild(LuceneTestCase.java:1331)


REGRESSION:  org.apache.lucene.search.TestSimpleExplanations.testDMQ8

Error Message:
null

Stack Trace:
java.lang.NullPointerException
	at org.apache.lucene.search.TestExplanations.tearDown(TestExplanations.java:64)
	at org.apache.lucene.util.LuceneTestCase$LuceneTestCaseRunner.runChild(LuceneTestCase.java:1413)
	at org.apache.lucene.util.LuceneTestCase$LuceneTestCaseRunner.runChild(LuceneTestCase.java:1331)


REGRESSION:  org.apache.lucene.search.TestSimpleExplanations.testDMQ9

Error Message:
null

Stack Trace:
java.lang.NullPointerException
	at org.apache.lucene.search.TestExplanations.tearDown(TestExplanations.java:64)
	at org.apache.lucene.util.LuceneTestCase$LuceneTestCaseRunner.runChild(LuceneTestCase.java:1413)
	at org.apache.lucene.util.LuceneTestCase$LuceneTestCaseRunner.runChild(LuceneTestCase.java:1331)


REGRESSION:  org.apache.lucene.search.TestSimpleExplanations.testMPQ1

Error Message:
null

Stack Trace:
java.lang.NullPointerException
	at org.apache.lucene.search.TestExplanations.tearDown(TestExplanations.java:64)
	at org.apache.lucene.util.LuceneTestCase$LuceneTestCaseRunner.runChild(LuceneTestCase.java:1413)
	at org.apache.lucene.util.LuceneTestCase$LuceneTestCaseRunner.runChild(LuceneTestCase.java:1331)


REGRESSION:  org.apache.lucene.search.TestSimpleExplanations.testMPQ2

Error Message:
null

Stack Trace:
java.lang.NullPointerException
	at org.apache.lucene.search.TestExplanations.tearDown(TestExplanations.java:64)
	at org.apache.lucene.util.LuceneTestCase$LuceneTestCaseRunner.runChild(LuceneTestCase.java:1413)
	at org.apache.lucene.util.LuceneTestCase$LuceneTestCaseRunner.runChild(LuceneTestCase.java:1331)


REGRESSION:  org.apache.lucene.search.TestSimpleExplanations.testMPQ3

Error Message:
null

Stack Trace:
java.lang.NullPointerException
	at org.apache.lucene.search.TestExplanations.tearDown(TestExplanations.java:64)
	at org.apache.lucene.util.LuceneTestCase$LuceneTestCaseRunner.runChild(LuceneTestCase.java:1413)
	at org.apache.lucene.util.LuceneTestCase$LuceneTestCaseRunner.runChild(LuceneTestCase.java:1331)


REGRESSION:  org.apache.lucene.search.TestSimpleExplanations.testMPQ4

Error Message:
null

Stack Trace:
java.lang.NullPointerException
	at org.apache.lucene.search.TestExplanations.tearDown(TestExplanations.java:64)
	at org.apache.lucene.util.LuceneTestCase$LuceneTestCaseRunner.runChild(LuceneTestCase.java:1413)
	at org.apache.lucene.util.LuceneTestCase$LuceneTestCaseRunner.runChild(LuceneTestCase.java:1331)


REGRESSION:  org.apache.lucene.search.TestSimpleExplanations.testMPQ5

Error Message:
null

Stack Trace:
java.lang.NullPointerException
	at org.apache.lucene.search.TestExplanations.tearDown(TestExplanations.java:64)
	at org.apache.lucene.util.LuceneTestCase$LuceneTestCaseRunner.runChild(LuceneTestCase.java:1413)
	at org.apache.lucene.util.LuceneTestCase$LuceneTestCaseRunner.runChild(LuceneTestCase.java:1331)


REGRESSION:  org.apache.lucene.search.TestSimpleExplanations.testMPQ6

Error Message:
null

Stack Trace:
java.lang.NullPointerException
	at org.apache.lucene.search.TestExplanations.tearDown(TestExplanations.java:64)
	at org.apache.lucene.util.LuceneTestCase$LuceneTestCaseRunner.runChild(LuceneTestCase.java:1413)
	at org.apache.lucene.util.LuceneTestCase$LuceneTestCaseRunner.runChild(LuceneTestCase.java:1331)


REGRESSION:  org.apache.lucene.search.TestSimpleExplanations.testBQ1

Error Message:
null

Stack Trace:
java.lang.NullPointerException
	at org.apache.lucene.search.TestExplanations.tearDown(TestExplanations.java:64)
	at org.apache.lucene.util.LuceneTestCase$LuceneTestCaseRunner.runChild(LuceneTestCase.java:1413)
	at org.apache.lucene.util.LuceneTestCase$LuceneTestCaseRunner.runChild(LuceneTestCase.java:1331)


REGRESSION:  org.apache.lucene.search.TestSimpleExplanations.testBQ2

Error Message:
null

Stack Trace:
java.lang.NullPointerException
	at org.apache.lucene.search.TestExplanations.tearDown(TestExplanations.java:64)
	at org.apache.lucene.util.LuceneTestCase$LuceneTestCaseRunner.runChild(LuceneTestCase.java:1413)
	at org.apache.lucene.util.LuceneTestCase$LuceneTestCaseRunner.runChild(LuceneTestCase.java:1331)


REGRESSION:  org.apache.lucene.search.TestSimpleExplanations.testBQ3

Error Message:
null

Stack Trace:
java.lang.NullPointerException
	at org.apache.lucene.search.TestExplanations.tearDown(TestExplanations.java:64)
	at org.apache.lucene.util.LuceneTestCase$LuceneTestCaseRunner.runChild(LuceneTestCase.java:1413)
	at org.apache.lucene.util.LuceneTestCase$LuceneTestCaseRunner.runChild(LuceneTestCase.java:1331)


REGRESSION:  org.apache.lucene.search.TestSimpleExplanations.testBQ4

Error Message:
null

Stack Trace:
java.lang.NullPointerException
	at org.apache.lucene.search.TestExplanations.tearDown(TestExplanations.java:64)
	at org.apache.lucene.util.LuceneTestCase$LuceneTestCaseRunner.runChild(LuceneTestCase.java:1413)
	at org.apache.lucene.util.LuceneTestCase$LuceneTestCaseRunner.runChild(LuceneTestCase.java:1331)


REGRESSION:  org.apache.lucene.search.TestSimpleExplanations.testBQ5

Error Message:
null

Stack Trace:
java.lang.NullPointerException
	at org.apache.lucene.search.TestExplanations.tearDown(TestExplanations.java:64)
	at org.apache.lucene.util.LuceneTestCase$LuceneTestCaseRunner.runChild(LuceneTestCase.java:1413)
	at org.apache.lucene.util.LuceneTestCase$LuceneTestCaseRunner.runChild(LuceneTestCase.java:1331)


REGRESSION:  org.apache.lucene.search.TestSimpleExplanations.testBQ6

Error Message:
null

Stack Trace:
java.lang.NullPointerException
	at org.apache.lucene.search.TestExplanations.tearDown(TestExplanations.java:64)
	at org.apache.lucene.util.LuceneTestCase$LuceneTestCaseRunner.runChild(LuceneTestCase.java:1413)
	at org.apache.lucene.util.LuceneTestCase$LuceneTestCaseRunner.runChild(LuceneTestCase.java:1331)


REGRESSION:  org.apache.lucene.search.TestSimpleExplanations.testBQ7

Error Message:
null

Stack Trace:
java.lang.NullPointerException
	at org.apache.lucene.search.TestExplanations.tearDown(TestExplanations.java:64)
	at org.apache.lucene.util.LuceneTestCase$LuceneTestCaseRunner.runChild(LuceneTestCase.java:1413)
	at org.apache.lucene.util.LuceneTestCase$LuceneTestCaseRunner.runChild(LuceneTestCase.java:1331)


REGRESSION:  org.apache.lucene.search.TestSimpleExplanations.testBQ8

Error Message:
null

Stack Trace:
java.lang.NullPointerException
	at org.apache.lucene.search.TestExplanations.tearDown(TestExplanations.java:64)
	at org.apache.lucene.util.LuceneTestCase$LuceneTestCaseRunner.runChild(LuceneTestCase.java:1413)
	at org.apache.lucene.util.LuceneTestCase$LuceneTestCaseRunner.runChild(LuceneTestCase.java:1331)


REGRESSION:  org.apache.lucene.search.TestSimpleExplanations.testBQ9

Error Message:
null

Stack Trace:
java.lang.NullPointerException
	at org.apache.lucene.search.TestExplanations.tearDown(TestExplanations.java:64)
	at org.apache.lucene.util.LuceneTestCase$LuceneTestCaseRunner.runChild(LuceneTestCase.java:1413)
	at org.apache.lucene.util.LuceneTestCase$LuceneTestCaseRunner.runChild(LuceneTestCase.java:1331)


REGRESSION:  org.apache.lucene.search.TestSimpleExplanations.testBQ10

Error Message:
null

Stack Trace:
java.lang.NullPointerException
	at org.apache.lucene.search.TestExplanations.tearDown(TestExplanations.java:64)
	at org.apache.lucene.util.LuceneTestCase$LuceneTestCaseRunner.runChild(LuceneTestCase.java:1413)
	at org.apache.lucene.util.LuceneTestCase$LuceneTestCaseRunner.runChild(LuceneTestCase.java:1331)


REGRESSION:  org.apache.lucene.search.TestSimpleExplanations.testBQ11

Error Message:
null

Stack Trace:
java.lang.NullPointerException
	at org.apache.lucene.search.TestExplanations.tearDown(TestExplanations.java:64)
	at org.apache.lucene.util.LuceneTestCase$LuceneTestCaseRunner.runChild(LuceneTestCase.java:1413)
	at org.apache.lucene.util.LuceneTestCase$LuceneTestCaseRunner.runChild(LuceneTestCase.java:1331)


REGRESSION:  org.apache.lucene.search.TestSimpleExplanations.testBQ14

Error Message:
null

Stack Trace:
java.lang.NullPointerException
	at org.apache.lucene.search.TestExplanations.tearDown(TestExplanations.java:64)
	at org.apache.lucene.util.LuceneTestCase$LuceneTestCaseRunner.runChild(LuceneTestCase.java:1413)
	at org.apache.lucene.util.LuceneTestCase$LuceneTestCaseRunner.runChild(LuceneTestCase.java:1331)


REGRESSION:  org.apache.lucene.search.TestSimpleExplanations.testBQ15

Error Message:
null

Stack Trace:
java.lang.NullPointerException
	at org.apache.lucene.search.TestExplanations.tearDown(TestExplanations.java:64)
	at org.apache.lucene.util.LuceneTestCase$LuceneTestCaseRunner.runChild(LuceneTestCase.java:1413)
	at org.apache.lucene.util.LuceneTestCase$LuceneTestCaseRunner.runChild(LuceneTestCase.java:1331)


REGRESSION:  org.apache.lucene.search.TestSimpleExplanations.testBQ16

Error Message:
null

Stack Trace:
java.lang.NullPointerException
	at org.apache.lucene.search.TestExplanations.tearDown(TestExplanations.java:64)
	at org.apache.lucene.util.LuceneTestCase$LuceneTestCaseRunner.runChild(LuceneTestCase.java:1413)
	at org.apache.lucene.util.LuceneTestCase$LuceneTestCaseRunner.runChild(LuceneTestCase.java:1331)


REGRESSION:  org.apache.lucene.search.TestSimpleExplanations.testBQ17

Error Message:
null

Stack Trace:
java.lang.NullPointerException
	at org.apache.lucene.search.TestExplanations.tearDown(TestExplanations.java:64)
	at org.apache.lucene.util.LuceneTestCase$LuceneTestCaseRunner.runChild(LuceneTestCase.java:1413)
	at org.apache.lucene.util.LuceneTestCase$LuceneTestCaseRunner.runChild(LuceneTestCase.java:1331)


REGRESSION:  org.apache.lucene.search.TestSimpleExplanations.testBQ19

Error Message:
null

Stack Trace:
java.lang.NullPointerException
	at org.apache.lucene.search.TestExplanations.tearDown(TestExplanations.java:64)
	at org.apache.lucene.util.LuceneTestCase$LuceneTestCaseRunner.runChild(LuceneTestCase.java:1413)
	at org.apache.lucene.util.LuceneTestCase$LuceneTestCaseRunner.runChild(LuceneTestCase.java:1331)


REGRESSION:  org.apache.lucene.search.TestSimpleExplanations.testBQ20

Error Message:
null

Stack Trace:
java.lang.NullPointerException
	at org.apache.lucene.search.TestExplanations.tearDown(TestExplanations.java:64)
	at org.apache.lucene.util.LuceneTestCase$LuceneTestCaseRunner.runChild(LuceneTestCase.java:1413)
	at org.apache.lucene.util.LuceneTestCase$LuceneTestCaseRunner.runChild(LuceneTestCase.java:1331)


REGRESSION:  org.apache.lucene.search.TestSimpleExplanations.testMultiFieldBQ1

Error Message:
null

Stack Trace:
java.lang.NullPointerException
	at org.apache.lucene.search.TestExplanations.tearDown(TestExplanations.java:64)
	at org.apache.lucene.util.LuceneTestCase$LuceneTestCaseRunner.runChild(LuceneTestCase.java:1413)
	at org.apache.lucene.util.LuceneTestCase$LuceneTestCaseRunner.runChild(LuceneTestCase.java:1331)


REGRESSION:  org.apache.lucene.search.TestSimpleExplanations.testMultiFieldBQ2

Error Message:
null

Stack Trace:
java.lang.NullPointerException
	at org.apache.lucene.search.TestExplanations.tearDown(TestExplanations.java:64)
	at org.apache.lucene.util.LuceneTestCase$LuceneTestCaseRunner.runChild(LuceneTestCase.java:1413)
	at org.apache.lucene.util.LuceneTestCase$LuceneTestCaseRunner.runChild(LuceneTestCase.java:1331)


REGRESSION:  org.apache.lucene.search.TestSimpleExplanations.testMultiFieldBQ3

Error Message:
null

Stack Trace:
java.lang.NullPointerException
	at org.apache.lucene.search.TestExplanations.tearDown(TestExplanations.java:64)
	at org.apache.lucene.util.LuceneTestCase$LuceneTestCaseRunner.runChild(LuceneTestCase.java:1413)
	at org.apache.lucene.util.LuceneTestCase$LuceneTestCaseRunner.runChild(LuceneTestCase.java:1331)


REGRESSION:  org.apache.lucene.search.TestSimpleExplanations.testMultiFieldBQ4

Error Message:
null

Stack Trace:
java.lang.NullPointerException
	at org.apache.lucene.search.TestExplanations.tearDown(TestExplanations.java:64)
	at org.apache.lucene.util.LuceneTestCase$LuceneTestCaseRunner.runChild(LuceneTestCase.java:1413)
	at org.apache.lucene.util.LuceneTestCase$LuceneTestCaseRunner.runChild(LuceneTestCase.java:1331)


REGRESSION:  org.apache.lucene.search.TestSimpleExplanations.testMultiFieldBQ5

Error Message:
null

Stack Trace:
java.lang.NullPointerException
	at org.apache.lucene.search.TestExplanations.tearDown(TestExplanations.java:64)
	at org.apache.lucene.util.LuceneTestCase$LuceneTestCaseRunner.runChild(LuceneTestCase.java:1413)
	at org.apache.lucene.util.LuceneTestCase$LuceneTestCaseRunner.runChild(LuceneTestCase.java:1331)


REGRESSION:  org.apache.lucene.search.TestSimpleExplanations.testMultiFieldBQ6

Error Message:
null

Stack Trace:
java.lang.NullPointerException
	at org.apache.lucene.search.TestExplanations.tearDown(TestExplanations.java:64)
	at org.apache.lucene.util.LuceneTestCase$LuceneTestCaseRunner.runChild(LuceneTestCase.java:1413)
	at org.apache.lucene.util.LuceneTestCase$LuceneTestCaseRunner.runChild(LuceneTestCase.java:1331)


REGRESSION:  org.apache.lucene.search.TestSimpleExplanations.testMultiFieldBQ7

Error Message:
null

Stack Trace:
java.lang.NullPointerException
	at org.apache.lucene.search.TestExplanations.tearDown(TestExplanations.java:64)
	at org.apache.lucene.util.LuceneTestCase$LuceneTestCaseRunner.runChild(LuceneTestCase.java:1413)
	at org.apache.lucene.util.LuceneTestCase$LuceneTestCaseRunner.runChild(LuceneTestCase.java:1331)


REGRESSION:  org.apache.lucene.search.TestSimpleExplanations.testMultiFieldBQ8

Error Message:
null

Stack Trace:
java.lang.NullPointerException
	at org.apache.lucene.search.TestExplanations.tearDown(TestExplanations.java:64)
	at org.apache.lucene.util.LuceneTestCase$LuceneTestCaseRunner.runChild(LuceneTestCase.java:1413)
	at org.apache.lucene.util.LuceneTestCase$LuceneTestCaseRunner.runChild(LuceneTestCase.java:1331)


REGRESSION:  org.apache.lucene.search.TestSimpleExplanations.testMultiFieldBQ9

Error Message:
null

Stack Trace:
java.lang.NullPointerException
	at org.apache.lucene.search.TestExplanations.tearDown(TestExplanations.java:64)
	at org.apache.lucene.util.LuceneTestCase$LuceneTestCaseRunner.runChild(LuceneTestCase.java:1413)
	at org.apache.lucene.util.LuceneTestCase$LuceneTestCaseRunner.runChild(LuceneTestCase.java:1331)


REGRESSION:  org.apache.lucene.search.TestSimpleExplanations.testMultiFieldBQ10

Error Message:
null

Stack Trace:
java.lang.NullPointerException
	at org.apache.lucene.search.TestExplanations.tearDown(TestExplanations.java:64)
	at org.apache.lucene.util.LuceneTestCase$LuceneTestCaseRunner.runChild(LuceneTestCase.java:1413)
	at org.apache.lucene.util.LuceneTestCase$LuceneTestCaseRunner.runChild(LuceneTestCase.java:1331)


REGRESSION:  org.apache.lucene.search.TestSimpleExplanations.testMultiFieldBQofPQ1

Error Message:
null

Stack Trace:
java.lang.NullPointerException
	at org.apache.lucene.search.TestExplanations.tearDown(TestExplanations.java:64)
	at org.apache.lucene.util.LuceneTestCase$LuceneTestCaseRunner.runChild(LuceneTestCase.java:1413)
	at org.apache.lucene.util.LuceneTestCase$LuceneTestCaseRunner.runChild(LuceneTestCase.java:1331)


REGRESSION:  org.apache.lucene.search.TestSimpleExplanations.testMultiFieldBQofPQ2

Error Message:
null

Stack Trace:
java.lang.NullPointerException
	at org.apache.lucene.search.TestExplanations.tearDown(TestExplanations.java:64)
	at org.apache.lucene.util.LuceneTestCase$LuceneTestCaseRunner.runChild(LuceneTestCase.java:1413)
	at org.apache.lucene.util.LuceneTestCase$LuceneTestCaseRunner.runChild(LuceneTestCase.java:1331)


REGRESSION:  org.apache.lucene.search.TestSimpleExplanations.testMultiFieldBQofPQ3

Error Message:
null

Stack Trace:
java.lang.NullPointerException
	at org.apache.lucene.search.TestExplanations.tearDown(TestExplanations.java:64)
	at org.apache.lucene.util.LuceneTestCase$LuceneTestCaseRunner.runChild(LuceneTestCase.java:1413)
	at org.apache.lucene.util.LuceneTestCase$LuceneTestCaseRunner.runChild(LuceneTestCase.java:1331)


REGRESSION:  org.apache.lucene.search.TestSimpleExplanations.testMultiFieldBQofPQ4

Error Message:
null

Stack Trace:
java.lang.NullPointerException
	at org.apache.lucene.search.TestExplanations.tearDown(TestExplanations.java:64)
	at org.apache.lucene.util.LuceneTestCase$LuceneTestCaseRunner.runChild(LuceneTestCase.java:1413)
	at org.apache.lucene.util.LuceneTestCase$LuceneTestCaseRunner.runChild(LuceneTestCase.java:1331)


REGRESSION:  org.apache.lucene.search.TestSimpleExplanations.testMultiFieldBQofPQ5

Error Message:
null

Stack Trace:
java.lang.NullPointerException
	at org.apache.lucene.search.TestExplanations.tearDown(TestExplanations.java:64)
	at org.apache.lucene.util.LuceneTestCase$LuceneTestCaseRunner.runChild(LuceneTestCase.java:1413)
	at org.apache.lucene.util.LuceneTestCase$LuceneTestCaseRunner.runChild(LuceneTestCase.java:1331)


REGRESSION:  org.apache.lucene.search.TestSimpleExplanations.testMultiFieldBQofPQ6

Error Message:
null

Stack Trace:
java.lang.NullPointerException
	at org.apache.lucene.search.TestExplanations.tearDown(TestExplanations.java:64)
	at org.apache.lucene.util.LuceneTestCase$LuceneTestCaseRunner.runChild(LuceneTestCase.java:1413)
	at org.apache.lucene.util.LuceneTestCase$LuceneTestCaseRunner.runChild(LuceneTestCase.java:1331)


REGRESSION:  org.apache.lucene.search.TestSimpleExplanations.testMultiFieldBQofPQ7

Error Message:
null

Stack Trace:
java.lang.NullPointerException
	at org.apache.lucene.search.TestExplanations.tearDown(TestExplanations.java:64)
	at org.apache.lucene.util.LuceneTestCase$LuceneTestCaseRunner.runChild(LuceneTestCase.java:1413)
	at org.apache.lucene.util.LuceneTestCase$LuceneTestCaseRunner.runChild(LuceneTestCase.java:1331)


REGRESSION:  org.apache.lucene.search.TestSimpleExplanations.testNoop

Error Message:
null

Stack Trace:
java.lang.NullPointerException
	at org.apache.lucene.search.TestExplanations.tearDown(TestExplanations.java:64)
	at org.apache.lucene.util.LuceneTestCase$LuceneTestCaseRunner.runChild(LuceneTestCase.java:1413)
	at org.apache.lucene.util.LuceneTestCase$LuceneTestCaseRunner.runChild(LuceneTestCase.java:1331)


FAILED:  junit.framework.TestSuite.org.apache.lucene.search.TestSimpleExplanations

Error Message:
ensure your setUp() calls super.setUp() and your tearDown() calls super.tearDown()!!!

Stack Trace:
junit.framework.AssertionFailedError: ensure your setUp() calls super.setUp() and your tearDown() calls super.tearDown()!!!
	at org.apache.lucene.util.LuceneTestCase.afterClassLuceneTestCaseJ4(LuceneTestCase.java:402)


REGRESSION:  org.apache.lucene.search.TestTermVectors.test

Error Message:
/usr/home/hudson/hudson-slave/workspace/Lucene-Solr-tests-only-flexscoring-branch/checkout/lucene/build/test/2/test5678356795tmp/_0_4.pyl (Too many open files in system)

Stack Trace:
java.io.FileNotFoundException: /usr/home/hudson/hudson-slave/workspace/Lucene-Solr-tests-only-flexscoring-branch/checkout/lucene/build/test/2/test5678356795tmp/_0_4.pyl (Too many open files in system)
	at java.io.RandomAccessFile.open(Native Method)
	at java.io.RandomAccessFile.<init>(RandomAccessFile.java:233)
	at org.apache.lucene.store.FSDirectory$FSIndexOutput.<init>(FSDirectory.java:416)
	at org.apache.lucene.store.FSDirectory.createOutput(FSDirectory.java:293)
	at org.apache.lucene.store.MockDirectoryWrapper.createOutput(MockDirectoryWrapper.java:375)
	at org.apache.lucene.index.codecs.sep.SepPostingsWriterImpl.<init>(SepPostingsWriterImpl.java:135)
	at org.apache.lucene.index.codecs.sep.SepPostingsWriterImpl.<init>(SepPostingsWriterImpl.java:107)
	at org.apache.lucene.index.codecs.mockintblock.MockFixedIntBlockCodec.fieldsConsumer(MockFixedIntBlockCodec.java:130)
	at org.apache.lucene.index.PerFieldCodecWrapper$FieldsWriter.<init>(PerFieldCodecWrapper.java:73)
	at org.apache.lucene.index.PerFieldCodecWrapper.fieldsConsumer(PerFieldCodecWrapper.java:61)
	at org.apache.lucene.index.FreqProxTermsWriter.flush(FreqProxTermsWriter.java:58)
	at org.apache.lucene.index.TermsHash.flush(TermsHash.java:117)
	at org.apache.lucene.index.DocInverter.flush(DocInverter.java:80)
	at org.apache.lucene.index.DocFieldProcessor.flush(DocFieldProcessor.java:79)
	at org.apache.lucene.index.DocumentsWriterPerThread.flush(DocumentsWriterPerThread.java:459)
	at org.apache.lucene.index.DocumentsWriter.doFlush(DocumentsWriter.java:421)
	at org.apache.lucene.index.DocumentsWriter.postUpdate(DocumentsWriter.java:313)
	at org.apache.lucene.index.DocumentsWriter.updateDocument(DocumentsWriter.java:385)
	at org.apache.lucene.index.IndexWriter.updateDocument(IndexWriter.java:1474)
	at org.apache.lucene.index.IndexWriter.addDocument(IndexWriter.java:1234)
	at org.apache.lucene.index.IndexWriter.addDocument(IndexWriter.java:1215)
	at org.apache.lucene.index.RandomIndexWriter.addDocument(RandomIndexWriter.java:163)
	at org.apache.lucene.search.TestTermVectors.setUp(TestTermVectors.java:70)
	at org.apache.lucene.util.LuceneTestCase$LuceneTestCaseRunner.runChild(LuceneTestCase.java:1413)
	at org.apache.lucene.util.LuceneTestCase$LuceneTestCaseRunner.runChild(LuceneTestCase.java:1331)


REGRESSION:  org.apache.lucene.search.TestTermVectors.testTermVectors

Error Message:
null

Stack Trace:
java.lang.NullPointerException
	at org.apache.lucene.search.TestTermVectors.tearDown(TestTermVectors.java:79)
	at org.apache.lucene.util.LuceneTestCase$LuceneTestCaseRunner.runChild(LuceneTestCase.java:1413)
	at org.apache.lucene.util.LuceneTestCase$LuceneTestCaseRunner.runChild(LuceneTestCase.java:1331)


REGRESSION:  org.apache.lucene.search.TestTermVectors.testTermVectorsFieldOrder

Error Message:
null

Stack Trace:
java.lang.NullPointerException
	at org.apache.lucene.search.TestTermVectors.tearDown(TestTermVectors.java:79)
	at org.apache.lucene.util.LuceneTestCase$LuceneTestCaseRunner.runChild(LuceneTestCase.java:1413)
	at org.apache.lucene.util.LuceneTestCase$LuceneTestCaseRunner.runChild(LuceneTestCase.java:1331)


REGRESSION:  org.apache.lucene.search.TestTermVectors.testTermPositionVectors

Error Message:
null

Stack Trace:
java.lang.NullPointerException
	at org.apache.lucene.search.TestTermVectors.tearDown(TestTermVectors.java:79)
	at org.apache.lucene.util.LuceneTestCase$LuceneTestCaseRunner.runChild(LuceneTestCase.java:1413)
	at org.apache.lucene.util.LuceneTestCase$LuceneTestCaseRunner.runChild(LuceneTestCase.java:1331)


REGRESSION:  org.apache.lucene.search.TestTermVectors.testTermOffsetVectors

Error Message:
null

Stack Trace:
java.lang.NullPointerException
	at org.apache.lucene.search.TestTermVectors.tearDown(TestTermVectors.java:79)
	at org.apache.lucene.util.LuceneTestCase$LuceneTestCaseRunner.runChild(LuceneTestCase.java:1413)
	at org.apache.lucene.util.LuceneTestCase$LuceneTestCaseRunner.runChild(LuceneTestCase.java:1331)


REGRESSION:  org.apache.lucene.search.TestTermVectors.testKnownSetOfDocuments

Error Message:
null

Stack Trace:
java.lang.NullPointerException
	at org.apache.lucene.search.TestTermVectors.tearDown(TestTermVectors.java:79)
	at org.apache.lucene.util.LuceneTestCase$LuceneTestCaseRunner.runChild(LuceneTestCase.java:1413)
	at org.apache.lucene.util.LuceneTestCase$LuceneTestCaseRunner.runChild(LuceneTestCase.java:1331)


REGRESSION:  org.apache.lucene.search.TestTermVectors.testRareVectors

Error Message:
null

Stack Trace:
java.lang.NullPointerException
	at org.apache.lucene.search.TestTermVectors.tearDown(TestTermVectors.java:79)
	at org.apache.lucene.util.LuceneTestCase$LuceneTestCaseRunner.runChild(LuceneTestCase.java:1413)
	at org.apache.lucene.util.LuceneTestCase$LuceneTestCaseRunner.runChild(LuceneTestCase.java:1331)


REGRESSION:  org.apache.lucene.search.TestTermVectors.testMixedVectrosVectors

Error Message:
null

Stack Trace:
java.lang.NullPointerException
	at org.apache.lucene.search.TestTermVectors.tearDown(TestTermVectors.java:79)
	at org.apache.lucene.util.LuceneTestCase$LuceneTestCaseRunner.runChild(LuceneTestCase.java:1413)
	at org.apache.lucene.util.LuceneTestCase$LuceneTestCaseRunner.runChild(LuceneTestCase.java:1331)


FAILED:  junit.framework.TestSuite.org.apache.lucene.search.TestTermVectors

Error Message:
ensure your setUp() calls super.setUp() and your tearDown() calls super.tearDown()!!!

Stack Trace:
junit.framework.AssertionFailedError: ensure your setUp() calls super.setUp() and your tearDown() calls super.tearDown()!!!
	at org.apache.lucene.util.LuceneTestCase.afterClassLuceneTestCaseJ4(LuceneTestCase.java:402)


REGRESSION:  org.apache.lucene.search.spans.TestPayloadSpans.testNestedSpans

Error Message:
CheckIndex failed

Stack Trace:
java.lang.RuntimeException: CheckIndex failed
	at org.apache.lucene.util._TestUtil.checkIndex(_TestUtil.java:161)
	at org.apache.lucene.util._TestUtil.checkIndex(_TestUtil.java:147)
	at org.apache.lucene.store.MockDirectoryWrapper.close(MockDirectoryWrapper.java:477)
	at org.apache.lucene.search.spans.TestPayloadSpans.testNestedSpans(TestPayloadSpans.java:183)
	at org.apache.lucene.util.LuceneTestCase$LuceneTestCaseRunner.runChild(LuceneTestCase.java:1413)
	at org.apache.lucene.util.LuceneTestCase$LuceneTestCaseRunner.runChild(LuceneTestCase.java:1331)


REGRESSION:  org.apache.lucene.search.spans.TestPayloadSpans.testFirstClauseWithoutPayload

Error Message:
CheckIndex failed

Stack Trace:
java.lang.RuntimeException: CheckIndex failed
	at org.apache.lucene.util._TestUtil.checkIndex(_TestUtil.java:161)
	at org.apache.lucene.util._TestUtil.checkIndex(_TestUtil.java:147)
	at org.apache.lucene.store.MockDirectoryWrapper.close(MockDirectoryWrapper.java:477)
	at org.apache.lucene.search.spans.TestPayloadSpans.testFirstClauseWithoutPayload(TestPayloadSpans.java:216)
	at org.apache.lucene.util.LuceneTestCase$LuceneTestCaseRunner.runChild(LuceneTestCase.java:1413)
	at org.apache.lucene.util.LuceneTestCase$LuceneTestCaseRunner.runChild(LuceneTestCase.java:1331)


REGRESSION:  org.apache.lucene.search.spans.TestPayloadSpans.testHeavilyNestedSpanQuery

Error Message:
CheckIndex failed

Stack Trace:
java.lang.RuntimeException: CheckIndex failed
	at org.apache.lucene.util._TestUtil.checkIndex(_TestUtil.java:161)
	at org.apache.lucene.util._TestUtil.checkIndex(_TestUtil.java:147)
	at org.apache.lucene.store.MockDirectoryWrapper.close(MockDirectoryWrapper.java:477)
	at org.apache.lucene.search.spans.TestPayloadSpans.testHeavilyNestedSpanQuery(TestPayloadSpans.java:254)
	at org.apache.lucene.util.LuceneTestCase$LuceneTestCaseRunner.runChild(LuceneTestCase.java:1413)
	at org.apache.lucene.util.LuceneTestCase$LuceneTestCaseRunner.runChild(LuceneTestCase.java:1331)


REGRESSION:  org.apache.lucene.search.spans.TestPayloadSpans.testPayloadSpanUtil

Error Message:
CheckIndex failed

Stack Trace:
java.lang.RuntimeException: CheckIndex failed
	at org.apache.lucene.util._TestUtil.checkIndex(_TestUtil.java:161)
	at org.apache.lucene.util._TestUtil.checkIndex(_TestUtil.java:147)
	at org.apache.lucene.store.MockDirectoryWrapper.close(MockDirectoryWrapper.java:477)
	at org.apache.lucene.search.spans.TestPayloadSpans.testPayloadSpanUtil(TestPayloadSpans.java:400)
	at org.apache.lucene.util.LuceneTestCase$LuceneTestCaseRunner.runChild(LuceneTestCase.java:1413)
	at org.apache.lucene.util.LuceneTestCase$LuceneTestCaseRunner.runChild(LuceneTestCase.java:1331)


REGRESSION:  org.apache.lucene.search.spans.TestSpanExplanationsOfNonMatches.testST4

Error Message:
/usr/home/hudson/hudson-slave/workspace/Lucene-Solr-tests-only-flexscoring-branch/checkout/lucene/build/test/2/test5678356796tmp/_0_3.tiv (Too many open files in system)

Stack Trace:
java.io.FileNotFoundException: /usr/home/hudson/hudson-slave/workspace/Lucene-Solr-tests-only-flexscoring-branch/checkout/lucene/build/test/2/test5678356796tmp/_0_3.tiv (Too many open files in system)
	at java.io.RandomAccessFile.open(Native Method)
	at java.io.RandomAccessFile.<init>(RandomAccessFile.java:233)
	at org.apache.lucene.store.FSDirectory$FSIndexOutput.<init>(FSDirectory.java:416)
	at org.apache.lucene.store.FSDirectory.createOutput(FSDirectory.java:293)
	at org.apache.lucene.store.MockDirectoryWrapper.createOutput(MockDirectoryWrapper.java:375)
	at org.apache.lucene.index.codecs.VariableGapTermsIndexWriter.<init>(VariableGapTermsIndexWriter.java:162)
	at org.apache.lucene.index.codecs.standard.StandardCodec.fieldsConsumer(StandardCodec.java:64)
	at org.apache.lucene.index.PerFieldCodecWrapper$FieldsWriter.<init>(PerFieldCodecWrapper.java:73)
	at org.apache.lucene.index.PerFieldCodecWrapper.fieldsConsumer(PerFieldCodecWrapper.java:61)
	at org.apache.lucene.index.FreqProxTermsWriter.flush(FreqProxTermsWriter.java:58)
	at org.apache.lucene.index.TermsHash.flush(TermsHash.java:117)
	at org.apache.lucene.index.DocInverter.flush(DocInverter.java:80)
	at org.apache.lucene.index.DocFieldProcessor.flush(DocFieldProcessor.java:79)
	at org.apache.lucene.index.DocumentsWriterPerThread.flush(DocumentsWriterPerThread.java:459)
	at org.apache.lucene.index.DocumentsWriter.doFlush(DocumentsWriter.java:421)
	at org.apache.lucene.index.DocumentsWriter.postUpdate(DocumentsWriter.java:313)
	at org.apache.lucene.index.DocumentsWriter.updateDocument(DocumentsWriter.java:385)
	at org.apache.lucene.index.IndexWriter.updateDocument(IndexWriter.java:1474)
	at org.apache.lucene.index.IndexWriter.addDocument(IndexWriter.java:1234)
	at org.apache.lucene.index.IndexWriter.addDocument(IndexWriter.java:1215)
	at org.apache.lucene.index.RandomIndexWriter.addDocument(RandomIndexWriter.java:163)
	at org.apache.lucene.search.TestExplanations.setUp(TestExplanations.java:82)
	at org.apache.lucene.util.LuceneTestCase$LuceneTestCaseRunner.runChild(LuceneTestCase.java:1413)
	at org.apache.lucene.util.LuceneTestCase$LuceneTestCaseRunner.runChild(LuceneTestCase.java:1331)


REGRESSION:  org.apache.lucene.search.spans.TestSpanExplanationsOfNonMatches.testST5

Error Message:
null

Stack Trace:
java.lang.NullPointerException
	at org.apache.lucene.search.TestExplanations.tearDown(TestExplanations.java:64)
	at org.apache.lucene.util.LuceneTestCase$LuceneTestCaseRunner.runChild(LuceneTestCase.java:1413)
	at org.apache.lucene.util.LuceneTestCase$LuceneTestCaseRunner.runChild(LuceneTestCase.java:1331)


REGRESSION:  org.apache.lucene.search.spans.TestSpanExplanationsOfNonMatches.testSF1

Error Message:
null

Stack Trace:
java.lang.NullPointerException
	at org.apache.lucene.search.TestExplanations.tearDown(TestExplanations.java:64)
	at org.apache.lucene.util.LuceneTestCase$LuceneTestCaseRunner.runChild(LuceneTestCase.java:1413)
	at org.apache.lucene.util.LuceneTestCase$LuceneTestCaseRunner.runChild(LuceneTestCase.java:1331)


REGRESSION:  org.apache.lucene.search.spans.TestSpanExplanationsOfNonMatches.testSF2

Error Message:
null

Stack Trace:
java.lang.NullPointerException
	at org.apache.lucene.search.TestExplanations.tearDown(TestExplanations.java:64)
	at org.apache.lucene.util.LuceneTestCase$LuceneTestCaseRunner.runChild(LuceneTestCase.java:1413)
	at org.apache.lucene.util.LuceneTestCase$LuceneTestCaseRunner.runChild(LuceneTestCase.java:1331)


REGRESSION:  org.apache.lucene.search.spans.TestSpanExplanationsOfNonMatches.testSF4

Error Message:
null

Stack Trace:
java.lang.NullPointerException
	at org.apache.lucene.search.TestExplanations.tearDown(TestExplanations.java:64)
	at org.apache.lucene.util.LuceneTestCase$LuceneTestCaseRunner.runChild(LuceneTestCase.java:1413)
	at org.apache.lucene.util.LuceneTestCase$LuceneTestCaseRunner.runChild(LuceneTestCase.java:1331)


REGRESSION:  org.apache.lucene.search.spans.TestSpanExplanationsOfNonMatches.testSF5

Error Message:
null

Stack Trace:
java.lang.NullPointerException
	at org.apache.lucene.search.TestExplanations.tearDown(TestExplanations.java:64)
	at org.apache.lucene.util.LuceneTestCase$LuceneTestCaseRunner.runChild(LuceneTestCase.java:1413)
	at org.apache.lucene.util.LuceneTestCase$LuceneTestCaseRunner.runChild(LuceneTestCase.java:1331)


REGRESSION:  org.apache.lucene.search.spans.TestSpanExplanationsOfNonMatches.testSF6

Error Message:
null

Stack Trace:
java.lang.NullPointerException
	at org.apache.lucene.search.TestExplanations.tearDown(TestExplanations.java:64)
	at org.apache.lucene.util.LuceneTestCase$LuceneTestCaseRunner.runChild(LuceneTestCase.java:1413)
	at org.apache.lucene.util.LuceneTestCase$LuceneTestCaseRunner.runChild(LuceneTestCase.java:1331)


REGRESSION:  org.apache.lucene.search.spans.TestSpanExplanationsOfNonMatches.testSO1

Error Message:
null

Stack Trace:
java.lang.NullPointerException
	at org.apache.lucene.search.TestExplanations.tearDown(TestExplanations.java:64)
	at org.apache.lucene.util.LuceneTestCase$LuceneTestCaseRunner.runChild(LuceneTestCase.java:1413)
	at org.apache.lucene.util.LuceneTestCase$LuceneTestCaseRunner.runChild(LuceneTestCase.java:1331)


REGRESSION:  org.apache.lucene.search.spans.TestSpanExplanationsOfNonMatches.testSO2

Error Message:
null

Stack Trace:
java.lang.NullPointerException
	at org.apache.lucene.search.TestExplanations.tearDown(TestExplanations.java:64)
	at org.apache.lucene.util.LuceneTestCase$LuceneTestCaseRunner.runChild(LuceneTestCase.java:1413)
	at org.apache.lucene.util.LuceneTestCase$LuceneTestCaseRunner.runChild(LuceneTestCase.java:1331)


REGRESSION:  org.apache.lucene.search.spans.TestSpanExplanationsOfNonMatches.testSO3

Error Message:
null

Stack Trace:
java.lang.NullPointerException
	at org.apache.lucene.search.TestExplanations.tearDown(TestExplanations.java:64)
	at org.apache.lucene.util.LuceneTestCase$LuceneTestCaseRunner.runChild(LuceneTestCase.java:1413)
	at org.apache.lucene.util.LuceneTestCase$LuceneTestCaseRunner.runChild(LuceneTestCase.java:1331)


REGRESSION:  org.apache.lucene.search.spans.TestSpanExplanationsOfNonMatches.testSO4

Error Message:
null

Stack Trace:
java.lang.NullPointerException
	at org.apache.lucene.search.TestExplanations.tearDown(TestExplanations.java:64)
	at org.apache.lucene.util.LuceneTestCase$LuceneTestCaseRunner.runChild(LuceneTestCase.java:1413)
	at org.apache.lucene.util.LuceneTestCase$LuceneTestCaseRunner.runChild(LuceneTestCase.java:1331)


REGRESSION:  org.apache.lucene.search.spans.TestSpanExplanationsOfNonMatches.testSNear1

Error Message:
null

Stack Trace:
java.lang.NullPointerException
	at org.apache.lucene.search.TestExplanations.tearDown(TestExplanations.java:64)
	at org.apache.lucene.util.LuceneTestCase$LuceneTestCaseRunner.runChild(LuceneTestCase.java:1413)
	at org.apache.lucene.util.LuceneTestCase$LuceneTestCaseRunner.runChild(LuceneTestCase.java:1331)


REGRESSION:  org.apache.lucene.search.spans.TestSpanExplanationsOfNonMatches.testSNear2

Error Message:
null

Stack Trace:
java.lang.NullPointerException
	at org.apache.lucene.search.TestExplanations.tearDown(TestExplanations.java:64)
	at org.apache.lucene.util.LuceneTestCase$LuceneTestCaseRunner.runChild(LuceneTestCase.java:1413)
	at org.apache.lucene.util.LuceneTestCase$LuceneTestCaseRunner.runChild(LuceneTestCase.java:1331)


REGRESSION:  org.apache.lucene.search.spans.TestSpanExplanationsOfNonMatches.testSNear3

Error Message:
null

Stack Trace:
java.lang.NullPointerException
	at org.apache.lucene.search.TestExplanations.tearDown(TestExplanations.java:64)
	at org.apache.lucene.util.LuceneTestCase$LuceneTestCaseRunner.runChild(LuceneTestCase.java:1413)
	at org.apache.lucene.util.LuceneTestCase$LuceneTestCaseRunner.runChild(LuceneTestCase.java:1331)


REGRESSION:  org.apache.lucene.search.spans.TestSpanExplanationsOfNonMatches.testSNear4

Error Message:
null

Stack Trace:
java.lang.NullPointerException
	at org.apache.lucene.search.TestExplanations.tearDown(TestExplanations.java:64)
	at org.apache.lucene.util.LuceneTestCase$LuceneTestCaseRunner.runChild(LuceneTestCase.java:1413)
	at org.apache.lucene.util.LuceneTestCase$LuceneTestCaseRunner.runChild(LuceneTestCase.java:1331)


REGRESSION:  org.apache.lucene.search.spans.TestSpanExplanationsOfNonMatches.testSNear5

Error Message:
null

Stack Trace:
java.lang.NullPointerException
	at org.apache.lucene.search.TestExplanations.tearDown(TestExplanations.java:64)
	at org.apache.lucene.util.LuceneTestCase$LuceneTestCaseRunner.runChild(LuceneTestCase.java:1413)
	at org.apache.lucene.util.LuceneTestCase$LuceneTestCaseRunner.runChild(LuceneTestCase.java:1331)


REGRESSION:  org.apache.lucene.search.spans.TestSpanExplanationsOfNonMatches.testSNear6

Error Message:
null

Stack Trace:
java.lang.NullPointerException
	at org.apache.lucene.search.TestExplanations.tearDown(TestExplanations.java:64)
	at org.apache.lucene.util.LuceneTestCase$LuceneTestCaseRunner.runChild(LuceneTestCase.java:1413)
	at org.apache.lucene.util.LuceneTestCase$LuceneTestCaseRunner.runChild(LuceneTestCase.java:1331)


REGRESSION:  org.apache.lucene.search.spans.TestSpanExplanationsOfNonMatches.testSNear7

Error Message:
null

Stack Trace:
java.lang.NullPointerException
	at org.apache.lucene.search.TestExplanations.tearDown(TestExplanations.java:64)
	at org.apache.lucene.util.LuceneTestCase$LuceneTestCaseRunner.runChild(LuceneTestCase.java:1413)
	at org.apache.lucene.util.LuceneTestCase$LuceneTestCaseRunner.runChild(LuceneTestCase.java:1331)


REGRESSION:  org.apache.lucene.search.spans.TestSpanExplanationsOfNonMatches.testSNear8

Error Message:
null

Stack Trace:
java.lang.NullPointerException
	at org.apache.lucene.search.TestExplanations.tearDown(TestExplanations.java:64)
	at org.apache.lucene.util.LuceneTestCase$LuceneTestCaseRunner.runChild(LuceneTestCase.java:1413)
	at org.apache.lucene.util.LuceneTestCase$LuceneTestCaseRunner.runChild(LuceneTestCase.java:1331)


REGRESSION:  org.apache.lucene.search.spans.TestSpanExplanationsOfNonMatches.testSNear9

Error Message:
null

Stack Trace:
java.lang.NullPointerException
	at org.apache.lucene.search.TestExplanations.tearDown(TestExplanations.java:64)
	at org.apache.lucene.util.LuceneTestCase$LuceneTestCaseRunner.runChild(LuceneTestCase.java:1413)
	at org.apache.lucene.util.LuceneTestCase$LuceneTestCaseRunner.runChild(LuceneTestCase.java:1331)


REGRESSION:  org.apache.lucene.search.spans.TestSpanExplanationsOfNonMatches.testSNear10

Error Message:
null

Stack Trace:
java.lang.NullPointerException
	at org.apache.lucene.search.TestExplanations.tearDown(TestExplanations.java:64)
	at org.apache.lucene.util.LuceneTestCase$LuceneTestCaseRunner.runChild(LuceneTestCase.java:1413)
	at org.apache.lucene.util.LuceneTestCase$LuceneTestCaseRunner.runChild(LuceneTestCase.java:1331)


REGRESSION:  org.apache.lucene.search.spans.TestSpanExplanationsOfNonMatches.testSNear11

Error Message:
null

Stack Trace:
java.lang.NullPointerException
	at org.apache.lucene.search.TestExplanations.tearDown(TestExplanations.java:64)
	at org.apache.lucene.util.LuceneTestCase$LuceneTestCaseRunner.runChild(LuceneTestCase.java:1413)
	at org.apache.lucene.util.LuceneTestCase$LuceneTestCaseRunner.runChild(LuceneTestCase.java:1331)


REGRESSION:  org.apache.lucene.search.spans.TestSpanExplanationsOfNonMatches.testSNot1

Error Message:
null

Stack Trace:
java.lang.NullPointerException
	at org.apache.lucene.search.TestExplanations.tearDown(TestExplanations.java:64)
	at org.apache.lucene.util.LuceneTestCase$LuceneTestCaseRunner.runChild(LuceneTestCase.java:1413)
	at org.apache.lucene.util.LuceneTestCase$LuceneTestCaseRunner.runChild(LuceneTestCase.java:1331)


REGRESSION:  org.apache.lucene.search.spans.TestSpanExplanationsOfNonMatches.testSNot2

Error Message:
null

Stack Trace:
java.lang.NullPointerException
	at org.apache.lucene.search.TestExplanations.tearDown(TestExplanations.java:64)
	at org.apache.lucene.util.LuceneTestCase$LuceneTestCaseRunner.runChild(LuceneTestCase.java:1413)
	at org.apache.lucene.util.LuceneTestCase$LuceneTestCaseRunner.runChild(LuceneTestCase.java:1331)


REGRESSION:  org.apache.lucene.search.spans.TestSpanExplanationsOfNonMatches.testSNot4

Error Message:
null

Stack Trace:
java.lang.NullPointerException
	at org.apache.lucene.search.TestExplanations.tearDown(TestExplanations.java:64)
	at org.apache.lucene.util.LuceneTestCase$LuceneTestCaseRunner.runChild(LuceneTestCase.java:1413)
	at org.apache.lucene.util.LuceneTestCase$LuceneTestCaseRunner.runChild(LuceneTestCase.java:1331)


REGRESSION:  org.apache.lucene.search.spans.TestSpanExplanationsOfNonMatches.testSNot5

Error Message:
null

Stack Trace:
java.lang.NullPointerException
	at org.apache.lucene.search.TestExplanations.tearDown(TestExplanations.java:64)
	at org.apache.lucene.util.LuceneTestCase$LuceneTestCaseRunner.runChild(LuceneTestCase.java:1413)
	at org.apache.lucene.util.LuceneTestCase$LuceneTestCaseRunner.runChild(LuceneTestCase.java:1331)


REGRESSION:  org.apache.lucene.search.spans.TestSpanExplanationsOfNonMatches.testSNot7

Error Message:
null

Stack Trace:
java.lang.NullPointerException
	at org.apache.lucene.search.TestExplanations.tearDown(TestExplanations.java:64)
	at org.apache.lucene.util.LuceneTestCase$LuceneTestCaseRunner.runChild(LuceneTestCase.java:1413)
	at org.apache.lucene.util.LuceneTestCase$LuceneTestCaseRunner.runChild(LuceneTestCase.java:1331)


REGRESSION:  org.apache.lucene.search.spans.TestSpanExplanationsOfNonMatches.testSNot10

Error Message:
null

Stack Trace:
java.lang.NullPointerException
	at org.apache.lucene.search.TestExplanations.tearDown(TestExplanations.java:64)
	at org.apache.lucene.util.LuceneTestCase$LuceneTestCaseRunner.runChild(LuceneTestCase.java:1413)
	at org.apache.lucene.util.LuceneTestCase$LuceneTestCaseRunner.runChild(LuceneTestCase.java:1331)


REGRESSION:  org.apache.lucene.search.spans.TestSpanExplanationsOfNonMatches.testNoop

Error Message:
null

Stack Trace:
java.lang.NullPointerException
	at org.apache.lucene.search.TestExplanations.tearDown(TestExplanations.java:64)
	at org.apache.lucene.util.LuceneTestCase$LuceneTestCaseRunner.runChild(LuceneTestCase.java:1413)
	at org.apache.lucene.util.LuceneTestCase$LuceneTestCaseRunner.runChild(LuceneTestCase.java:1331)


FAILED:  junit.framework.TestSuite.org.apache.lucene.search.spans.TestSpanExplanationsOfNonMatches

Error Message:
ensure your setUp() calls super.setUp() and your tearDown() calls super.tearDown()!!!

Stack Trace:
junit.framework.AssertionFailedError: ensure your setUp() calls super.setUp() and your tearDown() calls super.tearDown()!!!
	at org.apache.lucene.util.LuceneTestCase.afterClassLuceneTestCaseJ4(LuceneTestCase.java:402)


REGRESSION:  org.apache.lucene.search.spans.TestSpanFirstQuery.testStartPositions

Error Message:
CheckIndex failed

Stack Trace:
java.lang.RuntimeException: CheckIndex failed
	at org.apache.lucene.util._TestUtil.checkIndex(_TestUtil.java:161)
	at org.apache.lucene.util._TestUtil.checkIndex(_TestUtil.java:147)
	at org.apache.lucene.store.MockDirectoryWrapper.close(MockDirectoryWrapper.java:477)
	at org.apache.lucene.search.spans.TestSpanFirstQuery.testStartPositions(TestSpanFirstQuery.java:65)
	at org.apache.lucene.util.LuceneTestCase$LuceneTestCaseRunner.runChild(LuceneTestCase.java:1413)
	at org.apache.lucene.util.LuceneTestCase$LuceneTestCaseRunner.runChild(LuceneTestCase.java:1331)




Build Log (for compile errors):
[...truncated 5781 lines...]



---------------------------------------------------------------------
To unsubscribe, e-mail: dev-unsubscribe@lucene.apache.org
For additional commands, e-mail: dev-help@lucene.apache.org


Mime
View raw message