lucene-dev mailing list archives

Site index · List index
Message view « Date » · « Thread »
Top « Date » · « Thread »
From "Uwe Schindler" <...@thetaphi.de>
Subject RE: [JENKINS] Lucene-Solr-tests-only-3.x - Build # 9695 - Failure
Date Fri, 22 Jul 2011 17:22:15 GMT
Just drop the workspace from the GUI!

-----
Uwe Schindler
H.-H.-Meier-Allee 63, D-28213 Bremen
http://www.thetaphi.de
eMail: uwe@thetaphi.de


> -----Original Message-----
> From: Steven A Rowe [mailto:sarowe@syr.edu]
> Sent: Friday, July 22, 2011 7:01 PM
> To: dev@lucene.apache.org
> Subject: RE: [JENKINS] Lucene-Solr-tests-only-3.x - Build # 9695 - Failure
> 
> I'll take a look at the checkout dir on lucene.zones.apache.org
> 
> > -----Original Message-----
> > From: Robert Muir [mailto:rcmuir@gmail.com]
> > Sent: Friday, July 22, 2011 12:59 PM
> > To: dev@lucene.apache.org
> > Subject: Re: [JENKINS] Lucene-Solr-tests-only-3.x - Build # 9695 -
> > Failure
> >
> > maybe hudson didnt 'clean' itself properly or something?
> >
> >
> > On Fri, Jul 22, 2011 at 12:55 PM, Steven A Rowe <sarowe@syr.edu> wrote:
> > > Yeah, almost certainly.
> > >
> > > All Lucene/Solr tests succeeded for me locally before I committed,
> > though, via 'ant clean test' at the top level.
> > >
> > >> -----Original Message-----
> > >> From: Robert Muir [mailto:rcmuir@gmail.com]
> > >> Sent: Friday, July 22, 2011 12:54 PM
> > >> To: dev@lucene.apache.org
> > >> Subject: Re: [JENKINS] Lucene-Solr-tests-only-3.x - Build # 9695 -
> > >> Failure
> > >>
> > >>     [junit] Caused by: java.lang.RuntimeException: Cannot find
> > >> resource: solr/conf
> > >>
> > >> Maybe related to https://issues.apache.org/jira/browse/SOLR-2659 ?
> > >>
> > >> On Fri, Jul 22, 2011 at 12:51 PM, Apache Jenkins Server
> > >> <jenkins@builds.apache.org> wrote:
> > >> > Build: https://builds.apache.org/job/Lucene-Solr-tests-only-
> > 3.x/9695/
> > >> >
> > >> > 15 tests failed.
> > >> >
> > >>
> > FAILED:
> > junit.framework.TestSuite.org.apache.solr.client.solrj.SolrExamp
> > >> leBinaryTest
> > >> >
> > >> > Error Message:
> > >> > null
> > >> >
> > >> > Stack Trace:
> > >> > java.lang.ExceptionInInitializerError
> > >> >        at
> > >>
> > org.apache.solr.client.solrj.SolrExampleBinaryTest.beforeTest(SolrExam
> > ple
> > >> BinaryTest.java:36)
> > >> > Caused by: java.lang.RuntimeException: Cannot find resource:
> > solr/conf
> > >> >        at
> > >> org.apache.solr.SolrTestCaseJ4.getFile(SolrTestCaseJ4.java:1101)
> > >> >        at
> > >>
> > org.apache.solr.util.ExternalPaths.determineSourceHome(ExternalPaths.j
> > ava
> > >> :40)
> > >> >        at
> > >> org.apache.solr.util.ExternalPaths.<clinit>(ExternalPaths.java:30)
> > >> >
> > >> >
> > >> >
> > >>
> > FAILED:
> > junit.framework.TestSuite.org.apache.solr.client.solrj.TestBatch
> > >> Update
> > >> >
> > >> > Error Message:
> > >> > null
> > >> >
> > >> > Stack Trace:
> > >> > java.lang.ExceptionInInitializerError
> > >> >        at
> > >>
> > org.apache.solr.client.solrj.TestBatchUpdate.beforeTest(TestBatchUpdat
> > e.j
> > >> ava:43)
> > >> > Caused by: java.lang.RuntimeException: Cannot find resource:
> > solr/conf
> > >> >        at
> > >> org.apache.solr.SolrTestCaseJ4.getFile(SolrTestCaseJ4.java:1101)
> > >> >        at
> > >>
> > org.apache.solr.util.ExternalPaths.determineSourceHome(ExternalPaths.j
> > ava
> > >> :40)
> > >> >        at
> > >> org.apache.solr.util.ExternalPaths.<clinit>(ExternalPaths.java:30)
> > >> >
> > >> >
> > >> >
> > FAILED:  org.apache.solr.client.solrj.embedded.JettyWebappTest.testJSP
> > >> >
> > >> > Error Message:
> > >> > Could not initialize class org.apache.solr.util.ExternalPaths
> > >> >
> > >> > Stack Trace:
> > >> > java.lang.NoClassDefFoundError: Could not initialize class
> > >> org.apache.solr.util.ExternalPaths
> > >> >        at
> > >>
> >
> org.apache.solr.client.solrj.embedded.JettyWebappTest.setUp(JettyWebap
> > pTe
> > >> st.java:50)
> > >> >        at
> > >>
> >
> org.apache.lucene.util.LuceneTestCase$LuceneTestCaseRunner.runChild(Lu
> > cen
> > >> eTestCase.java:1299)
> > >> >        at
> > >>
> >
> org.apache.lucene.util.LuceneTestCase$LuceneTestCaseRunner.runChild(Lu
> > cen
> > >> eTestCase.java:1217)
> > >> >
> > >> >
> > >> >
> > >>
> > FAILED:  junit.framework.TestSuite.org.apache.solr.client.solrj.embedded.
> > >> LargeVolumeBinaryJettyTest
> > >> >
> > >> > Error Message:
> > >> > null
> > >> >
> > >> > Stack Trace:
> > >> > java.lang.ExceptionInInitializerError
> > >> >        at
> > >>
> > org.apache.solr.client.solrj.embedded.LargeVolumeBinaryJettyTest.befor
> > eTe
> > >> st(LargeVolumeBinaryJettyTest.java:30)
> > >> > Caused by: java.lang.RuntimeException: Cannot find resource:
> > solr/conf
> > >> >        at
> > >> org.apache.solr.SolrTestCaseJ4.getFile(SolrTestCaseJ4.java:1101)
> > >> >        at
> > >>
> > org.apache.solr.util.ExternalPaths.determineSourceHome(ExternalPaths.j
> > ava
> > >> :40)
> > >> >        at
> > >> org.apache.solr.util.ExternalPaths.<clinit>(ExternalPaths.java:30)
> > >> >
> > >> >
> > >> >
> > >>
> > FAILED:  junit.framework.TestSuite.org.apache.solr.client.solrj.embedded.
> > >> LargeVolumeEmbeddedTest
> > >> >
> > >> > Error Message:
> > >> > Could not initialize class org.apache.solr.util.ExternalPaths
> > >> >
> > >> > Stack Trace:
> > >> > java.lang.NoClassDefFoundError: Could not initialize class
> > >> org.apache.solr.util.ExternalPaths
> > >> >        at
> > >>
> >
> org.apache.solr.client.solrj.embedded.LargeVolumeEmbeddedTest.beforeT
> e
> > st(
> > >> LargeVolumeEmbeddedTest.java:27)
> > >> >
> > >> >
> > >> >
> > >>
> > FAILED:  junit.framework.TestSuite.org.apache.solr.client.solrj.embedded.
> > >> LargeVolumeJettyTest
> > >> >
> > >> > Error Message:
> > >> > null
> > >> >
> > >> > Stack Trace:
> > >> > java.lang.ExceptionInInitializerError
> > >> >        at
> > >>
> > org.apache.solr.client.solrj.embedded.LargeVolumeJettyTest.beforeTest(
> > Lar
> > >> geVolumeJettyTest.java:27)
> > >> > Caused by: java.lang.RuntimeException: Cannot find resource:
> > solr/conf
> > >> >        at
> > >> org.apache.solr.SolrTestCaseJ4.getFile(SolrTestCaseJ4.java:1101)
> > >> >        at
> > >>
> > org.apache.solr.util.ExternalPaths.determineSourceHome(ExternalPaths.j
> > ava
> > >> :40)
> > >> >        at
> > >> org.apache.solr.util.ExternalPaths.<clinit>(ExternalPaths.java:30)
> > >> >
> > >> >
> > >> >
> > >>
> > FAILED:
> > org.apache.solr.client.solrj.embedded.MergeIndexesEmbeddedTest.t
> > >> estMergeIndexesByDirName
> > >> >
> > >> > Error Message:
> > >> > null
> > >> >
> > >> > Stack Trace:
> > >> > java.lang.ExceptionInInitializerError
> > >> >        at
> > >>
> >
> org.apache.solr.client.solrj.MergeIndexesExampleTestBase.getSolrHome(M
> > erg
> > >> eIndexesExampleTestBase.java:44)
> > >> >        at
> > >>
> > org.apache.solr.client.solrj.MergeIndexesExampleTestBase.getSolrConfig
> > Fil
> > >> e(MergeIndexesExampleTestBase.java:54)
> > >> >        at
> > >>
> > org.apache.solr.util.AbstractSolrTestCase.setUp(AbstractSolrTestCase.j
> > ava
> > >> :137)
> > >> >        at
> > >>
> > org.apache.solr.client.solrj.SolrExampleTestBase.setUp(SolrExampleTest
> > Bas
> > >> e.java:43)
> > >> >        at
> > >>
> >
> org.apache.solr.client.solrj.MergeIndexesExampleTestBase.setUp(MergeIn
> > dex
> > >> esExampleTestBase.java:59)
> > >> >        at
> > >>
> >
> org.apache.solr.client.solrj.embedded.MergeIndexesEmbeddedTest.setUp(
> M
> > erg
> > >> eIndexesEmbeddedTest.java:38)
> > >> >        at
> > >>
> >
> org.apache.lucene.util.LuceneTestCase$LuceneTestCaseRunner.runChild(Lu
> > cen
> > >> eTestCase.java:1299)
> > >> >        at
> > >>
> >
> org.apache.lucene.util.LuceneTestCase$LuceneTestCaseRunner.runChild(Lu
> > cen
> > >> eTestCase.java:1217)
> > >> > Caused by: java.lang.RuntimeException: Cannot find resource:
> > solr/conf
> > >> >        at
> > >> org.apache.solr.SolrTestCaseJ4.getFile(SolrTestCaseJ4.java:1101)
> > >> >        at
> > >>
> > org.apache.solr.util.ExternalPaths.determineSourceHome(ExternalPaths.j
> > ava
> > >> :40)
> > >> >        at
> > >> org.apache.solr.util.ExternalPaths.<clinit>(ExternalPaths.java:30)
> > >> >
> > >> >
> > >> >
> > >>
> > FAILED:
> > org.apache.solr.client.solrj.embedded.MergeIndexesEmbeddedTest.t
> > >> estMergeIndexesByCoreName
> > >> >
> > >> > Error Message:
> > >> > Could not initialize class org.apache.solr.util.ExternalPaths
> > >> >
> > >> > Stack Trace:
> > >> > java.lang.NoClassDefFoundError: Could not initialize class
> > >> org.apache.solr.util.ExternalPaths
> > >> >        at
> > >>
> >
> org.apache.solr.client.solrj.MergeIndexesExampleTestBase.getSolrHome(M
> > erg
> > >> eIndexesExampleTestBase.java:44)
> > >> >        at
> > >>
> > org.apache.solr.client.solrj.MergeIndexesExampleTestBase.getSolrConfig
> > Fil
> > >> e(MergeIndexesExampleTestBase.java:54)
> > >> >        at
> > >>
> > org.apache.solr.util.AbstractSolrTestCase.setUp(AbstractSolrTestCase.j
> > ava
> > >> :137)
> > >> >        at
> > >>
> > org.apache.solr.client.solrj.SolrExampleTestBase.setUp(SolrExampleTest
> > Bas
> > >> e.java:43)
> > >> >        at
> > >>
> >
> org.apache.solr.client.solrj.MergeIndexesExampleTestBase.setUp(MergeIn
> > dex
> > >> esExampleTestBase.java:59)
> > >> >        at
> > >>
> >
> org.apache.solr.client.solrj.embedded.MergeIndexesEmbeddedTest.setUp(
> M
> > erg
> > >> eIndexesEmbeddedTest.java:38)
> > >> >        at
> > >>
> >
> org.apache.lucene.util.LuceneTestCase$LuceneTestCaseRunner.runChild(Lu
> > cen
> > >> eTestCase.java:1299)
> > >> >        at
> > >>
> >
> org.apache.lucene.util.LuceneTestCase$LuceneTestCaseRunner.runChild(Lu
> > cen
> > >> eTestCase.java:1217)
> > >> >
> > >> >
> > >> >
> > >>
> > FAILED:
> > org.apache.solr.client.solrj.embedded.MultiCoreEmbeddedTest.test
> > >> MultiCore
> > >> >
> > >> > Error Message:
> > >> > Could not initialize class org.apache.solr.util.ExternalPaths
> > >> >
> > >> > Stack Trace:
> > >> > java.lang.NoClassDefFoundError: Could not initialize class
> > >> org.apache.solr.util.ExternalPaths
> > >> >        at
> > >>
> > org.apache.solr.client.solrj.MultiCoreExampleTestBase.getSolrHome(Mult
> > iCo
> > >> reExampleTestBase.java:43)
> > >> >        at
> > >>
> > org.apache.solr.client.solrj.MultiCoreExampleTestBase.getSolrConfigFil
> > e(M
> > >> ultiCoreExampleTestBase.java:46)
> > >> >        at
> > >>
> > org.apache.solr.util.AbstractSolrTestCase.setUp(AbstractSolrTestCase.j
> > ava
> > >> :137)
> > >> >        at
> > >>
> > org.apache.solr.client.solrj.SolrExampleTestBase.setUp(SolrExampleTest
> > Bas
> > >> e.java:43)
> > >> >        at
> > >>
> > org.apache.solr.client.solrj.MultiCoreExampleTestBase.setUp(MultiCoreE
> > xam
> > >> pleTestBase.java:49)
> > >> >        at
> > >>
> >
> org.apache.solr.client.solrj.embedded.MultiCoreEmbeddedTest.setUp(Mult
> > iCo
> > >> reEmbeddedTest.java:37)
> > >> >        at
> > >>
> >
> org.apache.lucene.util.LuceneTestCase$LuceneTestCaseRunner.runChild(Lu
> > cen
> > >> eTestCase.java:1299)
> > >> >        at
> > >>
> >
> org.apache.lucene.util.LuceneTestCase$LuceneTestCaseRunner.runChild(Lu
> > cen
> > >> eTestCase.java:1217)
> > >> >
> > >> >
> > >> >
> > >>
> > FAILED:
> org.apache.solr.client.solrj.embedded.MultiCoreExampleJettyTest.
> > >> testMultiCore
> > >> >
> > >> > Error Message:
> > >> > null
> > >> >
> > >> > Stack Trace:
> > >> > java.lang.ExceptionInInitializerError
> > >> >        at
> > >>
> > org.apache.solr.client.solrj.MultiCoreExampleTestBase.getSolrHome(Mult
> > iCo
> > >> reExampleTestBase.java:43)
> > >> >        at
> > >>
> > org.apache.solr.client.solrj.MultiCoreExampleTestBase.getSolrConfigFil
> > e(M
> > >> ultiCoreExampleTestBase.java:46)
> > >> >        at
> > >>
> > org.apache.solr.util.AbstractSolrTestCase.setUp(AbstractSolrTestCase.j
> > ava
> > >> :137)
> > >> >        at
> > >>
> > org.apache.solr.client.solrj.SolrExampleTestBase.setUp(SolrExampleTest
> > Bas
> > >> e.java:43)
> > >> >        at
> > >>
> > org.apache.solr.client.solrj.MultiCoreExampleTestBase.setUp(MultiCoreE
> > xam
> > >> pleTestBase.java:49)
> > >> >        at
> > >>
> > org.apache.solr.client.solrj.embedded.MultiCoreExampleJettyTest.setUp(
> > Mul
> > >> tiCoreExampleJettyTest.java:43)
> > >> >        at
> > >>
> >
> org.apache.lucene.util.LuceneTestCase$LuceneTestCaseRunner.runChild(Lu
> > cen
> > >> eTestCase.java:1299)
> > >> >        at
> > >>
> >
> org.apache.lucene.util.LuceneTestCase$LuceneTestCaseRunner.runChild(Lu
> > cen
> > >> eTestCase.java:1217)
> > >> > Caused by: java.lang.RuntimeException: Cannot find resource:
> > solr/conf
> > >> >        at
> > >> org.apache.solr.SolrTestCaseJ4.getFile(SolrTestCaseJ4.java:1101)
> > >> >        at
> > >>
> > org.apache.solr.util.ExternalPaths.determineSourceHome(ExternalPaths.j
> > ava
> > >> :40)
> > >> >        at
> > >> org.apache.solr.util.ExternalPaths.<clinit>(ExternalPaths.java:30)
> > >> >
> > >> >
> > >> >
> > >>
> > FAILED:  junit.framework.TestSuite.org.apache.solr.client.solrj.embedded.
> > >> SolrExampleEmbeddedTest
> > >> >
> > >> > Error Message:
> > >> > Could not initialize class org.apache.solr.util.ExternalPaths
> > >> >
> > >> > Stack Trace:
> > >> > java.lang.NoClassDefFoundError: Could not initialize class
> > >> org.apache.solr.util.ExternalPaths
> > >> >        at
> > >>
> >
> org.apache.solr.client.solrj.embedded.SolrExampleEmbeddedTest.beforeTe
> > st(
> > >> SolrExampleEmbeddedTest.java:34)
> > >> >
> > >> >
> > >> >
> > >>
> > FAILED:  junit.framework.TestSuite.org.apache.solr.client.solrj.embedded.
> > >> SolrExampleJettyTest
> > >> >
> > >> > Error Message:
> > >> > null
> > >> >
> > >> > Stack Trace:
> > >> > java.lang.ExceptionInInitializerError
> > >> >        at
> > >>
> > org.apache.solr.client.solrj.embedded.SolrExampleJettyTest.beforeTest(
> > Sol
> > >> rExampleJettyTest.java:37)
> > >> > Caused by: java.lang.RuntimeException: Cannot find resource:
> > solr/conf
> > >> >        at
> > >> org.apache.solr.SolrTestCaseJ4.getFile(SolrTestCaseJ4.java:1101)
> > >> >        at
> > >>
> > org.apache.solr.util.ExternalPaths.determineSourceHome(ExternalPaths.j
> > ava
> > >> :40)
> > >> >        at
> > >> org.apache.solr.util.ExternalPaths.<clinit>(ExternalPaths.java:30)
> > >> >
> > >> >
> > >> >
> > >>
> > FAILED:  junit.framework.TestSuite.org.apache.solr.client.solrj.embedded.
> > >> SolrExampleStreamingTest
> > >> >
> > >> > Error Message:
> > >> > Could not initialize class org.apache.solr.util.ExternalPaths
> > >> >
> > >> > Stack Trace:
> > >> > java.lang.NoClassDefFoundError: Could not initialize class
> > >> org.apache.solr.util.ExternalPaths
> > >> >        at
> > >>
> > org.apache.solr.client.solrj.embedded.SolrExampleStreamingTest.beforeT
> > est
> > >> (SolrExampleStreamingTest.java:36)
> > >> >
> > >> >
> > >> >
> > >>
> > FAILED:  junit.framework.TestSuite.org.apache.solr.client.solrj.response.
> > >> TermsResponseTest
> > >> >
> > >> > Error Message:
> > >> > Could not initialize class org.apache.solr.util.ExternalPaths
> > >> >
> > >> > Stack Trace:
> > >> > java.lang.NoClassDefFoundError: Could not initialize class
> > >> org.apache.solr.util.ExternalPaths
> > >> >        at
> > >>
> > org.apache.solr.client.solrj.response.TermsResponseTest.beforeTest(Ter
> > msR
> > >> esponseTest.java:38)
> > >> >
> > >> >
> > >> >
> > >>
> > FAILED:  junit.framework.TestSuite.org.apache.solr.client.solrj.response.
> > >> TestSpellCheckResponse
> > >> >
> > >> > Error Message:
> > >> > Could not initialize class org.apache.solr.util.ExternalPaths
> > >> >
> > >> > Stack Trace:
> > >> > java.lang.NoClassDefFoundError: Could not initialize class
> > >> org.apache.solr.util.ExternalPaths
> > >> >        at
> > >>
> > org.apache.solr.client.solrj.response.TestSpellCheckResponse.beforeTes
> > t(T
> > >> estSpellCheckResponse.java:44)
> > >> >
> > >> >
> > >> >
> > >> >
> > >> > Build Log (for compile errors):
> > >> > [...truncated 13804 lines...]
> > >> >
> > >> >
> > >> >
> > >> > -----------------------------------------------------------------
> > >> > ---
> > -
> > >> > To unsubscribe, e-mail: dev-unsubscribe@lucene.apache.org For
> > >> > additional commands, e-mail: dev-help@lucene.apache.org
> > >> >
> > >> >
> > >>
> > >>
> > >>
> > >> --
> > >> lucidimagination.com
> > >>
> > >> -------------------------------------------------------------------
> > >> -- To unsubscribe, e-mail: dev-unsubscribe@lucene.apache.org For
> > >> additional commands, e-mail: dev-help@lucene.apache.org
> > >
> > >
> >
> >
> >
> > --
> > lucidimagination.com
> >
> > ---------------------------------------------------------------------
> > To unsubscribe, e-mail: dev-unsubscribe@lucene.apache.org For
> > additional commands, e-mail: dev-help@lucene.apache.org



---------------------------------------------------------------------
To unsubscribe, e-mail: dev-unsubscribe@lucene.apache.org
For additional commands, e-mail: dev-help@lucene.apache.org


Mime
View raw message