lucene-dev mailing list archives

Site index · List index
Message view « Date » · « Thread »
Top « Date » · « Thread »
From "Uwe Schindler" <...@thetaphi.de>
Subject RE: [JENKINS] Lucene-Solr-tests-only-trunk-java7 - Build # 34 - Failure
Date Tue, 26 Jul 2011 15:17:04 GMT
Yonik, same problem still there:

    [junit] NOTE: reproduce with: ant test -Dtestcase=TestRealTimeGet -Dtestmethod=testStressGetRealtime
-Dtests.seed=-5497110170060928176:-4129666932955567608 -Dtests.multiplier=3
    [junit] The following exceptions were thrown by threads:
    [junit] *** Thread: READER0 ***
    [junit] java.lang.AssertionError: java.lang.AssertionError: expected:<1> but was:<2>
    [junit] 	at org.junit.Assert.fail(Assert.java:91)
    [junit] 	at org.apache.solr.search.TestRealTimeGet$2.run(TestRealTimeGet.java:239)
    [junit] *** Thread: READER6 ***
    [junit] java.lang.AssertionError: java.lang.AssertionError: expected:<1> but was:<2>
    [junit] 	at org.junit.Assert.fail(Assert.java:91)
    [junit] 	at org.apache.solr.search.TestRealTimeGet$2.run(TestRealTimeGet.java:239)
    [junit] NOTE: test params are: codec=RandomCodecProvider: {id=MockVariableIntBlock(baseBlockSize=15),
val_l=MockSep}, locale=ar_DZ, timezone=GMT0
    [junit] NOTE: all tests run in this JVM:
    [junit] [ConvertedLegacyTest, TestTrie, CommonGramsQueryFilterFactoryTest, TestCJKTokenizerFactory,
TestIndonesianStemFilterFactory, TestKStemFilterFactory, TestKeepFilterFactory, TestLatvianStemFilterFactory,
TestMappingCharFilterFactory, TestPatternReplaceFilterFactory, TestPortugueseLightStemFilterFactory,
RAMDirectoryFactoryTest, TestConfig, TestPropInjectDefaults, JsonLoaderTest, DistributedTermsComponentTest,
TermVectorComponentTest, FastVectorHighlighterTest, TestCSVResponseWriter, DateFieldTest,
TestDocSet, TestRealTimeGet]
    [junit] NOTE: FreeBSD 8.2-RELEASE amd64/Oracle Corporation 1.7.0 (64-bit)/cpus=16,threads=8,free=205637192,total=240648192
    [junit] ------------- ---------------- ---------------
    [junit] TEST org.apache.solr.search.TestRealTimeGet FAILED

Uwe

-----
Uwe Schindler
H.-H.-Meier-Allee 63, D-28213 Bremen
http://www.thetaphi.de
eMail: uwe@thetaphi.de

> -----Original Message-----
> From: Apache Jenkins Server [mailto:jenkins@builds.apache.org]
> Sent: Tuesday, July 26, 2011 4:54 PM
> To: dev@lucene.apache.org
> Subject: [JENKINS] Lucene-Solr-tests-only-trunk-java7 - Build # 34 - Failure
> 
> Build: https://builds.apache.org/job/Lucene-Solr-tests-only-trunk-java7/34/
> 
> 1 tests failed.
> REGRESSION:
> org.apache.solr.search.TestRealTimeGet.testStressGetRealtime
> 
> Error Message:
> Some threads threw uncaught exceptions!
> 
> Stack Trace:
> junit.framework.AssertionFailedError: Some threads threw uncaught
> exceptions!
> 	at
> org.apache.lucene.util.LuceneTestCase$LuceneTestCaseRunner.runChild(Luc
> eneTestCase.java:1503)
> 	at
> org.apache.lucene.util.LuceneTestCase$LuceneTestCaseRunner.runChild(Luc
> eneTestCase.java:1408)
> 	at
> org.apache.lucene.util.LuceneTestCase.tearDown(LuceneTestCase.java:620)
> 	at org.apache.solr.SolrTestCaseJ4.tearDown(SolrTestCaseJ4.java:99)
> 
> 
> 
> 
> Build Log (for compile errors):
> [...truncated 11269 lines...]
> 
> 
> 
> ---------------------------------------------------------------------
> To unsubscribe, e-mail: dev-unsubscribe@lucene.apache.org For additional
> commands, e-mail: dev-help@lucene.apache.org


---------------------------------------------------------------------
To unsubscribe, e-mail: dev-unsubscribe@lucene.apache.org
For additional commands, e-mail: dev-help@lucene.apache.org


Mime
View raw message