lucene-dev mailing list archives

Site index · List index
Message view « Date » · « Thread »
Top « Date » · « Thread »
From Simon Willnauer <simon.willna...@googlemail.com>
Subject Re: [JENKINS] Lucene-Solr-tests-only-3.x - Build # 8781 - Still Failing
Date Sun, 12 Jun 2011 09:09:16 GMT
seems there is a problem with this check here... if no segs are present...

I don't have time to port etc. can somebody else go and do it?
something like that:

Index: lucene/src/java/org/apache/lucene/index/CheckIndex.java
===================================================================
--- lucene/src/java/org/apache/lucene/index/CheckIndex.java	(revision 1134890)
+++ lucene/src/java/org/apache/lucene/index/CheckIndex.java	(working copy)
@@ -568,7 +568,7 @@
     } else
       msg("WARNING: " + result.numBadSegments + " broken segments
(containing " + result.totLoseDocCount + " documents) detected");

-    if ( ! (result.validCounter = (result.maxSegmentName < sis.counter))) {
+    if ( result.maxSegmentName != 0 && ! (result.validCounter =
(result.maxSegmentName < sis.counter))) {
       result.clean = false;
       result.newSegments.counter = result.maxSegmentName + 1;
       msg("ERROR: Next segment name counter " + sis.counter + " is
not greater than max segment name " + result.maxSegmentName);


On Sun, Jun 12, 2011 at 11:00 AM, Uwe Schindler <uwe@thetaphi.de> wrote:
> We have some serious problem with CheckIndex on 3.x and trunk, seems to be related to
Steven's changes?
>
> -----
> Uwe Schindler
> H.-H.-Meier-Allee 63, D-28213 Bremen
> http://www.thetaphi.de
> eMail: uwe@thetaphi.de
>
>> -----Original Message-----
>> From: Apache Jenkins Server [mailto:jenkins@builds.apache.org]
>> Sent: Sunday, June 12, 2011 10:53 AM
>> To: dev@lucene.apache.org
>> Subject: [JENKINS] Lucene-Solr-tests-only-3.x - Build # 8781 - Still Failing
>>
>> Build: https://builds.apache.org/job/Lucene-Solr-tests-only-3.x/8781/
>>
>> 62 tests failed.
>> REGRESSION:
>> org.apache.lucene.index.TestAddIndexes.testAddIndexesWithCloseNoWait
>>
>> Error Message:
>> CheckIndex failed
>>
>> Stack Trace:
>> java.lang.RuntimeException: CheckIndex failed
>>       at org.apache.lucene.util._TestUtil.checkIndex(_TestUtil.java:147)
>>       at
>> org.apache.lucene.store.MockDirectoryWrapper.close(MockDirectoryWrapp
>> er.java:481)
>>       at
>> org.apache.lucene.index.TestAddIndexes$RunAddIndexesThreads.closeDir(
>> TestAddIndexes.java:693)
>>       at
>> org.apache.lucene.index.TestAddIndexes.testAddIndexesWithCloseNoWait(
>> TestAddIndexes.java:901)
>>       at
>> org.apache.lucene.util.LuceneTestCase$LuceneTestCaseRunner.runChild(Luc
>> eneTestCase.java:1268)
>>       at
>> org.apache.lucene.util.LuceneTestCase$LuceneTestCaseRunner.runChild(Luc
>> eneTestCase.java:1186)
>>
>>
>> REGRESSION:
>> org.apache.lucene.index.TestAddIndexes.testAddIndexesWithRollback
>>
>> Error Message:
>> CheckIndex failed
>>
>> Stack Trace:
>> java.lang.RuntimeException: CheckIndex failed
>>       at org.apache.lucene.util._TestUtil.checkIndex(_TestUtil.java:147)
>>       at
>> org.apache.lucene.store.MockDirectoryWrapper.close(MockDirectoryWrapp
>> er.java:481)
>>       at
>> org.apache.lucene.index.TestAddIndexes$RunAddIndexesThreads.closeDir(
>> TestAddIndexes.java:693)
>>       at
>> org.apache.lucene.index.TestAddIndexes.testAddIndexesWithRollback(Test
>> AddIndexes.java:924)
>>       at
>> org.apache.lucene.util.LuceneTestCase$LuceneTestCaseRunner.runChild(Luc
>> eneTestCase.java:1268)
>>       at
>> org.apache.lucene.util.LuceneTestCase$LuceneTestCaseRunner.runChild(Luc
>> eneTestCase.java:1186)
>>
>>
>> FAILED:  org.apache.lucene.index.TestCrash.testCrashWhileIndexing
>>
>> Error Message:
>> CheckIndex failed
>>
>> Stack Trace:
>> java.lang.RuntimeException: CheckIndex failed
>>       at org.apache.lucene.util._TestUtil.checkIndex(_TestUtil.java:147)
>>       at
>> org.apache.lucene.store.MockDirectoryWrapper.close(MockDirectoryWrapp
>> er.java:481)
>>       at
>> org.apache.lucene.index.TestCrash.testCrashWhileIndexing(TestCrash.java:7
>> 7)
>>       at
>> org.apache.lucene.util.LuceneTestCase$LuceneTestCaseRunner.runChild(Luc
>> eneTestCase.java:1268)
>>       at
>> org.apache.lucene.util.LuceneTestCase$LuceneTestCaseRunner.runChild(Luc
>> eneTestCase.java:1186)
>>
>>
>> FAILED:  org.apache.lucene.index.TestIndexWriter.testIndexNoDocuments
>>
>> Error Message:
>> CheckIndex failed
>>
>> Stack Trace:
>> java.lang.RuntimeException: CheckIndex failed
>>       at org.apache.lucene.util._TestUtil.checkIndex(_TestUtil.java:147)
>>       at
>> org.apache.lucene.store.MockDirectoryWrapper.close(MockDirectoryWrapp
>> er.java:481)
>>       at
>> org.apache.lucene.index.TestIndexWriter.testIndexNoDocuments(TestInde
>> xWriter.java:343)
>>       at
>> org.apache.lucene.util.LuceneTestCase$LuceneTestCaseRunner.runChild(Luc
>> eneTestCase.java:1268)
>>       at
>> org.apache.lucene.util.LuceneTestCase$LuceneTestCaseRunner.runChild(Luc
>> eneTestCase.java:1186)
>>
>>
>> FAILED:  org.apache.lucene.index.TestIndexWriter.testOtherFiles
>>
>> Error Message:
>> CheckIndex failed
>>
>> Stack Trace:
>> java.lang.RuntimeException: CheckIndex failed
>>       at org.apache.lucene.util._TestUtil.checkIndex(_TestUtil.java:147)
>>       at
>> org.apache.lucene.store.MockDirectoryWrapper.close(MockDirectoryWrapp
>> er.java:481)
>>       at
>> org.apache.lucene.index.TestIndexWriter.testOtherFiles(TestIndexWriter.ja
>> va:1307)
>>       at
>> org.apache.lucene.util.LuceneTestCase$LuceneTestCaseRunner.runChild(Luc
>> eneTestCase.java:1268)
>>       at
>> org.apache.lucene.util.LuceneTestCase$LuceneTestCaseRunner.runChild(Luc
>> eneTestCase.java:1186)
>>
>>
>> FAILED:
>> org.apache.lucene.index.TestIndexWriter.testEmptyFSDirWithNoLock
>>
>> Error Message:
>> CheckIndex failed
>>
>> Stack Trace:
>> java.lang.RuntimeException: CheckIndex failed
>>       at org.apache.lucene.util._TestUtil.checkIndex(_TestUtil.java:147)
>>       at
>> org.apache.lucene.store.MockDirectoryWrapper.close(MockDirectoryWrapp
>> er.java:481)
>>       at
>> org.apache.lucene.index.TestIndexWriter.testEmptyFSDirWithNoLock(TestIn
>> dexWriter.java:1698)
>>       at
>> org.apache.lucene.util.LuceneTestCase$LuceneTestCaseRunner.runChild(Luc
>> eneTestCase.java:1268)
>>       at
>> org.apache.lucene.util.LuceneTestCase$LuceneTestCaseRunner.runChild(Luc
>> eneTestCase.java:1186)
>>
>>
>> FAILED:  org.apache.lucene.index.TestIndexWriterCommit.testNoCommits
>>
>> Error Message:
>> CheckIndex failed
>>
>> Stack Trace:
>> java.lang.RuntimeException: CheckIndex failed
>>       at org.apache.lucene.util._TestUtil.checkIndex(_TestUtil.java:147)
>>       at
>> org.apache.lucene.store.MockDirectoryWrapper.close(MockDirectoryWrapp
>> er.java:481)
>>       at
>> org.apache.lucene.index.TestIndexWriterCommit.testNoCommits(TestIndex
>> WriterCommit.java:501)
>>       at
>> org.apache.lucene.util.LuceneTestCase$LuceneTestCaseRunner.runChild(Luc
>> eneTestCase.java:1268)
>>       at
>> org.apache.lucene.util.LuceneTestCase$LuceneTestCaseRunner.runChild(Luc
>> eneTestCase.java:1186)
>>
>>
>> FAILED:
>> org.apache.lucene.index.TestIndexWriterCommit.testPrepareCommitNoCha
>> nges
>>
>> Error Message:
>> CheckIndex failed
>>
>> Stack Trace:
>> java.lang.RuntimeException: CheckIndex failed
>>       at org.apache.lucene.util._TestUtil.checkIndex(_TestUtil.java:147)
>>       at
>> org.apache.lucene.store.MockDirectoryWrapper.close(MockDirectoryWrapp
>> er.java:481)
>>       at
>> org.apache.lucene.index.TestIndexWriterCommit.testPrepareCommitNoCha
>> nges(TestIndexWriterCommit.java:628)
>>       at
>> org.apache.lucene.util.LuceneTestCase$LuceneTestCaseRunner.runChild(Luc
>> eneTestCase.java:1268)
>>       at
>> org.apache.lucene.util.LuceneTestCase$LuceneTestCaseRunner.runChild(Luc
>> eneTestCase.java:1186)
>>
>>
>> FAILED:
>> org.apache.lucene.index.TestIndexWriterConfig.testIndexWriterSetters
>>
>> Error Message:
>> CheckIndex failed
>>
>> Stack Trace:
>> java.lang.RuntimeException: CheckIndex failed
>>       at org.apache.lucene.util._TestUtil.checkIndex(_TestUtil.java:147)
>>       at
>> org.apache.lucene.store.MockDirectoryWrapper.close(MockDirectoryWrapp
>> er.java:481)
>>       at
>> org.apache.lucene.index.TestIndexWriterConfig.testIndexWriterSetters(Tes
>> tIndexWriterConfig.java:306)
>>       at
>> org.apache.lucene.util.LuceneTestCase$LuceneTestCaseRunner.runChild(Luc
>> eneTestCase.java:1268)
>>       at
>> org.apache.lucene.util.LuceneTestCase$LuceneTestCaseRunner.runChild(Luc
>> eneTestCase.java:1186)
>>
>>
>> FAILED:
>> org.apache.lucene.index.TestIndexWriterExceptions.testRandomExceptions
>>
>> Error Message:
>> CheckIndex failed
>>
>> Stack Trace:
>> java.lang.RuntimeException: CheckIndex failed
>>       at org.apache.lucene.util._TestUtil.checkIndex(_TestUtil.java:147)
>>       at
>> org.apache.lucene.index.TestIndexWriterExceptions$IndexerThread.run(Tes
>> tIndexWriterExceptions.java:106)
>>       at
>> org.apache.lucene.index.TestIndexWriterExceptions.testRandomExceptions
>> (TestIndexWriterExceptions.java:181)
>>       at
>> org.apache.lucene.util.LuceneTestCase$LuceneTestCaseRunner.runChild(Luc
>> eneTestCase.java:1268)
>>       at
>> org.apache.lucene.util.LuceneTestCase$LuceneTestCaseRunner.runChild(Luc
>> eneTestCase.java:1186)
>>
>>
>> FAILED:
>> org.apache.lucene.index.TestIndexWriterExceptions.testRandomExceptions
>> Threads
>>
>> Error Message:
>> Some threads threw uncaught exceptions!
>>
>> Stack Trace:
>> junit.framework.AssertionFailedError: Some threads threw uncaught
>> exceptions!
>>       at
>> org.apache.lucene.util.LuceneTestCase$LuceneTestCaseRunner.runChild(Luc
>> eneTestCase.java:1268)
>>       at
>> org.apache.lucene.util.LuceneTestCase$LuceneTestCaseRunner.runChild(Luc
>> eneTestCase.java:1186)
>>       at
>> org.apache.lucene.util.LuceneTestCase.tearDown(LuceneTestCase.java:468)
>>
>>
>> FAILED:  org.apache.lucene.index.TestIndexWriterReader.testAfterCommit
>>
>> Error Message:
>> CheckIndex failed
>>
>> Stack Trace:
>> java.lang.RuntimeException: CheckIndex failed
>>       at org.apache.lucene.util._TestUtil.checkIndex(_TestUtil.java:147)
>>       at
>> org.apache.lucene.index.TestIndexWriterReader.testAfterCommit(TestInde
>> xWriterReader.java:678)
>>       at
>> org.apache.lucene.util.LuceneTestCase$LuceneTestCaseRunner.runChild(Luc
>> eneTestCase.java:1268)
>>       at
>> org.apache.lucene.util.LuceneTestCase$LuceneTestCaseRunner.runChild(Luc
>> eneTestCase.java:1186)
>>
>>
>> FAILED:  org.apache.lucene.index.TestIndexWriterReader.testEmptyIndex
>>
>> Error Message:
>> CheckIndex failed
>>
>> Stack Trace:
>> java.lang.RuntimeException: CheckIndex failed
>>       at org.apache.lucene.util._TestUtil.checkIndex(_TestUtil.java:147)
>>       at
>> org.apache.lucene.store.MockDirectoryWrapper.close(MockDirectoryWrapp
>> er.java:481)
>>       at
>> org.apache.lucene.index.TestIndexWriterReader.testEmptyIndex(TestIndex
>> WriterReader.java:965)
>>       at
>> org.apache.lucene.util.LuceneTestCase$LuceneTestCaseRunner.runChild(Luc
>> eneTestCase.java:1268)
>>       at
>> org.apache.lucene.util.LuceneTestCase$LuceneTestCaseRunner.runChild(Luc
>> eneTestCase.java:1186)
>>
>>
>> FAILED:  org.apache.lucene.index.TestNewestSegment.testNewestSegment
>>
>> Error Message:
>> CheckIndex failed
>>
>> Stack Trace:
>> java.lang.RuntimeException: CheckIndex failed
>>       at org.apache.lucene.util._TestUtil.checkIndex(_TestUtil.java:147)
>>       at
>> org.apache.lucene.store.MockDirectoryWrapper.close(MockDirectoryWrapp
>> er.java:481)
>>       at
>> org.apache.lucene.index.TestNewestSegment.testNewestSegment(TestNe
>> westSegment.java:31)
>>       at
>> org.apache.lucene.util.LuceneTestCase$LuceneTestCaseRunner.runChild(Luc
>> eneTestCase.java:1268)
>>       at
>> org.apache.lucene.util.LuceneTestCase$LuceneTestCaseRunner.runChild(Luc
>> eneTestCase.java:1186)
>>
>>
>> FAILED:
>> org.apache.lucene.index.TestParallelReaderEmptyIndex.testEmptyIndex
>>
>> Error Message:
>> CheckIndex failed
>>
>> Stack Trace:
>> java.lang.RuntimeException: CheckIndex failed
>>       at org.apache.lucene.util._TestUtil.checkIndex(_TestUtil.java:147)
>>       at
>> org.apache.lucene.store.MockDirectoryWrapper.close(MockDirectoryWrapp
>> er.java:481)
>>       at
>> org.apache.lucene.index.TestParallelReaderEmptyIndex.testEmptyIndex(Te
>> stParallelReaderEmptyIndex.java:66)
>>       at
>> org.apache.lucene.util.LuceneTestCase$LuceneTestCaseRunner.runChild(Luc
>> eneTestCase.java:1268)
>>       at
>> org.apache.lucene.util.LuceneTestCase$LuceneTestCaseRunner.runChild(Luc
>> eneTestCase.java:1186)
>>
>>
>> FAILED:
>> org.apache.lucene.index.TestPersistentSnapshotDeletionPolicy.testIllegalSn
>> apshotId
>>
>> Error Message:
>> CheckIndex failed
>>
>> Stack Trace:
>> java.lang.RuntimeException: CheckIndex failed
>>       at org.apache.lucene.util._TestUtil.checkIndex(_TestUtil.java:147)
>>       at
>> org.apache.lucene.store.MockDirectoryWrapper.close(MockDirectoryWrapp
>> er.java:481)
>>       at
>> org.apache.lucene.index.TestPersistentSnapshotDeletionPolicy.tearDown(T
>> estPersistentSnapshotDeletionPolicy.java:51)
>>       at
>> org.apache.lucene.util.LuceneTestCase$LuceneTestCaseRunner.runChild(Luc
>> eneTestCase.java:1268)
>>       at
>> org.apache.lucene.util.LuceneTestCase$LuceneTestCaseRunner.runChild(Luc
>> eneTestCase.java:1186)
>>
>>
>> FAILED:
>> org.apache.lucene.index.TestPersistentSnapshotDeletionPolicy.testInvalidSn
>> apshotInfos
>>
>> Error Message:
>> null
>>
>> Stack Trace:
>> java.lang.NullPointerException
>>       at
>> org.apache.lucene.index.TestPersistentSnapshotDeletionPolicy.tearDown(T
>> estPersistentSnapshotDeletionPolicy.java:51)
>>       at
>> org.apache.lucene.util.LuceneTestCase$LuceneTestCaseRunner.runChild(Luc
>> eneTestCase.java:1268)
>>       at
>> org.apache.lucene.util.LuceneTestCase$LuceneTestCaseRunner.runChild(Luc
>> eneTestCase.java:1186)
>>
>>
>> FAILED:
>> org.apache.lucene.index.TestPersistentSnapshotDeletionPolicy.testNoSnaps
>> hotInfos
>>
>> Error Message:
>> null
>>
>> Stack Trace:
>> java.lang.NullPointerException
>>       at
>> org.apache.lucene.index.TestPersistentSnapshotDeletionPolicy.tearDown(T
>> estPersistentSnapshotDeletionPolicy.java:51)
>>       at
>> org.apache.lucene.util.LuceneTestCase$LuceneTestCaseRunner.runChild(Luc
>> eneTestCase.java:1268)
>>       at
>> org.apache.lucene.util.LuceneTestCase$LuceneTestCaseRunner.runChild(Luc
>> eneTestCase.java:1186)
>>
>>
>> FAILED:
>> org.apache.lucene.index.TestPersistentSnapshotDeletionPolicy.testTooMan
>> ySnapshotInfos
>>
>> Error Message:
>> null
>>
>> Stack Trace:
>> java.lang.NullPointerException
>>       at
>> org.apache.lucene.index.TestPersistentSnapshotDeletionPolicy.tearDown(T
>> estPersistentSnapshotDeletionPolicy.java:51)
>>       at
>> org.apache.lucene.util.LuceneTestCase$LuceneTestCaseRunner.runChild(Luc
>> eneTestCase.java:1268)
>>       at
>> org.apache.lucene.util.LuceneTestCase$LuceneTestCaseRunner.runChild(Luc
>> eneTestCase.java:1186)
>>
>>
>> FAILED:
>> org.apache.lucene.index.TestPersistentSnapshotDeletionPolicy.testSnapsho
>> tRelease
>>
>> Error Message:
>> null
>>
>> Stack Trace:
>> java.lang.NullPointerException
>>       at
>> org.apache.lucene.index.TestPersistentSnapshotDeletionPolicy.tearDown(T
>> estPersistentSnapshotDeletionPolicy.java:51)
>>       at
>> org.apache.lucene.util.LuceneTestCase$LuceneTestCaseRunner.runChild(Luc
>> eneTestCase.java:1268)
>>       at
>> org.apache.lucene.util.LuceneTestCase$LuceneTestCaseRunner.runChild(Luc
>> eneTestCase.java:1186)
>>
>>
>> FAILED:
>> org.apache.lucene.index.TestPersistentSnapshotDeletionPolicy.testStaticRe
>> ad
>>
>> Error Message:
>> null
>>
>> Stack Trace:
>> java.lang.NullPointerException
>>       at
>> org.apache.lucene.index.TestPersistentSnapshotDeletionPolicy.tearDown(T
>> estPersistentSnapshotDeletionPolicy.java:51)
>>       at
>> org.apache.lucene.util.LuceneTestCase$LuceneTestCaseRunner.runChild(Luc
>> eneTestCase.java:1268)
>>       at
>> org.apache.lucene.util.LuceneTestCase$LuceneTestCaseRunner.runChild(Luc
>> eneTestCase.java:1186)
>>
>>
>> FAILED:
>> org.apache.lucene.index.TestPersistentSnapshotDeletionPolicy.testSnapsho
>> tDeletionPolicy
>>
>> Error Message:
>> null
>>
>> Stack Trace:
>> java.lang.NullPointerException
>>       at
>> org.apache.lucene.index.TestPersistentSnapshotDeletionPolicy.tearDown(T
>> estPersistentSnapshotDeletionPolicy.java:51)
>>       at
>> org.apache.lucene.util.LuceneTestCase$LuceneTestCaseRunner.runChild(Luc
>> eneTestCase.java:1268)
>>       at
>> org.apache.lucene.util.LuceneTestCase$LuceneTestCaseRunner.runChild(Luc
>> eneTestCase.java:1186)
>>
>>
>> FAILED:
>> org.apache.lucene.index.TestPersistentSnapshotDeletionPolicy.testBasicSna
>> pshots
>>
>> Error Message:
>> null
>>
>> Stack Trace:
>> java.lang.NullPointerException
>>       at
>> org.apache.lucene.index.TestPersistentSnapshotDeletionPolicy.tearDown(T
>> estPersistentSnapshotDeletionPolicy.java:51)
>>       at
>> org.apache.lucene.util.LuceneTestCase$LuceneTestCaseRunner.runChild(Luc
>> eneTestCase.java:1268)
>>       at
>> org.apache.lucene.util.LuceneTestCase$LuceneTestCaseRunner.runChild(Luc
>> eneTestCase.java:1186)
>>
>>
>> FAILED:
>> org.apache.lucene.index.TestPersistentSnapshotDeletionPolicy.testMultiThr
>> eadedSnapshotting
>>
>> Error Message:
>> null
>>
>> Stack Trace:
>> java.lang.NullPointerException
>>       at
>> org.apache.lucene.index.TestPersistentSnapshotDeletionPolicy.tearDown(T
>> estPersistentSnapshotDeletionPolicy.java:51)
>>       at
>> org.apache.lucene.util.LuceneTestCase$LuceneTestCaseRunner.runChild(Luc
>> eneTestCase.java:1268)
>>       at
>> org.apache.lucene.util.LuceneTestCase$LuceneTestCaseRunner.runChild(Luc
>> eneTestCase.java:1186)
>>
>>
>> FAILED:
>> org.apache.lucene.index.TestPersistentSnapshotDeletionPolicy.testRollback
>> ToOldSnapshot
>>
>> Error Message:
>> null
>>
>> Stack Trace:
>> java.lang.NullPointerException
>>       at
>> org.apache.lucene.index.TestPersistentSnapshotDeletionPolicy.tearDown(T
>> estPersistentSnapshotDeletionPolicy.java:51)
>>       at
>> org.apache.lucene.util.LuceneTestCase$LuceneTestCaseRunner.runChild(Luc
>> eneTestCase.java:1268)
>>       at
>> org.apache.lucene.util.LuceneTestCase$LuceneTestCaseRunner.runChild(Luc
>> eneTestCase.java:1186)
>>
>>
>> FAILED:
>> org.apache.lucene.index.TestPersistentSnapshotDeletionPolicy.testReleaseS
>> napshot
>>
>> Error Message:
>> null
>>
>> Stack Trace:
>> java.lang.NullPointerException
>>       at
>> org.apache.lucene.index.TestPersistentSnapshotDeletionPolicy.tearDown(T
>> estPersistentSnapshotDeletionPolicy.java:51)
>>       at
>> org.apache.lucene.util.LuceneTestCase$LuceneTestCaseRunner.runChild(Luc
>> eneTestCase.java:1268)
>>       at
>> org.apache.lucene.util.LuceneTestCase$LuceneTestCaseRunner.runChild(Luc
>> eneTestCase.java:1186)
>>
>>
>> FAILED:
>> org.apache.lucene.index.TestPersistentSnapshotDeletionPolicy.testSnapsho
>> tLastCommitTwice
>>
>> Error Message:
>> null
>>
>> Stack Trace:
>> java.lang.NullPointerException
>>       at
>> org.apache.lucene.index.TestPersistentSnapshotDeletionPolicy.tearDown(T
>> estPersistentSnapshotDeletionPolicy.java:51)
>>       at
>> org.apache.lucene.util.LuceneTestCase$LuceneTestCaseRunner.runChild(Luc
>> eneTestCase.java:1268)
>>       at
>> org.apache.lucene.util.LuceneTestCase$LuceneTestCaseRunner.runChild(Luc
>> eneTestCase.java:1186)
>>
>>
>> FAILED:
>> org.apache.lucene.index.TestPersistentSnapshotDeletionPolicy.testMissingC
>> ommits
>>
>> Error Message:
>> null
>>
>> Stack Trace:
>> java.lang.NullPointerException
>>       at
>> org.apache.lucene.index.TestPersistentSnapshotDeletionPolicy.tearDown(T
>> estPersistentSnapshotDeletionPolicy.java:51)
>>       at
>> org.apache.lucene.util.LuceneTestCase$LuceneTestCaseRunner.runChild(Luc
>> eneTestCase.java:1268)
>>       at
>> org.apache.lucene.util.LuceneTestCase$LuceneTestCaseRunner.runChild(Luc
>> eneTestCase.java:1186)
>>
>>
>> FAILED:
>> junit.framework.TestSuite.org.apache.lucene.index.TestPersistentSnapshot
>> DeletionPolicy
>>
>> Error Message:
>> ensure your setUp() calls super.setUp() and your tearDown() calls
>> super.tearDown()!!!
>>
>> Stack Trace:
>> junit.framework.AssertionFailedError: ensure your setUp() calls
>> super.setUp() and your tearDown() calls super.tearDown()!!!
>>       at
>> org.apache.lucene.util.LuceneTestCase.afterClassLuceneTestCaseJ4(LuceneT
>> estCase.java:257)
>>
>>
>> FAILED:  org.apache.lucene.index.TestStressIndexing2.testRandomIWReader
>>
>> Error Message:
>> CheckIndex failed
>>
>> Stack Trace:
>> java.lang.RuntimeException: CheckIndex failed
>>       at org.apache.lucene.util._TestUtil.checkIndex(_TestUtil.java:147)
>>       at
>> org.apache.lucene.index.TestStressIndexing2.indexRandomIWReader(TestS
>> tressIndexing2.java:192)
>>       at
>> org.apache.lucene.index.TestStressIndexing2.testRandomIWReader(TestStr
>> essIndexing2.java:68)
>>       at
>> org.apache.lucene.util.LuceneTestCase$LuceneTestCaseRunner.runChild(Luc
>> eneTestCase.java:1268)
>>       at
>> org.apache.lucene.util.LuceneTestCase$LuceneTestCaseRunner.runChild(Luc
>> eneTestCase.java:1186)
>>
>>
>> FAILED:
>> org.apache.lucene.search.TestCachingWrapperFilter.testCachingWorks
>>
>> Error Message:
>> CheckIndex failed
>>
>> Stack Trace:
>> java.lang.RuntimeException: CheckIndex failed
>>       at org.apache.lucene.util._TestUtil.checkIndex(_TestUtil.java:147)
>>       at
>> org.apache.lucene.store.MockDirectoryWrapper.close(MockDirectoryWrapp
>> er.java:481)
>>       at
>> org.apache.lucene.search.TestCachingWrapperFilter.testCachingWorks(Test
>> CachingWrapperFilter.java:60)
>>       at
>> org.apache.lucene.util.LuceneTestCase$LuceneTestCaseRunner.runChild(Luc
>> eneTestCase.java:1268)
>>       at
>> org.apache.lucene.util.LuceneTestCase$LuceneTestCaseRunner.runChild(Luc
>> eneTestCase.java:1186)
>>
>>
>> FAILED:
>> org.apache.lucene.search.TestCachingWrapperFilter.testNullDocIdSet
>>
>> Error Message:
>> CheckIndex failed
>>
>> Stack Trace:
>> java.lang.RuntimeException: CheckIndex failed
>>       at org.apache.lucene.util._TestUtil.checkIndex(_TestUtil.java:147)
>>       at
>> org.apache.lucene.store.MockDirectoryWrapper.close(MockDirectoryWrapp
>> er.java:481)
>>       at
>> org.apache.lucene.search.TestCachingWrapperFilter.testNullDocIdSet(TestC
>> achingWrapperFilter.java:82)
>>       at
>> org.apache.lucene.util.LuceneTestCase$LuceneTestCaseRunner.runChild(Luc
>> eneTestCase.java:1268)
>>       at
>> org.apache.lucene.util.LuceneTestCase$LuceneTestCaseRunner.runChild(Luc
>> eneTestCase.java:1186)
>>
>>
>> FAILED:
>> org.apache.lucene.search.TestCachingWrapperFilter.testNullDocIdSetIterato
>> r
>>
>> Error Message:
>> CheckIndex failed
>>
>> Stack Trace:
>> java.lang.RuntimeException: CheckIndex failed
>>       at org.apache.lucene.util._TestUtil.checkIndex(_TestUtil.java:147)
>>       at
>> org.apache.lucene.store.MockDirectoryWrapper.close(MockDirectoryWrapp
>> er.java:481)
>>       at
>> org.apache.lucene.search.TestCachingWrapperFilter.testNullDocIdSetIterato
>> r(TestCachingWrapperFilter.java:109)
>>       at
>> org.apache.lucene.util.LuceneTestCase$LuceneTestCaseRunner.runChild(Luc
>> eneTestCase.java:1268)
>>       at
>> org.apache.lucene.util.LuceneTestCase$LuceneTestCaseRunner.runChild(Luc
>> eneTestCase.java:1186)
>>
>>
>> FAILED:
>> org.apache.lucene.search.TestPositiveScoresOnlyCollector.testNegativeScor
>> es
>>
>> Error Message:
>> CheckIndex failed
>>
>> Stack Trace:
>> java.lang.RuntimeException: CheckIndex failed
>>       at org.apache.lucene.util._TestUtil.checkIndex(_TestUtil.java:147)
>>       at
>> org.apache.lucene.store.MockDirectoryWrapper.close(MockDirectoryWrapp
>> er.java:481)
>>       at
>> org.apache.lucene.search.TestPositiveScoresOnlyCollector.testNegativeScor
>> es(TestPositiveScoresOnlyCollector.java:94)
>>       at
>> org.apache.lucene.util.LuceneTestCase$LuceneTestCaseRunner.runChild(Luc
>> eneTestCase.java:1268)
>>       at
>> org.apache.lucene.util.LuceneTestCase$LuceneTestCaseRunner.runChild(Luc
>> eneTestCase.java:1186)
>>
>>
>> FAILED:  org.apache.lucene.search.TestSort.testEmptyIndex
>>
>> Error Message:
>> CheckIndex failed
>>
>> Stack Trace:
>> java.lang.RuntimeException: CheckIndex failed
>>       at org.apache.lucene.util._TestUtil.checkIndex(_TestUtil.java:147)
>>       at
>> org.apache.lucene.store.MockDirectoryWrapper.close(MockDirectoryWrapp
>> er.java:481)
>>       at org.apache.lucene.search.TestSort.tearDown(TestSort.java:236)
>>       at
>> org.apache.lucene.util.LuceneTestCase$LuceneTestCaseRunner.runChild(Luc
>> eneTestCase.java:1268)
>>       at
>> org.apache.lucene.util.LuceneTestCase$LuceneTestCaseRunner.runChild(Luc
>> eneTestCase.java:1186)
>>
>>
>> FAILED:  org.apache.lucene.search.TestSort.testBuiltInSorts
>>
>> Error Message:
>> null
>>
>> Stack Trace:
>> java.lang.NullPointerException
>>       at org.apache.lucene.search.TestSort.tearDown(TestSort.java:229)
>>       at
>> org.apache.lucene.util.LuceneTestCase$LuceneTestCaseRunner.runChild(Luc
>> eneTestCase.java:1268)
>>       at
>> org.apache.lucene.util.LuceneTestCase$LuceneTestCaseRunner.runChild(Luc
>> eneTestCase.java:1186)
>>
>>
>> FAILED:  org.apache.lucene.search.TestSort.testTypedSort
>>
>> Error Message:
>> null
>>
>> Stack Trace:
>> java.lang.NullPointerException
>>       at org.apache.lucene.search.TestSort.tearDown(TestSort.java:229)
>>       at
>> org.apache.lucene.util.LuceneTestCase$LuceneTestCaseRunner.runChild(Luc
>> eneTestCase.java:1268)
>>       at
>> org.apache.lucene.util.LuceneTestCase$LuceneTestCaseRunner.runChild(Luc
>> eneTestCase.java:1186)
>>
>>
>> FAILED:  org.apache.lucene.search.TestSort.testStringSort
>>
>> Error Message:
>> null
>>
>> Stack Trace:
>> java.lang.NullPointerException
>>       at org.apache.lucene.search.TestSort.tearDown(TestSort.java:229)
>>       at
>> org.apache.lucene.util.LuceneTestCase$LuceneTestCaseRunner.runChild(Luc
>> eneTestCase.java:1268)
>>       at
>> org.apache.lucene.util.LuceneTestCase$LuceneTestCaseRunner.runChild(Luc
>> eneTestCase.java:1186)
>>
>>
>> FAILED:  org.apache.lucene.search.TestSort.testCustomFieldParserSort
>>
>> Error Message:
>> null
>>
>> Stack Trace:
>> java.lang.NullPointerException
>>       at org.apache.lucene.search.TestSort.tearDown(TestSort.java:229)
>>       at
>> org.apache.lucene.util.LuceneTestCase$LuceneTestCaseRunner.runChild(Luc
>> eneTestCase.java:1268)
>>       at
>> org.apache.lucene.util.LuceneTestCase$LuceneTestCaseRunner.runChild(Luc
>> eneTestCase.java:1186)
>>
>>
>> FAILED:  org.apache.lucene.search.TestSort.testNewCustomFieldParserSort
>>
>> Error Message:
>> null
>>
>> Stack Trace:
>> java.lang.NullPointerException
>>       at org.apache.lucene.search.TestSort.tearDown(TestSort.java:229)
>>       at
>> org.apache.lucene.util.LuceneTestCase$LuceneTestCaseRunner.runChild(Luc
>> eneTestCase.java:1268)
>>       at
>> org.apache.lucene.util.LuceneTestCase$LuceneTestCaseRunner.runChild(Luc
>> eneTestCase.java:1186)
>>
>>
>> FAILED:  org.apache.lucene.search.TestSort.testReverseSort
>>
>> Error Message:
>> null
>>
>> Stack Trace:
>> java.lang.NullPointerException
>>       at org.apache.lucene.search.TestSort.tearDown(TestSort.java:229)
>>       at
>> org.apache.lucene.util.LuceneTestCase$LuceneTestCaseRunner.runChild(Luc
>> eneTestCase.java:1268)
>>       at
>> org.apache.lucene.util.LuceneTestCase$LuceneTestCaseRunner.runChild(Luc
>> eneTestCase.java:1186)
>>
>>
>> FAILED:  org.apache.lucene.search.TestSort.testEmptyFieldSort
>>
>> Error Message:
>> null
>>
>> Stack Trace:
>> java.lang.NullPointerException
>>       at org.apache.lucene.search.TestSort.tearDown(TestSort.java:229)
>>       at
>> org.apache.lucene.util.LuceneTestCase$LuceneTestCaseRunner.runChild(Luc
>> eneTestCase.java:1268)
>>       at
>> org.apache.lucene.util.LuceneTestCase$LuceneTestCaseRunner.runChild(Luc
>> eneTestCase.java:1186)
>>
>>
>> FAILED:  org.apache.lucene.search.TestSort.testSortCombos
>>
>> Error Message:
>> null
>>
>> Stack Trace:
>> java.lang.NullPointerException
>>       at org.apache.lucene.search.TestSort.tearDown(TestSort.java:229)
>>       at
>> org.apache.lucene.util.LuceneTestCase$LuceneTestCaseRunner.runChild(Luc
>> eneTestCase.java:1268)
>>       at
>> org.apache.lucene.util.LuceneTestCase$LuceneTestCaseRunner.runChild(Luc
>> eneTestCase.java:1186)
>>
>>
>> FAILED:  org.apache.lucene.search.TestSort.testLocaleSort
>>
>> Error Message:
>> null
>>
>> Stack Trace:
>> java.lang.NullPointerException
>>       at org.apache.lucene.search.TestSort.tearDown(TestSort.java:229)
>>       at
>> org.apache.lucene.util.LuceneTestCase$LuceneTestCaseRunner.runChild(Luc
>> eneTestCase.java:1268)
>>       at
>> org.apache.lucene.util.LuceneTestCase$LuceneTestCaseRunner.runChild(Luc
>> eneTestCase.java:1186)
>>
>>
>> FAILED:  org.apache.lucene.search.TestSort.testInternationalSort
>>
>> Error Message:
>> null
>>
>> Stack Trace:
>> java.lang.NullPointerException
>>       at org.apache.lucene.search.TestSort.tearDown(TestSort.java:229)
>>       at
>> org.apache.lucene.util.LuceneTestCase$LuceneTestCaseRunner.runChild(Luc
>> eneTestCase.java:1268)
>>       at
>> org.apache.lucene.util.LuceneTestCase$LuceneTestCaseRunner.runChild(Luc
>> eneTestCase.java:1186)
>>
>>
>> FAILED:
>> org.apache.lucene.search.TestSort.testInternationalMultiSearcherSort
>>
>> Error Message:
>> null
>>
>> Stack Trace:
>> java.lang.NullPointerException
>>       at org.apache.lucene.search.TestSort.tearDown(TestSort.java:229)
>>       at
>> org.apache.lucene.util.LuceneTestCase$LuceneTestCaseRunner.runChild(Luc
>> eneTestCase.java:1268)
>>       at
>> org.apache.lucene.util.LuceneTestCase$LuceneTestCaseRunner.runChild(Luc
>> eneTestCase.java:1186)
>>
>>
>> FAILED:  org.apache.lucene.search.TestSort.testMultiSort
>>
>> Error Message:
>> null
>>
>> Stack Trace:
>> java.lang.NullPointerException
>>       at org.apache.lucene.search.TestSort.tearDown(TestSort.java:229)
>>       at
>> org.apache.lucene.util.LuceneTestCase$LuceneTestCaseRunner.runChild(Luc
>> eneTestCase.java:1268)
>>       at
>> org.apache.lucene.util.LuceneTestCase$LuceneTestCaseRunner.runChild(Luc
>> eneTestCase.java:1186)
>>
>>
>> FAILED:  org.apache.lucene.search.TestSort.testParallelMultiSort
>>
>> Error Message:
>> null
>>
>> Stack Trace:
>> java.lang.NullPointerException
>>       at org.apache.lucene.search.TestSort.tearDown(TestSort.java:229)
>>       at
>> org.apache.lucene.util.LuceneTestCase$LuceneTestCaseRunner.runChild(Luc
>> eneTestCase.java:1268)
>>       at
>> org.apache.lucene.util.LuceneTestCase$LuceneTestCaseRunner.runChild(Luc
>> eneTestCase.java:1186)
>>
>>
>> FAILED:  org.apache.lucene.search.TestSort.testNormalizedScores
>>
>> Error Message:
>> null
>>
>> Stack Trace:
>> java.lang.NullPointerException
>>       at org.apache.lucene.search.TestSort.tearDown(TestSort.java:229)
>>       at
>> org.apache.lucene.util.LuceneTestCase$LuceneTestCaseRunner.runChild(Luc
>> eneTestCase.java:1268)
>>       at
>> org.apache.lucene.util.LuceneTestCase$LuceneTestCaseRunner.runChild(Luc
>> eneTestCase.java:1186)
>>
>>
>> FAILED:  org.apache.lucene.search.TestSort.testTopDocsScores
>>
>> Error Message:
>> null
>>
>> Stack Trace:
>> java.lang.NullPointerException
>>       at org.apache.lucene.search.TestSort.tearDown(TestSort.java:229)
>>       at
>> org.apache.lucene.util.LuceneTestCase$LuceneTestCaseRunner.runChild(Luc
>> eneTestCase.java:1268)
>>       at
>> org.apache.lucene.util.LuceneTestCase$LuceneTestCaseRunner.runChild(Luc
>> eneTestCase.java:1186)
>>
>>
>> FAILED:  org.apache.lucene.search.TestSort.testSortWithoutFillFields
>>
>> Error Message:
>> null
>>
>> Stack Trace:
>> java.lang.NullPointerException
>>       at org.apache.lucene.search.TestSort.tearDown(TestSort.java:229)
>>       at
>> org.apache.lucene.util.LuceneTestCase$LuceneTestCaseRunner.runChild(Luc
>> eneTestCase.java:1268)
>>       at
>> org.apache.lucene.util.LuceneTestCase$LuceneTestCaseRunner.runChild(Luc
>> eneTestCase.java:1186)
>>
>>
>> FAILED:  org.apache.lucene.search.TestSort.testSortWithoutScoreTracking
>>
>> Error Message:
>> null
>>
>> Stack Trace:
>> java.lang.NullPointerException
>>       at org.apache.lucene.search.TestSort.tearDown(TestSort.java:229)
>>       at
>> org.apache.lucene.util.LuceneTestCase$LuceneTestCaseRunner.runChild(Luc
>> eneTestCase.java:1268)
>>       at
>> org.apache.lucene.util.LuceneTestCase$LuceneTestCaseRunner.runChild(Luc
>> eneTestCase.java:1186)
>>
>>
>> FAILED:
>> org.apache.lucene.search.TestSort.testSortWithScoreNoMaxScoreTracking
>>
>> Error Message:
>> null
>>
>> Stack Trace:
>> java.lang.NullPointerException
>>       at org.apache.lucene.search.TestSort.tearDown(TestSort.java:229)
>>       at
>> org.apache.lucene.util.LuceneTestCase$LuceneTestCaseRunner.runChild(Luc
>> eneTestCase.java:1268)
>>       at
>> org.apache.lucene.util.LuceneTestCase$LuceneTestCaseRunner.runChild(Luc
>> eneTestCase.java:1186)
>>
>>
>> FAILED:
>> org.apache.lucene.search.TestSort.testSortWithScoreNoMaxScoreTrackingM
>> ulti
>>
>> Error Message:
>> null
>>
>> Stack Trace:
>> java.lang.NullPointerException
>>       at org.apache.lucene.search.TestSort.tearDown(TestSort.java:229)
>>       at
>> org.apache.lucene.util.LuceneTestCase$LuceneTestCaseRunner.runChild(Luc
>> eneTestCase.java:1268)
>>       at
>> org.apache.lucene.util.LuceneTestCase$LuceneTestCaseRunner.runChild(Luc
>> eneTestCase.java:1186)
>>
>>
>> FAILED:
>> org.apache.lucene.search.TestSort.testSortWithScoreAndMaxScoreTracking
>>
>> Error Message:
>> null
>>
>> Stack Trace:
>> java.lang.NullPointerException
>>       at org.apache.lucene.search.TestSort.tearDown(TestSort.java:229)
>>       at
>> org.apache.lucene.util.LuceneTestCase$LuceneTestCaseRunner.runChild(Luc
>> eneTestCase.java:1268)
>>       at
>> org.apache.lucene.util.LuceneTestCase$LuceneTestCaseRunner.runChild(Luc
>> eneTestCase.java:1186)
>>
>>
>> FAILED:  org.apache.lucene.search.TestSort.testOutOfOrderDocsScoringSort
>>
>> Error Message:
>> null
>>
>> Stack Trace:
>> java.lang.NullPointerException
>>       at org.apache.lucene.search.TestSort.tearDown(TestSort.java:229)
>>       at
>> org.apache.lucene.util.LuceneTestCase$LuceneTestCaseRunner.runChild(Luc
>> eneTestCase.java:1268)
>>       at
>> org.apache.lucene.util.LuceneTestCase$LuceneTestCaseRunner.runChild(Luc
>> eneTestCase.java:1186)
>>
>>
>> FAILED:
>> org.apache.lucene.search.TestSort.testOutOfOrderDocsScoringSortMulti
>>
>> Error Message:
>> null
>>
>> Stack Trace:
>> java.lang.NullPointerException
>>       at org.apache.lucene.search.TestSort.tearDown(TestSort.java:229)
>>       at
>> org.apache.lucene.util.LuceneTestCase$LuceneTestCaseRunner.runChild(Luc
>> eneTestCase.java:1268)
>>       at
>> org.apache.lucene.util.LuceneTestCase$LuceneTestCaseRunner.runChild(Luc
>> eneTestCase.java:1186)
>>
>>
>> FAILED:
>> org.apache.lucene.search.TestSort.testSortWithScoreAndMaxScoreTracking
>> NoResults
>>
>> Error Message:
>> null
>>
>> Stack Trace:
>> java.lang.NullPointerException
>>       at org.apache.lucene.search.TestSort.tearDown(TestSort.java:229)
>>       at
>> org.apache.lucene.util.LuceneTestCase$LuceneTestCaseRunner.runChild(Luc
>> eneTestCase.java:1268)
>>       at
>> org.apache.lucene.util.LuceneTestCase$LuceneTestCaseRunner.runChild(Luc
>> eneTestCase.java:1186)
>>
>>
>> FAILED:  org.apache.lucene.search.TestSort.testEmptyStringVsNullStringSort
>>
>> Error Message:
>> null
>>
>> Stack Trace:
>> java.lang.NullPointerException
>>       at org.apache.lucene.search.TestSort.tearDown(TestSort.java:229)
>>       at
>> org.apache.lucene.util.LuceneTestCase$LuceneTestCaseRunner.runChild(Luc
>> eneTestCase.java:1268)
>>       at
>> org.apache.lucene.util.LuceneTestCase$LuceneTestCaseRunner.runChild(Luc
>> eneTestCase.java:1186)
>>
>>
>> FAILED:  org.apache.lucene.search.TestSort.testLUCENE2142
>>
>> Error Message:
>> null
>>
>> Stack Trace:
>> java.lang.NullPointerException
>>       at org.apache.lucene.search.TestSort.tearDown(TestSort.java:229)
>>       at
>> org.apache.lucene.util.LuceneTestCase$LuceneTestCaseRunner.runChild(Luc
>> eneTestCase.java:1268)
>>       at
>> org.apache.lucene.util.LuceneTestCase$LuceneTestCaseRunner.runChild(Luc
>> eneTestCase.java:1186)
>>
>>
>> FAILED:  org.apache.lucene.search.TestSort.testCountingCollector
>>
>> Error Message:
>> null
>>
>> Stack Trace:
>> java.lang.NullPointerException
>>       at org.apache.lucene.search.TestSort.tearDown(TestSort.java:229)
>>       at
>> org.apache.lucene.util.LuceneTestCase$LuceneTestCaseRunner.runChild(Luc
>> eneTestCase.java:1268)
>>       at
>> org.apache.lucene.util.LuceneTestCase$LuceneTestCaseRunner.runChild(Luc
>> eneTestCase.java:1186)
>>
>>
>> FAILED:  junit.framework.TestSuite.org.apache.lucene.search.TestSort
>>
>> Error Message:
>> ensure your setUp() calls super.setUp() and your tearDown() calls
>> super.tearDown()!!!
>>
>> Stack Trace:
>> junit.framework.AssertionFailedError: ensure your setUp() calls
>> super.setUp() and your tearDown() calls super.tearDown()!!!
>>       at
>> org.apache.lucene.util.LuceneTestCase.afterClassLuceneTestCaseJ4(LuceneT
>> estCase.java:257)
>>
>>
>>
>>
>> Build Log (for compile errors):
>> [...truncated 6091 lines...]
>>
>>
>>
>> ---------------------------------------------------------------------
>> To unsubscribe, e-mail: dev-unsubscribe@lucene.apache.org For additional
>> commands, e-mail: dev-help@lucene.apache.org
>
>
>
> ---------------------------------------------------------------------
> To unsubscribe, e-mail: dev-unsubscribe@lucene.apache.org
> For additional commands, e-mail: dev-help@lucene.apache.org
>
>

---------------------------------------------------------------------
To unsubscribe, e-mail: dev-unsubscribe@lucene.apache.org
For additional commands, e-mail: dev-help@lucene.apache.org


Mime
View raw message