lucene-dev mailing list archives

Site index · List index
Message view « Date » · « Thread »
Top « Date » · « Thread »
From Apache Jenkins Server <jenk...@builds.apache.org>
Subject [JENKINS] Lucene-Solr-tests-only-trunk - Build # 8966 - Failure
Date Tue, 21 Jun 2011 17:28:54 GMT
Build: https://builds.apache.org/job/Lucene-Solr-tests-only-trunk/8966/

10 tests failed.
REGRESSION:  org.apache.lucene.index.TestIndexReaderReopen.testThreadSafety

Error Message:
Error occurred in thread Thread-72: /usr/home/hudson/hudson-slave/workspace/Lucene-Solr-tests-only-trunk/checkout/lucene/build/test/5/test6473964755tmp/_e_1.prx
(Too many open files in system)

Stack Trace:
junit.framework.AssertionFailedError: Error occurred in thread Thread-72:
/usr/home/hudson/hudson-slave/workspace/Lucene-Solr-tests-only-trunk/checkout/lucene/build/test/5/test6473964755tmp/_e_1.prx
(Too many open files in system)
	at org.apache.lucene.util.LuceneTestCase$LuceneTestCaseRunner.runChild(LuceneTestCase.java:1425)
	at org.apache.lucene.util.LuceneTestCase$LuceneTestCaseRunner.runChild(LuceneTestCase.java:1343)
/usr/home/hudson/hudson-slave/workspace/Lucene-Solr-tests-only-trunk/checkout/lucene/build/test/5/test6473964755tmp/_e_1.prx
(Too many open files in system)
	at org.apache.lucene.index.TestIndexReaderReopen.testThreadSafety(TestIndexReaderReopen.java:822)


REGRESSION:  org.apache.lucene.index.TestIndexWriterWithThreads.testImmediateDiskFullWithThreads

Error Message:
hit unexpected Throwable

Stack Trace:
junit.framework.AssertionFailedError: hit unexpected Throwable
	at org.apache.lucene.util.LuceneTestCase$LuceneTestCaseRunner.runChild(LuceneTestCase.java:1425)
	at org.apache.lucene.util.LuceneTestCase$LuceneTestCaseRunner.runChild(LuceneTestCase.java:1343)
	at org.apache.lucene.index.TestIndexWriterWithThreads.testImmediateDiskFullWithThreads(TestIndexWriterWithThreads.java:140)


REGRESSION:  org.apache.lucene.index.TestStressIndexing2.testRandomIWReader

Error Message:
Some threads threw uncaught exceptions!

Stack Trace:
junit.framework.AssertionFailedError: Some threads threw uncaught exceptions!
	at org.apache.lucene.util.LuceneTestCase$LuceneTestCaseRunner.runChild(LuceneTestCase.java:1425)
	at org.apache.lucene.util.LuceneTestCase$LuceneTestCaseRunner.runChild(LuceneTestCase.java:1343)
	at org.apache.lucene.util.LuceneTestCase.tearDown(LuceneTestCase.java:605)


FAILED:  junit.framework.TestSuite.org.apache.lucene.search.TestFieldCacheRangeFilter

Error Message:
/usr/home/hudson/hudson-slave/workspace/Lucene-Solr-tests-only-trunk/checkout/lucene/build/test/2/test3857338582tmp/_1_1.doc
(Too many open files in system)

Stack Trace:
java.io.FileNotFoundException: /usr/home/hudson/hudson-slave/workspace/Lucene-Solr-tests-only-trunk/checkout/lucene/build/test/2/test3857338582tmp/_1_1.doc
(Too many open files in system)
	at java.io.RandomAccessFile.open(Native Method)
	at java.io.RandomAccessFile.<init>(RandomAccessFile.java:233)
	at org.apache.lucene.store.SimpleFSDirectory$SimpleFSIndexInput$Descriptor.<init>(SimpleFSDirectory.java:110)
	at org.apache.lucene.store.SimpleFSDirectory$SimpleFSIndexInput.<init>(SimpleFSDirectory.java:133)
	at org.apache.lucene.store.SimpleFSDirectory.openInput(SimpleFSDirectory.java:58)
	at org.apache.lucene.store.FSDirectory.openInput(FSDirectory.java:326)
	at org.apache.lucene.store.MockDirectoryWrapper.openInput(MockDirectoryWrapper.java:415)
	at org.apache.lucene.store.Directory.openInput(Directory.java:118)
	at org.apache.lucene.index.codecs.mocksep.MockSingleIntIndexInput.<init>(MockSingleIntIndexInput.java:40)
	at org.apache.lucene.index.codecs.mocksep.MockSingleIntFactory.openInput(MockSingleIntFactory.java:31)
	at org.apache.lucene.index.codecs.sep.IntStreamFactory.openInput(IntStreamFactory.java:28)
	at org.apache.lucene.index.codecs.sep.SepPostingsReaderImpl.<init>(SepPostingsReaderImpl.java:66)
	at org.apache.lucene.index.codecs.mocksep.MockSepCodec.fieldsProducer(MockSepCodec.java:95)
	at org.apache.lucene.index.PerFieldCodecWrapper$FieldsReader.<init>(PerFieldCodecWrapper.java:113)
	at org.apache.lucene.index.PerFieldCodecWrapper.fieldsProducer(PerFieldCodecWrapper.java:189)
	at org.apache.lucene.index.SegmentCoreReaders.<init>(SegmentCoreReaders.java:88)
	at org.apache.lucene.index.SegmentReader.get(SegmentReader.java:115)
	at org.apache.lucene.index.IndexWriter$ReaderPool.get(IndexWriter.java:640)
	at org.apache.lucene.index.IndexWriter.mergeMiddle(IndexWriter.java:3450)
	at org.apache.lucene.index.IndexWriter.merge(IndexWriter.java:3119)
	at org.apache.lucene.index.SerialMergeScheduler.merge(SerialMergeScheduler.java:37)
	at org.apache.lucene.index.IndexWriter.maybeMerge(IndexWriter.java:1879)
	at org.apache.lucene.index.IndexWriter.maybeMerge(IndexWriter.java:1874)
	at org.apache.lucene.index.IndexWriter.maybeMerge(IndexWriter.java:1870)
	at org.apache.lucene.index.IndexWriter.updateDocument(IndexWriter.java:1484)
	at org.apache.lucene.index.IndexWriter.addDocument(IndexWriter.java:1236)
	at org.apache.lucene.index.IndexWriter.addDocument(IndexWriter.java:1217)
	at org.apache.lucene.index.RandomIndexWriter.addDocument(RandomIndexWriter.java:163)
	at org.apache.lucene.search.BaseTestRangeFilter.build(BaseTestRangeFilter.java:154)
	at org.apache.lucene.search.BaseTestRangeFilter.beforeClassBaseTestRangeFilter(BaseTestRangeFilter.java:99)


FAILED:  junit.framework.TestSuite.org.apache.lucene.search.TestFieldCacheRangeFilter

Error Message:
null

Stack Trace:
java.lang.NullPointerException
	at org.apache.lucene.search.BaseTestRangeFilter.afterClassBaseTestRangeFilter(BaseTestRangeFilter.java:105)


FAILED:  junit.framework.TestSuite.org.apache.lucene.search.TestFieldCacheRangeFilter

Error Message:
directory of test was not closed, opened from: org.apache.lucene.search.BaseTestRangeFilter$TestIndex.<init>(BaseTestRangeFilter.java:58)

Stack Trace:
junit.framework.AssertionFailedError: directory of test was not closed, opened from: org.apache.lucene.search.BaseTestRangeFilter$TestIndex.<init>(BaseTestRangeFilter.java:58)
	at org.apache.lucene.util.LuceneTestCase.afterClassLuceneTestCaseJ4(LuceneTestCase.java:446)


FAILED:  junit.framework.TestSuite.org.apache.lucene.search.TestPrefixInBooleanQuery

Error Message:
/usr/home/hudson/hudson-slave/workspace/Lucene-Solr-tests-only-trunk/checkout/lucene/build/test/6/test5348053498tmp/_u_1.pos
(Too many open files in system)

Stack Trace:
java.io.FileNotFoundException: /usr/home/hudson/hudson-slave/workspace/Lucene-Solr-tests-only-trunk/checkout/lucene/build/test/6/test5348053498tmp/_u_1.pos
(Too many open files in system)
	at java.io.RandomAccessFile.open(Native Method)
	at java.io.RandomAccessFile.<init>(RandomAccessFile.java:233)
	at org.apache.lucene.store.FSDirectory$FSIndexOutput.<init>(FSDirectory.java:416)
	at org.apache.lucene.store.FSDirectory.createOutput(FSDirectory.java:293)
	at org.apache.lucene.store.MockDirectoryWrapper.createOutput(MockDirectoryWrapper.java:375)
	at org.apache.lucene.index.codecs.mockintblock.MockFixedIntBlockCodec$MockIntFactory.createOutput(MockFixedIntBlockCodec.java:106)
	at org.apache.lucene.index.codecs.sep.SepPostingsWriterImpl.<init>(SepPostingsWriterImpl.java:130)
	at org.apache.lucene.index.codecs.sep.SepPostingsWriterImpl.<init>(SepPostingsWriterImpl.java:107)
	at org.apache.lucene.index.codecs.mockintblock.MockFixedIntBlockCodec.fieldsConsumer(MockFixedIntBlockCodec.java:130)
	at org.apache.lucene.index.PerFieldCodecWrapper$FieldsWriter.<init>(PerFieldCodecWrapper.java:73)
	at org.apache.lucene.index.PerFieldCodecWrapper.fieldsConsumer(PerFieldCodecWrapper.java:61)
	at org.apache.lucene.index.FreqProxTermsWriter.flush(FreqProxTermsWriter.java:58)
	at org.apache.lucene.index.TermsHash.flush(TermsHash.java:117)
	at org.apache.lucene.index.DocInverter.flush(DocInverter.java:80)
	at org.apache.lucene.index.DocFieldProcessor.flush(DocFieldProcessor.java:79)
	at org.apache.lucene.index.DocumentsWriterPerThread.flush(DocumentsWriterPerThread.java:459)
	at org.apache.lucene.index.DocumentsWriter.doFlush(DocumentsWriter.java:421)
	at org.apache.lucene.index.DocumentsWriter.postUpdate(DocumentsWriter.java:313)
	at org.apache.lucene.index.DocumentsWriter.updateDocument(DocumentsWriter.java:385)
	at org.apache.lucene.index.IndexWriter.updateDocument(IndexWriter.java:1476)
	at org.apache.lucene.index.IndexWriter.addDocument(IndexWriter.java:1236)
	at org.apache.lucene.index.IndexWriter.addDocument(IndexWriter.java:1217)
	at org.apache.lucene.index.RandomIndexWriter.addDocument(RandomIndexWriter.java:163)
	at org.apache.lucene.search.TestPrefixInBooleanQuery.beforeClass(TestPrefixInBooleanQuery.java:66)


FAILED:  junit.framework.TestSuite.org.apache.lucene.search.TestPrefixInBooleanQuery

Error Message:
null

Stack Trace:
java.lang.NullPointerException
	at org.apache.lucene.search.TestPrefixInBooleanQuery.afterClass(TestPrefixInBooleanQuery.java:79)


FAILED:  junit.framework.TestSuite.org.apache.lucene.search.TestPrefixInBooleanQuery

Error Message:
directory of test was not closed, opened from: org.apache.lucene.search.TestPrefixInBooleanQuery.beforeClass(TestPrefixInBooleanQuery.java:49)

Stack Trace:
junit.framework.AssertionFailedError: directory of test was not closed, opened from: org.apache.lucene.search.TestPrefixInBooleanQuery.beforeClass(TestPrefixInBooleanQuery.java:49)
	at org.apache.lucene.util.LuceneTestCase.afterClassLuceneTestCaseJ4(LuceneTestCase.java:446)


REGRESSION:  org.apache.lucene.store.TestMultiMMap.testRandomChunkSizes

Error Message:
/usr/home/hudson/hudson-slave/workspace/Lucene-Solr-tests-only-trunk/checkout/lucene/build/test/8/TestMultiMMap7410174249tmp/mmap247410174256tmp/_1_2.frq
(Too many open files in system)

Stack Trace:
java.io.FileNotFoundException: /usr/home/hudson/hudson-slave/workspace/Lucene-Solr-tests-only-trunk/checkout/lucene/build/test/8/TestMultiMMap7410174249tmp/mmap247410174256tmp/_1_2.frq
(Too many open files in system)
	at java.io.RandomAccessFile.open(Native Method)
	at java.io.RandomAccessFile.<init>(RandomAccessFile.java:233)
	at org.apache.lucene.store.FSDirectory$FSIndexOutput.<init>(FSDirectory.java:416)
	at org.apache.lucene.store.FSDirectory.createOutput(FSDirectory.java:293)
	at org.apache.lucene.store.MockDirectoryWrapper.createOutput(MockDirectoryWrapper.java:375)
	at org.apache.lucene.index.codecs.standard.StandardPostingsWriter.<init>(StandardPostingsWriter.java:95)
	at org.apache.lucene.index.codecs.standard.StandardPostingsWriter.<init>(StandardPostingsWriter.java:87)
	at org.apache.lucene.index.codecs.pulsing.PulsingCodec.fieldsConsumer(PulsingCodec.java:77)
	at org.apache.lucene.index.PerFieldCodecWrapper$FieldsWriter.<init>(PerFieldCodecWrapper.java:73)
	at org.apache.lucene.index.PerFieldCodecWrapper.fieldsConsumer(PerFieldCodecWrapper.java:61)
	at org.apache.lucene.index.FreqProxTermsWriter.flush(FreqProxTermsWriter.java:58)
	at org.apache.lucene.index.TermsHash.flush(TermsHash.java:117)
	at org.apache.lucene.index.DocInverter.flush(DocInverter.java:80)
	at org.apache.lucene.index.DocFieldProcessor.flush(DocFieldProcessor.java:79)
	at org.apache.lucene.index.DocumentsWriterPerThread.flush(DocumentsWriterPerThread.java:459)
	at org.apache.lucene.index.DocumentsWriter.doFlush(DocumentsWriter.java:421)
	at org.apache.lucene.index.DocumentsWriter.flushAllThreads(DocumentsWriter.java:548)
	at org.apache.lucene.index.IndexWriter.getReader(IndexWriter.java:376)
	at org.apache.lucene.index.RandomIndexWriter.getReader(RandomIndexWriter.java:345)
	at org.apache.lucene.index.RandomIndexWriter.getReader(RandomIndexWriter.java:308)
	at org.apache.lucene.store.TestMultiMMap.assertChunking(TestMultiMMap.java:137)
	at org.apache.lucene.store.TestMultiMMap.testRandomChunkSizes(TestMultiMMap.java:111)
	at org.apache.lucene.util.LuceneTestCase$LuceneTestCaseRunner.runChild(LuceneTestCase.java:1425)
	at org.apache.lucene.util.LuceneTestCase$LuceneTestCaseRunner.runChild(LuceneTestCase.java:1343)




Build Log (for compile errors):
[...truncated 3670 lines...]



---------------------------------------------------------------------
To unsubscribe, e-mail: dev-unsubscribe@lucene.apache.org
For additional commands, e-mail: dev-help@lucene.apache.org


Mime
View raw message