lucene-dev mailing list archives

Site index · List index
Message view « Date » · « Thread »
Top « Date » · « Thread »
From Apache Jenkins Server <jenk...@builds.apache.org>
Subject [JENKINS] Solr-trunk - Build # 1531 - Failure
Date Sun, 12 Jun 2011 07:51:05 GMT
Build: https://builds.apache.org/job/Solr-trunk/1531/

67 tests failed.
FAILED:  junit.framework.TestSuite.org.apache.solr.SolrInfoMBeanTest

Error Message:
CheckIndex failed

Stack Trace:
java.lang.RuntimeException: CheckIndex failed
	at org.apache.lucene.util._TestUtil.checkIndex(_TestUtil.java:158)
	at org.apache.lucene.util._TestUtil.checkIndex(_TestUtil.java:144)
	at org.apache.lucene.store.MockDirectoryWrapper.close(MockDirectoryWrapper.java:477)
	at org.apache.solr.SolrTestCaseJ4.closeDirectories(SolrTestCaseJ4.java:82)
	at org.apache.solr.SolrTestCaseJ4.deleteCore(SolrTestCaseJ4.java:284)
	at org.apache.solr.SolrTestCaseJ4.afterClassSolrTestCase(SolrTestCaseJ4.java:72)


FAILED:  junit.framework.TestSuite.org.apache.solr.SolrInfoMBeanTest

Error Message:
directory of test was not closed, opened from: org.apache.solr.core.MockDirectoryFactory.open(MockDirectoryFactory.java:33)

Stack Trace:
junit.framework.AssertionFailedError: directory of test was not closed, opened from: org.apache.solr.core.MockDirectoryFactory.open(MockDirectoryFactory.java:33)
	at org.apache.lucene.util.LuceneTestCase.afterClassLuceneTestCaseJ4(LuceneTestCase.java:444)


FAILED:  junit.framework.TestSuite.org.apache.solr.TestPluginEnable

Error Message:
CheckIndex failed

Stack Trace:
java.lang.RuntimeException: CheckIndex failed
	at org.apache.lucene.util._TestUtil.checkIndex(_TestUtil.java:158)
	at org.apache.lucene.util._TestUtil.checkIndex(_TestUtil.java:144)
	at org.apache.lucene.store.MockDirectoryWrapper.close(MockDirectoryWrapper.java:477)
	at org.apache.solr.SolrTestCaseJ4.closeDirectories(SolrTestCaseJ4.java:82)
	at org.apache.solr.SolrTestCaseJ4.deleteCore(SolrTestCaseJ4.java:284)
	at org.apache.solr.SolrTestCaseJ4.afterClassSolrTestCase(SolrTestCaseJ4.java:72)


FAILED:  junit.framework.TestSuite.org.apache.solr.TestPluginEnable

Error Message:
directory of test was not closed, opened from: org.apache.solr.core.MockDirectoryFactory.open(MockDirectoryFactory.java:33)

Stack Trace:
junit.framework.AssertionFailedError: directory of test was not closed, opened from: org.apache.solr.core.MockDirectoryFactory.open(MockDirectoryFactory.java:33)
	at org.apache.lucene.util.LuceneTestCase.afterClassLuceneTestCaseJ4(LuceneTestCase.java:444)


REGRESSION:  org.apache.solr.TestSolrCoreProperties.testSimple

Error Message:
CheckIndex failed

Stack Trace:
java.lang.RuntimeException: CheckIndex failed
	at org.apache.lucene.util._TestUtil.checkIndex(_TestUtil.java:158)
	at org.apache.lucene.util._TestUtil.checkIndex(_TestUtil.java:144)
	at org.apache.lucene.store.MockDirectoryWrapper.close(MockDirectoryWrapper.java:477)
	at org.apache.solr.SolrTestCaseJ4.closeDirectories(SolrTestCaseJ4.java:82)
	at org.apache.solr.TestSolrCoreProperties.tearDown(TestSolrCoreProperties.java:62)
	at org.apache.lucene.util.LuceneTestCase$LuceneTestCaseRunner.runChild(LuceneTestCase.java:1403)
	at org.apache.lucene.util.LuceneTestCase$LuceneTestCaseRunner.runChild(LuceneTestCase.java:1321)


FAILED:  junit.framework.TestSuite.org.apache.solr.TestSolrCoreProperties

Error Message:
ensure your setUp() calls super.setUp() and your tearDown() calls super.tearDown()!!!

Stack Trace:
junit.framework.AssertionFailedError: ensure your setUp() calls super.setUp() and your tearDown()
calls super.tearDown()!!!
	at org.apache.lucene.util.LuceneTestCase.afterClassLuceneTestCaseJ4(LuceneTestCase.java:401)


FAILED:  junit.framework.TestSuite.org.apache.solr.analysis.TestLuceneMatchVersion

Error Message:
CheckIndex failed

Stack Trace:
java.lang.RuntimeException: CheckIndex failed
	at org.apache.lucene.util._TestUtil.checkIndex(_TestUtil.java:158)
	at org.apache.lucene.util._TestUtil.checkIndex(_TestUtil.java:144)
	at org.apache.lucene.store.MockDirectoryWrapper.close(MockDirectoryWrapper.java:477)
	at org.apache.solr.SolrTestCaseJ4.closeDirectories(SolrTestCaseJ4.java:82)
	at org.apache.solr.SolrTestCaseJ4.deleteCore(SolrTestCaseJ4.java:284)
	at org.apache.solr.SolrTestCaseJ4.afterClassSolrTestCase(SolrTestCaseJ4.java:72)


FAILED:  junit.framework.TestSuite.org.apache.solr.analysis.TestLuceneMatchVersion

Error Message:
directory of test was not closed, opened from: org.apache.solr.core.MockDirectoryFactory.open(MockDirectoryFactory.java:33)

Stack Trace:
junit.framework.AssertionFailedError: directory of test was not closed, opened from: org.apache.solr.core.MockDirectoryFactory.open(MockDirectoryFactory.java:33)
	at org.apache.lucene.util.LuceneTestCase.afterClassLuceneTestCaseJ4(LuceneTestCase.java:444)


REGRESSION:  org.apache.solr.client.solrj.embedded.JettyWebappTest.testJSP

Error Message:
CheckIndex failed

Stack Trace:
java.lang.RuntimeException: CheckIndex failed
	at org.apache.lucene.util._TestUtil.checkIndex(_TestUtil.java:158)
	at org.apache.lucene.util._TestUtil.checkIndex(_TestUtil.java:144)
	at org.apache.lucene.store.MockDirectoryWrapper.close(MockDirectoryWrapper.java:477)
	at org.apache.solr.SolrTestCaseJ4.closeDirectories(SolrTestCaseJ4.java:82)
	at org.apache.solr.client.solrj.embedded.JettyWebappTest.tearDown(JettyWebappTest.java:81)
	at org.apache.lucene.util.LuceneTestCase$LuceneTestCaseRunner.runChild(LuceneTestCase.java:1403)
	at org.apache.lucene.util.LuceneTestCase$LuceneTestCaseRunner.runChild(LuceneTestCase.java:1321)


FAILED:  junit.framework.TestSuite.org.apache.solr.client.solrj.embedded.JettyWebappTest

Error Message:
ensure your setUp() calls super.setUp() and your tearDown() calls super.tearDown()!!!

Stack Trace:
junit.framework.AssertionFailedError: ensure your setUp() calls super.setUp() and your tearDown()
calls super.tearDown()!!!
	at org.apache.lucene.util.LuceneTestCase.afterClassLuceneTestCaseJ4(LuceneTestCase.java:401)


FAILED:  junit.framework.TestSuite.org.apache.solr.cloud.CloudStateUpdateTest

Error Message:
CheckIndex failed

Stack Trace:
java.lang.RuntimeException: CheckIndex failed
	at org.apache.lucene.util._TestUtil.checkIndex(_TestUtil.java:158)
	at org.apache.lucene.util._TestUtil.checkIndex(_TestUtil.java:144)
	at org.apache.lucene.store.MockDirectoryWrapper.close(MockDirectoryWrapper.java:477)
	at org.apache.solr.SolrTestCaseJ4.closeDirectories(SolrTestCaseJ4.java:82)
	at org.apache.solr.SolrTestCaseJ4.deleteCore(SolrTestCaseJ4.java:284)
	at org.apache.solr.SolrTestCaseJ4.afterClassSolrTestCase(SolrTestCaseJ4.java:72)


FAILED:  junit.framework.TestSuite.org.apache.solr.cloud.CloudStateUpdateTest

Error Message:
directory of test was not closed, opened from: org.apache.solr.core.MockDirectoryFactory.open(MockDirectoryFactory.java:33)

Stack Trace:
junit.framework.AssertionFailedError: directory of test was not closed, opened from: org.apache.solr.core.MockDirectoryFactory.open(MockDirectoryFactory.java:33)
	at org.apache.lucene.util.LuceneTestCase.afterClassLuceneTestCaseJ4(LuceneTestCase.java:444)


FAILED:  junit.framework.TestSuite.org.apache.solr.core.AlternateDirectoryTest

Error Message:
java.lang.RuntimeException: java.lang.RuntimeException: CheckIndex failed

Stack Trace:
java.lang.RuntimeException: java.lang.RuntimeException: java.lang.RuntimeException: CheckIndex
failed
	at org.apache.solr.util.TestHarness.<init>(TestHarness.java:153)
	at org.apache.solr.util.TestHarness.<init>(TestHarness.java:135)
	at org.apache.solr.util.TestHarness.<init>(TestHarness.java:125)
	at org.apache.solr.SolrTestCaseJ4.initCore(SolrTestCaseJ4.java:250)
	at org.apache.solr.SolrTestCaseJ4.initCore(SolrTestCaseJ4.java:113)
	at org.apache.solr.SolrTestCaseJ4.initCore(SolrTestCaseJ4.java:102)
	at org.apache.solr.core.AlternateDirectoryTest.beforeClass(AlternateDirectoryTest.java:31)
Caused by: java.lang.RuntimeException: java.lang.RuntimeException: CheckIndex failed
	at org.apache.solr.core.SolrCore.getSearcher(SolrCore.java:1039)
	at org.apache.solr.core.SolrCore.<init>(SolrCore.java:535)
	at org.apache.solr.util.TestHarness$Initializer.initialize(TestHarness.java:191)
	at org.apache.solr.util.TestHarness.<init>(TestHarness.java:140)
Caused by: java.lang.RuntimeException: CheckIndex failed
	at org.apache.lucene.util._TestUtil.checkIndex(_TestUtil.java:158)
	at org.apache.lucene.util._TestUtil.checkIndex(_TestUtil.java:144)
	at org.apache.lucene.store.MockDirectoryWrapper.close(MockDirectoryWrapper.java:477)
	at org.apache.solr.core.AlternateDirectoryTest$TestFSDirectoryFactory.open(AlternateDirectoryTest.java:56)
	at org.apache.solr.core.SolrCore.getSearcher(SolrCore.java:1028)


REGRESSION:  org.apache.solr.core.IndexReaderFactoryTest.testAltReaderUsed

Error Message:
CheckIndex failed

Stack Trace:
java.lang.RuntimeException: CheckIndex failed
	at org.apache.lucene.util._TestUtil.checkIndex(_TestUtil.java:158)
	at org.apache.lucene.util._TestUtil.checkIndex(_TestUtil.java:144)
	at org.apache.lucene.store.MockDirectoryWrapper.close(MockDirectoryWrapper.java:477)
	at org.apache.solr.SolrTestCaseJ4.closeDirectories(SolrTestCaseJ4.java:82)
	at org.apache.solr.util.AbstractSolrTestCase.tearDown(AbstractSolrTestCase.java:194)
	at org.apache.lucene.util.LuceneTestCase$LuceneTestCaseRunner.runChild(LuceneTestCase.java:1403)
	at org.apache.lucene.util.LuceneTestCase$LuceneTestCaseRunner.runChild(LuceneTestCase.java:1321)


FAILED:  junit.framework.TestSuite.org.apache.solr.core.IndexReaderFactoryTest

Error Message:
ensure your setUp() calls super.setUp() and your tearDown() calls super.tearDown()!!!

Stack Trace:
junit.framework.AssertionFailedError: ensure your setUp() calls super.setUp() and your tearDown()
calls super.tearDown()!!!
	at org.apache.lucene.util.LuceneTestCase.afterClassLuceneTestCaseJ4(LuceneTestCase.java:401)


REGRESSION:  org.apache.solr.core.SolrCoreTest.testRequestHandlerRegistry

Error Message:
CheckIndex failed

Stack Trace:
java.lang.RuntimeException: CheckIndex failed
	at org.apache.lucene.util._TestUtil.checkIndex(_TestUtil.java:158)
	at org.apache.lucene.util._TestUtil.checkIndex(_TestUtil.java:144)
	at org.apache.lucene.store.MockDirectoryWrapper.close(MockDirectoryWrapper.java:477)
	at org.apache.solr.SolrTestCaseJ4.closeDirectories(SolrTestCaseJ4.java:82)
	at org.apache.solr.SolrTestCaseJ4.deleteCore(SolrTestCaseJ4.java:284)
	at org.apache.solr.core.SolrCoreTest.tearDown(SolrCoreTest.java:41)
	at org.apache.lucene.util.LuceneTestCase$LuceneTestCaseRunner.runChild(LuceneTestCase.java:1403)
	at org.apache.lucene.util.LuceneTestCase$LuceneTestCaseRunner.runChild(LuceneTestCase.java:1321)


REGRESSION:  org.apache.solr.core.SolrCoreTest.testClose

Error Message:
CheckIndex failed

Stack Trace:
java.lang.RuntimeException: CheckIndex failed
	at org.apache.lucene.util._TestUtil.checkIndex(_TestUtil.java:158)
	at org.apache.lucene.util._TestUtil.checkIndex(_TestUtil.java:144)
	at org.apache.lucene.store.MockDirectoryWrapper.close(MockDirectoryWrapper.java:477)
	at org.apache.solr.SolrTestCaseJ4.closeDirectories(SolrTestCaseJ4.java:82)
	at org.apache.solr.SolrTestCaseJ4.deleteCore(SolrTestCaseJ4.java:284)
	at org.apache.solr.core.SolrCoreTest.tearDown(SolrCoreTest.java:41)
	at org.apache.lucene.util.LuceneTestCase$LuceneTestCaseRunner.runChild(LuceneTestCase.java:1403)
	at org.apache.lucene.util.LuceneTestCase$LuceneTestCaseRunner.runChild(LuceneTestCase.java:1321)


REGRESSION:  org.apache.solr.core.SolrCoreTest.testRefCount

Error Message:
maxClauseCount must be >= 1

Stack Trace:
java.lang.IllegalArgumentException: maxClauseCount must be >= 1
	at org.apache.lucene.search.BooleanQuery.setMaxClauseCount(BooleanQuery.java:61)
	at org.apache.lucene.util.LuceneTestCase.tearDown(LuceneTestCase.java:580)
	at org.apache.solr.SolrTestCaseJ4.tearDown(SolrTestCaseJ4.java:96)
	at org.apache.solr.core.SolrCoreTest.tearDown(SolrCoreTest.java:42)
	at org.apache.lucene.util.LuceneTestCase$LuceneTestCaseRunner.runChild(LuceneTestCase.java:1403)
	at org.apache.lucene.util.LuceneTestCase$LuceneTestCaseRunner.runChild(LuceneTestCase.java:1321)


REGRESSION:  org.apache.solr.core.SolrCoreTest.testRefCountMT

Error Message:
CheckIndex failed

Stack Trace:
java.lang.RuntimeException: CheckIndex failed
	at org.apache.lucene.util._TestUtil.checkIndex(_TestUtil.java:158)
	at org.apache.lucene.util._TestUtil.checkIndex(_TestUtil.java:144)
	at org.apache.lucene.store.MockDirectoryWrapper.close(MockDirectoryWrapper.java:477)
	at org.apache.solr.SolrTestCaseJ4.closeDirectories(SolrTestCaseJ4.java:82)
	at org.apache.solr.SolrTestCaseJ4.deleteCore(SolrTestCaseJ4.java:284)
	at org.apache.solr.core.SolrCoreTest.tearDown(SolrCoreTest.java:41)
	at org.apache.lucene.util.LuceneTestCase$LuceneTestCaseRunner.runChild(LuceneTestCase.java:1403)
	at org.apache.lucene.util.LuceneTestCase$LuceneTestCaseRunner.runChild(LuceneTestCase.java:1321)


REGRESSION:  org.apache.solr.core.SolrCoreTest.testInfoRegistry

Error Message:
CheckIndex failed

Stack Trace:
java.lang.RuntimeException: CheckIndex failed
	at org.apache.lucene.util._TestUtil.checkIndex(_TestUtil.java:158)
	at org.apache.lucene.util._TestUtil.checkIndex(_TestUtil.java:144)
	at org.apache.lucene.store.MockDirectoryWrapper.close(MockDirectoryWrapper.java:477)
	at org.apache.solr.SolrTestCaseJ4.closeDirectories(SolrTestCaseJ4.java:82)
	at org.apache.solr.SolrTestCaseJ4.deleteCore(SolrTestCaseJ4.java:284)
	at org.apache.solr.core.SolrCoreTest.tearDown(SolrCoreTest.java:41)
	at org.apache.lucene.util.LuceneTestCase$LuceneTestCaseRunner.runChild(LuceneTestCase.java:1403)
	at org.apache.lucene.util.LuceneTestCase$LuceneTestCaseRunner.runChild(LuceneTestCase.java:1321)


FAILED:  junit.framework.TestSuite.org.apache.solr.core.SolrCoreTest

Error Message:
ensure your setUp() calls super.setUp() and your tearDown() calls super.tearDown()!!!

Stack Trace:
junit.framework.AssertionFailedError: ensure your setUp() calls super.setUp() and your tearDown()
calls super.tearDown()!!!
	at org.apache.lucene.util.LuceneTestCase.afterClassLuceneTestCaseJ4(LuceneTestCase.java:401)


FAILED:  junit.framework.TestSuite.org.apache.solr.core.TestConfig

Error Message:
CheckIndex failed

Stack Trace:
java.lang.RuntimeException: CheckIndex failed
	at org.apache.lucene.util._TestUtil.checkIndex(_TestUtil.java:158)
	at org.apache.lucene.util._TestUtil.checkIndex(_TestUtil.java:144)
	at org.apache.lucene.store.MockDirectoryWrapper.close(MockDirectoryWrapper.java:477)
	at org.apache.solr.SolrTestCaseJ4.closeDirectories(SolrTestCaseJ4.java:82)
	at org.apache.solr.SolrTestCaseJ4.deleteCore(SolrTestCaseJ4.java:284)
	at org.apache.solr.SolrTestCaseJ4.afterClassSolrTestCase(SolrTestCaseJ4.java:72)


FAILED:  junit.framework.TestSuite.org.apache.solr.core.TestConfig

Error Message:
directory of test was not closed, opened from: org.apache.solr.core.MockDirectoryFactory.open(MockDirectoryFactory.java:33)

Stack Trace:
junit.framework.AssertionFailedError: directory of test was not closed, opened from: org.apache.solr.core.MockDirectoryFactory.open(MockDirectoryFactory.java:33)
	at org.apache.lucene.util.LuceneTestCase.afterClassLuceneTestCaseJ4(LuceneTestCase.java:444)


REGRESSION:  org.apache.solr.core.TestJmxIntegration.testJmxRegistration

Error Message:
CheckIndex failed

Stack Trace:
java.lang.RuntimeException: CheckIndex failed
	at org.apache.lucene.util._TestUtil.checkIndex(_TestUtil.java:158)
	at org.apache.lucene.util._TestUtil.checkIndex(_TestUtil.java:144)
	at org.apache.lucene.store.MockDirectoryWrapper.close(MockDirectoryWrapper.java:477)
	at org.apache.solr.SolrTestCaseJ4.closeDirectories(SolrTestCaseJ4.java:82)
	at org.apache.solr.util.AbstractSolrTestCase.tearDown(AbstractSolrTestCase.java:194)
	at org.apache.solr.core.TestJmxIntegration.tearDown(TestJmxIntegration.java:60)
	at org.apache.lucene.util.LuceneTestCase$LuceneTestCaseRunner.runChild(LuceneTestCase.java:1403)
	at org.apache.lucene.util.LuceneTestCase$LuceneTestCaseRunner.runChild(LuceneTestCase.java:1321)


REGRESSION:  org.apache.solr.core.TestJmxIntegration.testJmxUpdate

Error Message:
CheckIndex failed

Stack Trace:
java.lang.RuntimeException: CheckIndex failed
	at org.apache.lucene.util._TestUtil.checkIndex(_TestUtil.java:158)
	at org.apache.lucene.util._TestUtil.checkIndex(_TestUtil.java:144)
	at org.apache.lucene.store.MockDirectoryWrapper.close(MockDirectoryWrapper.java:477)
	at org.apache.solr.SolrTestCaseJ4.closeDirectories(SolrTestCaseJ4.java:82)
	at org.apache.solr.util.AbstractSolrTestCase.tearDown(AbstractSolrTestCase.java:194)
	at org.apache.solr.core.TestJmxIntegration.tearDown(TestJmxIntegration.java:60)
	at org.apache.lucene.util.LuceneTestCase$LuceneTestCaseRunner.runChild(LuceneTestCase.java:1403)
	at org.apache.lucene.util.LuceneTestCase$LuceneTestCaseRunner.runChild(LuceneTestCase.java:1321)


FAILED:  junit.framework.TestSuite.org.apache.solr.core.TestJmxIntegration

Error Message:
ensure your setUp() calls super.setUp() and your tearDown() calls super.tearDown()!!!

Stack Trace:
junit.framework.AssertionFailedError: ensure your setUp() calls super.setUp() and your tearDown()
calls super.tearDown()!!!
	at org.apache.lucene.util.LuceneTestCase.afterClassLuceneTestCaseJ4(LuceneTestCase.java:401)


FAILED:  junit.framework.TestSuite.org.apache.solr.core.TestLegacyMergeSchedulerPolicyConfig

Error Message:
CheckIndex failed

Stack Trace:
java.lang.RuntimeException: CheckIndex failed
	at org.apache.lucene.util._TestUtil.checkIndex(_TestUtil.java:158)
	at org.apache.lucene.util._TestUtil.checkIndex(_TestUtil.java:144)
	at org.apache.lucene.store.MockDirectoryWrapper.close(MockDirectoryWrapper.java:477)
	at org.apache.solr.SolrTestCaseJ4.closeDirectories(SolrTestCaseJ4.java:82)
	at org.apache.solr.SolrTestCaseJ4.deleteCore(SolrTestCaseJ4.java:284)
	at org.apache.solr.SolrTestCaseJ4.afterClassSolrTestCase(SolrTestCaseJ4.java:72)


FAILED:  junit.framework.TestSuite.org.apache.solr.core.TestLegacyMergeSchedulerPolicyConfig

Error Message:
directory of test was not closed, opened from: org.apache.solr.core.MockDirectoryFactory.open(MockDirectoryFactory.java:33)

Stack Trace:
junit.framework.AssertionFailedError: directory of test was not closed, opened from: org.apache.solr.core.MockDirectoryFactory.open(MockDirectoryFactory.java:33)
	at org.apache.lucene.util.LuceneTestCase.afterClassLuceneTestCaseJ4(LuceneTestCase.java:444)


REGRESSION:  org.apache.solr.core.TestPropInject.testMergePolicy

Error Message:
CheckIndex failed

Stack Trace:
java.lang.RuntimeException: CheckIndex failed
	at org.apache.lucene.util._TestUtil.checkIndex(_TestUtil.java:158)
	at org.apache.lucene.util._TestUtil.checkIndex(_TestUtil.java:144)
	at org.apache.lucene.store.MockDirectoryWrapper.close(MockDirectoryWrapper.java:477)
	at org.apache.solr.SolrTestCaseJ4.closeDirectories(SolrTestCaseJ4.java:82)
	at org.apache.solr.util.AbstractSolrTestCase.tearDown(AbstractSolrTestCase.java:194)
	at org.apache.lucene.util.LuceneTestCase$LuceneTestCaseRunner.runChild(LuceneTestCase.java:1403)
	at org.apache.lucene.util.LuceneTestCase$LuceneTestCaseRunner.runChild(LuceneTestCase.java:1321)


REGRESSION:  org.apache.solr.core.TestPropInject.testProps

Error Message:
CheckIndex failed

Stack Trace:
java.lang.RuntimeException: CheckIndex failed
	at org.apache.lucene.util._TestUtil.checkIndex(_TestUtil.java:158)
	at org.apache.lucene.util._TestUtil.checkIndex(_TestUtil.java:144)
	at org.apache.lucene.store.MockDirectoryWrapper.close(MockDirectoryWrapper.java:477)
	at org.apache.solr.SolrTestCaseJ4.closeDirectories(SolrTestCaseJ4.java:82)
	at org.apache.solr.util.AbstractSolrTestCase.tearDown(AbstractSolrTestCase.java:194)
	at org.apache.lucene.util.LuceneTestCase$LuceneTestCaseRunner.runChild(LuceneTestCase.java:1403)
	at org.apache.lucene.util.LuceneTestCase$LuceneTestCaseRunner.runChild(LuceneTestCase.java:1321)


FAILED:  junit.framework.TestSuite.org.apache.solr.core.TestPropInject

Error Message:
ensure your setUp() calls super.setUp() and your tearDown() calls super.tearDown()!!!

Stack Trace:
junit.framework.AssertionFailedError: ensure your setUp() calls super.setUp() and your tearDown()
calls super.tearDown()!!!
	at org.apache.lucene.util.LuceneTestCase.afterClassLuceneTestCaseJ4(LuceneTestCase.java:401)


FAILED:  junit.framework.TestSuite.org.apache.solr.core.TestPropInjectDefaults

Error Message:
CheckIndex failed

Stack Trace:
java.lang.RuntimeException: CheckIndex failed
	at org.apache.lucene.util._TestUtil.checkIndex(_TestUtil.java:158)
	at org.apache.lucene.util._TestUtil.checkIndex(_TestUtil.java:144)
	at org.apache.lucene.store.MockDirectoryWrapper.close(MockDirectoryWrapper.java:477)
	at org.apache.solr.SolrTestCaseJ4.closeDirectories(SolrTestCaseJ4.java:82)
	at org.apache.solr.SolrTestCaseJ4.deleteCore(SolrTestCaseJ4.java:284)
	at org.apache.solr.SolrTestCaseJ4.afterClassSolrTestCase(SolrTestCaseJ4.java:72)


FAILED:  junit.framework.TestSuite.org.apache.solr.core.TestPropInjectDefaults

Error Message:
directory of test was not closed, opened from: org.apache.solr.core.MockDirectoryFactory.open(MockDirectoryFactory.java:33)

Stack Trace:
junit.framework.AssertionFailedError: directory of test was not closed, opened from: org.apache.solr.core.MockDirectoryFactory.open(MockDirectoryFactory.java:33)
	at org.apache.lucene.util.LuceneTestCase.afterClassLuceneTestCaseJ4(LuceneTestCase.java:444)


FAILED:  junit.framework.TestSuite.org.apache.solr.core.TestQuerySenderListener

Error Message:
CheckIndex failed

Stack Trace:
java.lang.RuntimeException: CheckIndex failed
	at org.apache.lucene.util._TestUtil.checkIndex(_TestUtil.java:158)
	at org.apache.lucene.util._TestUtil.checkIndex(_TestUtil.java:144)
	at org.apache.lucene.store.MockDirectoryWrapper.close(MockDirectoryWrapper.java:477)
	at org.apache.solr.SolrTestCaseJ4.closeDirectories(SolrTestCaseJ4.java:82)
	at org.apache.solr.SolrTestCaseJ4.deleteCore(SolrTestCaseJ4.java:284)
	at org.apache.solr.SolrTestCaseJ4.afterClassSolrTestCase(SolrTestCaseJ4.java:72)


FAILED:  junit.framework.TestSuite.org.apache.solr.handler.DocumentAnalysisRequestHandlerTest

Error Message:
CheckIndex failed

Stack Trace:
java.lang.RuntimeException: CheckIndex failed
	at org.apache.lucene.util._TestUtil.checkIndex(_TestUtil.java:158)
	at org.apache.lucene.util._TestUtil.checkIndex(_TestUtil.java:144)
	at org.apache.lucene.store.MockDirectoryWrapper.close(MockDirectoryWrapper.java:477)
	at org.apache.solr.SolrTestCaseJ4.closeDirectories(SolrTestCaseJ4.java:82)
	at org.apache.solr.SolrTestCaseJ4.deleteCore(SolrTestCaseJ4.java:284)
	at org.apache.solr.SolrTestCaseJ4.afterClassSolrTestCase(SolrTestCaseJ4.java:72)


FAILED:  junit.framework.TestSuite.org.apache.solr.handler.DocumentAnalysisRequestHandlerTest

Error Message:
directory of test was not closed, opened from: org.apache.solr.core.MockDirectoryFactory.open(MockDirectoryFactory.java:33)

Stack Trace:
junit.framework.AssertionFailedError: directory of test was not closed, opened from: org.apache.solr.core.MockDirectoryFactory.open(MockDirectoryFactory.java:33)
	at org.apache.lucene.util.LuceneTestCase.afterClassLuceneTestCaseJ4(LuceneTestCase.java:444)


FAILED:  junit.framework.TestSuite.org.apache.solr.handler.FieldAnalysisRequestHandlerTest

Error Message:
CheckIndex failed

Stack Trace:
java.lang.RuntimeException: CheckIndex failed
	at org.apache.lucene.util._TestUtil.checkIndex(_TestUtil.java:158)
	at org.apache.lucene.util._TestUtil.checkIndex(_TestUtil.java:144)
	at org.apache.lucene.store.MockDirectoryWrapper.close(MockDirectoryWrapper.java:477)
	at org.apache.solr.SolrTestCaseJ4.closeDirectories(SolrTestCaseJ4.java:82)
	at org.apache.solr.SolrTestCaseJ4.deleteCore(SolrTestCaseJ4.java:284)
	at org.apache.solr.SolrTestCaseJ4.afterClassSolrTestCase(SolrTestCaseJ4.java:72)


FAILED:  junit.framework.TestSuite.org.apache.solr.handler.JsonLoaderTest

Error Message:
CheckIndex failed

Stack Trace:
java.lang.RuntimeException: CheckIndex failed
	at org.apache.lucene.util._TestUtil.checkIndex(_TestUtil.java:158)
	at org.apache.lucene.util._TestUtil.checkIndex(_TestUtil.java:144)
	at org.apache.lucene.store.MockDirectoryWrapper.close(MockDirectoryWrapper.java:477)
	at org.apache.solr.SolrTestCaseJ4.closeDirectories(SolrTestCaseJ4.java:82)
	at org.apache.solr.SolrTestCaseJ4.deleteCore(SolrTestCaseJ4.java:284)
	at org.apache.solr.SolrTestCaseJ4.afterClassSolrTestCase(SolrTestCaseJ4.java:72)


FAILED:  junit.framework.TestSuite.org.apache.solr.handler.XmlUpdateRequestHandlerTest

Error Message:
CheckIndex failed

Stack Trace:
java.lang.RuntimeException: CheckIndex failed
	at org.apache.lucene.util._TestUtil.checkIndex(_TestUtil.java:158)
	at org.apache.lucene.util._TestUtil.checkIndex(_TestUtil.java:144)
	at org.apache.lucene.store.MockDirectoryWrapper.close(MockDirectoryWrapper.java:477)
	at org.apache.solr.SolrTestCaseJ4.closeDirectories(SolrTestCaseJ4.java:82)
	at org.apache.solr.SolrTestCaseJ4.deleteCore(SolrTestCaseJ4.java:284)
	at org.apache.solr.SolrTestCaseJ4.afterClassSolrTestCase(SolrTestCaseJ4.java:72)


FAILED:  junit.framework.TestSuite.org.apache.solr.handler.XmlUpdateRequestHandlerTest

Error Message:
directory of test was not closed, opened from: org.apache.solr.core.MockDirectoryFactory.open(MockDirectoryFactory.java:33)

Stack Trace:
junit.framework.AssertionFailedError: directory of test was not closed, opened from: org.apache.solr.core.MockDirectoryFactory.open(MockDirectoryFactory.java:33)
	at org.apache.lucene.util.LuceneTestCase.afterClassLuceneTestCaseJ4(LuceneTestCase.java:444)


FAILED:  junit.framework.TestSuite.org.apache.solr.handler.component.SearchHandlerTest

Error Message:
CheckIndex failed

Stack Trace:
java.lang.RuntimeException: CheckIndex failed
	at org.apache.lucene.util._TestUtil.checkIndex(_TestUtil.java:158)
	at org.apache.lucene.util._TestUtil.checkIndex(_TestUtil.java:144)
	at org.apache.lucene.store.MockDirectoryWrapper.close(MockDirectoryWrapper.java:477)
	at org.apache.solr.SolrTestCaseJ4.closeDirectories(SolrTestCaseJ4.java:82)
	at org.apache.solr.SolrTestCaseJ4.deleteCore(SolrTestCaseJ4.java:284)
	at org.apache.solr.SolrTestCaseJ4.afterClassSolrTestCase(SolrTestCaseJ4.java:72)


FAILED:  junit.framework.TestSuite.org.apache.solr.handler.component.SearchHandlerTest

Error Message:
directory of test was not closed, opened from: org.apache.solr.core.MockDirectoryFactory.open(MockDirectoryFactory.java:33)

Stack Trace:
junit.framework.AssertionFailedError: directory of test was not closed, opened from: org.apache.solr.core.MockDirectoryFactory.open(MockDirectoryFactory.java:33)
	at org.apache.lucene.util.LuceneTestCase.afterClassLuceneTestCaseJ4(LuceneTestCase.java:444)


FAILED:  junit.framework.TestSuite.org.apache.solr.request.JSONWriterTest

Error Message:
CheckIndex failed

Stack Trace:
java.lang.RuntimeException: CheckIndex failed
	at org.apache.lucene.util._TestUtil.checkIndex(_TestUtil.java:158)
	at org.apache.lucene.util._TestUtil.checkIndex(_TestUtil.java:144)
	at org.apache.lucene.store.MockDirectoryWrapper.close(MockDirectoryWrapper.java:477)
	at org.apache.solr.SolrTestCaseJ4.closeDirectories(SolrTestCaseJ4.java:82)
	at org.apache.solr.SolrTestCaseJ4.deleteCore(SolrTestCaseJ4.java:284)
	at org.apache.solr.SolrTestCaseJ4.afterClassSolrTestCase(SolrTestCaseJ4.java:72)


FAILED:  junit.framework.TestSuite.org.apache.solr.request.JSONWriterTest

Error Message:
directory of test was not closed, opened from: org.apache.solr.core.MockDirectoryFactory.open(MockDirectoryFactory.java:33)

Stack Trace:
junit.framework.AssertionFailedError: directory of test was not closed, opened from: org.apache.solr.core.MockDirectoryFactory.open(MockDirectoryFactory.java:33)
	at org.apache.lucene.util.LuceneTestCase.afterClassLuceneTestCaseJ4(LuceneTestCase.java:444)


FAILED:  junit.framework.TestSuite.org.apache.solr.response.TestPHPSerializedResponseWriter

Error Message:
CheckIndex failed

Stack Trace:
java.lang.RuntimeException: CheckIndex failed
	at org.apache.lucene.util._TestUtil.checkIndex(_TestUtil.java:158)
	at org.apache.lucene.util._TestUtil.checkIndex(_TestUtil.java:144)
	at org.apache.lucene.store.MockDirectoryWrapper.close(MockDirectoryWrapper.java:477)
	at org.apache.solr.SolrTestCaseJ4.closeDirectories(SolrTestCaseJ4.java:82)
	at org.apache.solr.SolrTestCaseJ4.deleteCore(SolrTestCaseJ4.java:284)
	at org.apache.solr.SolrTestCaseJ4.afterClassSolrTestCase(SolrTestCaseJ4.java:72)


FAILED:  junit.framework.TestSuite.org.apache.solr.response.TestPHPSerializedResponseWriter

Error Message:
directory of test was not closed, opened from: org.apache.solr.core.MockDirectoryFactory.open(MockDirectoryFactory.java:33)

Stack Trace:
junit.framework.AssertionFailedError: directory of test was not closed, opened from: org.apache.solr.core.MockDirectoryFactory.open(MockDirectoryFactory.java:33)
	at org.apache.lucene.util.LuceneTestCase.afterClassLuceneTestCaseJ4(LuceneTestCase.java:444)


FAILED:  junit.framework.TestSuite.org.apache.solr.schema.NotRequiredUniqueKeyTest

Error Message:
CheckIndex failed

Stack Trace:
java.lang.RuntimeException: CheckIndex failed
	at org.apache.lucene.util._TestUtil.checkIndex(_TestUtil.java:158)
	at org.apache.lucene.util._TestUtil.checkIndex(_TestUtil.java:144)
	at org.apache.lucene.store.MockDirectoryWrapper.close(MockDirectoryWrapper.java:477)
	at org.apache.solr.SolrTestCaseJ4.closeDirectories(SolrTestCaseJ4.java:82)
	at org.apache.solr.SolrTestCaseJ4.deleteCore(SolrTestCaseJ4.java:284)
	at org.apache.solr.SolrTestCaseJ4.afterClassSolrTestCase(SolrTestCaseJ4.java:72)


FAILED:  junit.framework.TestSuite.org.apache.solr.schema.NotRequiredUniqueKeyTest

Error Message:
directory of test was not closed, opened from: org.apache.solr.core.MockDirectoryFactory.open(MockDirectoryFactory.java:33)

Stack Trace:
junit.framework.AssertionFailedError: directory of test was not closed, opened from: org.apache.solr.core.MockDirectoryFactory.open(MockDirectoryFactory.java:33)
	at org.apache.lucene.util.LuceneTestCase.afterClassLuceneTestCaseJ4(LuceneTestCase.java:444)


FAILED:  junit.framework.TestSuite.org.apache.solr.schema.TestPerFieldSimilarity

Error Message:
CheckIndex failed

Stack Trace:
java.lang.RuntimeException: CheckIndex failed
	at org.apache.lucene.util._TestUtil.checkIndex(_TestUtil.java:158)
	at org.apache.lucene.util._TestUtil.checkIndex(_TestUtil.java:144)
	at org.apache.lucene.store.MockDirectoryWrapper.close(MockDirectoryWrapper.java:477)
	at org.apache.solr.SolrTestCaseJ4.closeDirectories(SolrTestCaseJ4.java:82)
	at org.apache.solr.SolrTestCaseJ4.deleteCore(SolrTestCaseJ4.java:284)
	at org.apache.solr.SolrTestCaseJ4.afterClassSolrTestCase(SolrTestCaseJ4.java:72)


FAILED:  junit.framework.TestSuite.org.apache.solr.schema.TestPerFieldSimilarity

Error Message:
directory of test was not closed, opened from: org.apache.solr.core.MockDirectoryFactory.open(MockDirectoryFactory.java:33)

Stack Trace:
junit.framework.AssertionFailedError: directory of test was not closed, opened from: org.apache.solr.core.MockDirectoryFactory.open(MockDirectoryFactory.java:33)
	at org.apache.lucene.util.LuceneTestCase.afterClassLuceneTestCaseJ4(LuceneTestCase.java:444)


FAILED:  junit.framework.TestSuite.org.apache.solr.search.QueryParsingTest

Error Message:
CheckIndex failed

Stack Trace:
java.lang.RuntimeException: CheckIndex failed
	at org.apache.lucene.util._TestUtil.checkIndex(_TestUtil.java:158)
	at org.apache.lucene.util._TestUtil.checkIndex(_TestUtil.java:144)
	at org.apache.lucene.store.MockDirectoryWrapper.close(MockDirectoryWrapper.java:477)
	at org.apache.solr.SolrTestCaseJ4.closeDirectories(SolrTestCaseJ4.java:82)
	at org.apache.solr.SolrTestCaseJ4.deleteCore(SolrTestCaseJ4.java:284)
	at org.apache.solr.SolrTestCaseJ4.afterClassSolrTestCase(SolrTestCaseJ4.java:72)


REGRESSION:  org.apache.solr.search.TestSearchPerf.testEmpty

Error Message:
CheckIndex failed

Stack Trace:
java.lang.RuntimeException: CheckIndex failed
	at org.apache.lucene.util._TestUtil.checkIndex(_TestUtil.java:158)
	at org.apache.lucene.util._TestUtil.checkIndex(_TestUtil.java:144)
	at org.apache.lucene.store.MockDirectoryWrapper.close(MockDirectoryWrapper.java:477)
	at org.apache.solr.SolrTestCaseJ4.closeDirectories(SolrTestCaseJ4.java:82)
	at org.apache.solr.util.AbstractSolrTestCase.tearDown(AbstractSolrTestCase.java:194)
	at org.apache.solr.search.TestSearchPerf.tearDown(TestSearchPerf.java:49)
	at org.apache.lucene.util.LuceneTestCase$LuceneTestCaseRunner.runChild(LuceneTestCase.java:1403)
	at org.apache.lucene.util.LuceneTestCase$LuceneTestCaseRunner.runChild(LuceneTestCase.java:1321)


FAILED:  junit.framework.TestSuite.org.apache.solr.search.TestSearchPerf

Error Message:
ensure your setUp() calls super.setUp() and your tearDown() calls super.tearDown()!!!

Stack Trace:
junit.framework.AssertionFailedError: ensure your setUp() calls super.setUp() and your tearDown()
calls super.tearDown()!!!
	at org.apache.lucene.util.LuceneTestCase.afterClassLuceneTestCaseJ4(LuceneTestCase.java:401)


FAILED:  junit.framework.TestSuite.org.apache.solr.servlet.NoCacheHeaderTest

Error Message:
CheckIndex failed

Stack Trace:
java.lang.RuntimeException: CheckIndex failed
	at org.apache.lucene.util._TestUtil.checkIndex(_TestUtil.java:158)
	at org.apache.lucene.util._TestUtil.checkIndex(_TestUtil.java:144)
	at org.apache.lucene.store.MockDirectoryWrapper.close(MockDirectoryWrapper.java:477)
	at org.apache.solr.SolrTestCaseJ4.closeDirectories(SolrTestCaseJ4.java:82)
	at org.apache.solr.SolrTestCaseJ4.deleteCore(SolrTestCaseJ4.java:284)
	at org.apache.solr.SolrTestCaseJ4.afterClassSolrTestCase(SolrTestCaseJ4.java:72)


FAILED:  junit.framework.TestSuite.org.apache.solr.servlet.NoCacheHeaderTest

Error Message:
directory of test was not closed, opened from: org.apache.solr.core.MockDirectoryFactory.open(MockDirectoryFactory.java:33)

Stack Trace:
junit.framework.AssertionFailedError: directory of test was not closed, opened from: org.apache.solr.core.MockDirectoryFactory.open(MockDirectoryFactory.java:33)
	at org.apache.lucene.util.LuceneTestCase.afterClassLuceneTestCaseJ4(LuceneTestCase.java:444)


FAILED:  junit.framework.TestSuite.org.apache.solr.servlet.SolrRequestParserTest

Error Message:
CheckIndex failed

Stack Trace:
java.lang.RuntimeException: CheckIndex failed
	at org.apache.lucene.util._TestUtil.checkIndex(_TestUtil.java:158)
	at org.apache.lucene.util._TestUtil.checkIndex(_TestUtil.java:144)
	at org.apache.lucene.store.MockDirectoryWrapper.close(MockDirectoryWrapper.java:477)
	at org.apache.solr.SolrTestCaseJ4.closeDirectories(SolrTestCaseJ4.java:82)
	at org.apache.solr.SolrTestCaseJ4.deleteCore(SolrTestCaseJ4.java:284)
	at org.apache.solr.SolrTestCaseJ4.afterClassSolrTestCase(SolrTestCaseJ4.java:72)


FAILED:  junit.framework.TestSuite.org.apache.solr.servlet.SolrRequestParserTest

Error Message:
directory of test was not closed, opened from: org.apache.solr.core.MockDirectoryFactory.open(MockDirectoryFactory.java:33)

Stack Trace:
junit.framework.AssertionFailedError: directory of test was not closed, opened from: org.apache.solr.core.MockDirectoryFactory.open(MockDirectoryFactory.java:33)
	at org.apache.lucene.util.LuceneTestCase.afterClassLuceneTestCaseJ4(LuceneTestCase.java:444)


FAILED:  junit.framework.TestSuite.org.apache.solr.update.DocumentBuilderTest

Error Message:
CheckIndex failed

Stack Trace:
java.lang.RuntimeException: CheckIndex failed
	at org.apache.lucene.util._TestUtil.checkIndex(_TestUtil.java:158)
	at org.apache.lucene.util._TestUtil.checkIndex(_TestUtil.java:144)
	at org.apache.lucene.store.MockDirectoryWrapper.close(MockDirectoryWrapper.java:477)
	at org.apache.solr.SolrTestCaseJ4.closeDirectories(SolrTestCaseJ4.java:82)
	at org.apache.solr.SolrTestCaseJ4.deleteCore(SolrTestCaseJ4.java:284)
	at org.apache.solr.SolrTestCaseJ4.afterClassSolrTestCase(SolrTestCaseJ4.java:72)


FAILED:  junit.framework.TestSuite.org.apache.solr.update.DocumentBuilderTest

Error Message:
directory of test was not closed, opened from: org.apache.solr.core.MockDirectoryFactory.open(MockDirectoryFactory.java:33)

Stack Trace:
junit.framework.AssertionFailedError: directory of test was not closed, opened from: org.apache.solr.core.MockDirectoryFactory.open(MockDirectoryFactory.java:33)
	at org.apache.lucene.util.LuceneTestCase.afterClassLuceneTestCaseJ4(LuceneTestCase.java:444)


REGRESSION:  org.apache.solr.update.TestIndexingPerformance.testIndexingPerf

Error Message:
CheckIndex failed

Stack Trace:
java.lang.RuntimeException: CheckIndex failed
	at org.apache.lucene.util._TestUtil.checkIndex(_TestUtil.java:158)
	at org.apache.lucene.util._TestUtil.checkIndex(_TestUtil.java:144)
	at org.apache.lucene.store.MockDirectoryWrapper.close(MockDirectoryWrapper.java:477)
	at org.apache.solr.SolrTestCaseJ4.closeDirectories(SolrTestCaseJ4.java:82)
	at org.apache.solr.util.AbstractSolrTestCase.tearDown(AbstractSolrTestCase.java:194)
	at org.apache.lucene.util.LuceneTestCase$LuceneTestCaseRunner.runChild(LuceneTestCase.java:1403)
	at org.apache.lucene.util.LuceneTestCase$LuceneTestCaseRunner.runChild(LuceneTestCase.java:1321)


FAILED:  junit.framework.TestSuite.org.apache.solr.update.TestIndexingPerformance

Error Message:
ensure your setUp() calls super.setUp() and your tearDown() calls super.tearDown()!!!

Stack Trace:
junit.framework.AssertionFailedError: ensure your setUp() calls super.setUp() and your tearDown()
calls super.tearDown()!!!
	at org.apache.lucene.util.LuceneTestCase.afterClassLuceneTestCaseJ4(LuceneTestCase.java:401)


REGRESSION:  org.apache.solr.update.UpdateParamsTest.testUpdateProcessorParamDeprecation

Error Message:
CheckIndex failed

Stack Trace:
java.lang.RuntimeException: CheckIndex failed
	at org.apache.lucene.util._TestUtil.checkIndex(_TestUtil.java:158)
	at org.apache.lucene.util._TestUtil.checkIndex(_TestUtil.java:144)
	at org.apache.lucene.store.MockDirectoryWrapper.close(MockDirectoryWrapper.java:477)
	at org.apache.solr.SolrTestCaseJ4.closeDirectories(SolrTestCaseJ4.java:82)
	at org.apache.solr.util.AbstractSolrTestCase.tearDown(AbstractSolrTestCase.java:194)
	at org.apache.lucene.util.LuceneTestCase$LuceneTestCaseRunner.runChild(LuceneTestCase.java:1403)
	at org.apache.lucene.util.LuceneTestCase$LuceneTestCaseRunner.runChild(LuceneTestCase.java:1321)


FAILED:  junit.framework.TestSuite.org.apache.solr.update.UpdateParamsTest

Error Message:
ensure your setUp() calls super.setUp() and your tearDown() calls super.tearDown()!!!

Stack Trace:
junit.framework.AssertionFailedError: ensure your setUp() calls super.setUp() and your tearDown()
calls super.tearDown()!!!
	at org.apache.lucene.util.LuceneTestCase.afterClassLuceneTestCaseJ4(LuceneTestCase.java:401)


REGRESSION:  org.apache.solr.update.processor.UpdateRequestProcessorFactoryTest.testConfiguration

Error Message:
CheckIndex failed

Stack Trace:
java.lang.RuntimeException: CheckIndex failed
	at org.apache.lucene.util._TestUtil.checkIndex(_TestUtil.java:158)
	at org.apache.lucene.util._TestUtil.checkIndex(_TestUtil.java:144)
	at org.apache.lucene.store.MockDirectoryWrapper.close(MockDirectoryWrapper.java:477)
	at org.apache.solr.SolrTestCaseJ4.closeDirectories(SolrTestCaseJ4.java:82)
	at org.apache.solr.util.AbstractSolrTestCase.tearDown(AbstractSolrTestCase.java:194)
	at org.apache.lucene.util.LuceneTestCase$LuceneTestCaseRunner.runChild(LuceneTestCase.java:1403)
	at org.apache.lucene.util.LuceneTestCase$LuceneTestCaseRunner.runChild(LuceneTestCase.java:1321)


FAILED:  junit.framework.TestSuite.org.apache.solr.update.processor.UpdateRequestProcessorFactoryTest

Error Message:
ensure your setUp() calls super.setUp() and your tearDown() calls super.tearDown()!!!

Stack Trace:
junit.framework.AssertionFailedError: ensure your setUp() calls super.setUp() and your tearDown()
calls super.tearDown()!!!
	at org.apache.lucene.util.LuceneTestCase.afterClassLuceneTestCaseJ4(LuceneTestCase.java:401)


REGRESSION:  org.apache.solr.velocity.VelocityResponseWriterTest.testTemplateName

Error Message:
CheckIndex failed

Stack Trace:
java.lang.RuntimeException: CheckIndex failed
	at org.apache.lucene.util._TestUtil.checkIndex(_TestUtil.java:158)
	at org.apache.lucene.util._TestUtil.checkIndex(_TestUtil.java:144)
	at org.apache.lucene.store.MockDirectoryWrapper.close(MockDirectoryWrapper.java:477)
	at org.apache.solr.SolrTestCaseJ4.closeDirectories(SolrTestCaseJ4.java:82)
	at org.apache.solr.util.AbstractSolrTestCase.tearDown(AbstractSolrTestCase.java:194)
	at org.apache.lucene.util.LuceneTestCase$LuceneTestCaseRunner.runChild(LuceneTestCase.java:1403)
	at org.apache.lucene.util.LuceneTestCase$LuceneTestCaseRunner.runChild(LuceneTestCase.java:1321)


FAILED:  junit.framework.TestSuite.org.apache.solr.velocity.VelocityResponseWriterTest

Error Message:
ensure your setUp() calls super.setUp() and your tearDown() calls super.tearDown()!!!

Stack Trace:
junit.framework.AssertionFailedError: ensure your setUp() calls super.setUp() and your tearDown()
calls super.tearDown()!!!
	at org.apache.lucene.util.LuceneTestCase.afterClassLuceneTestCaseJ4(LuceneTestCase.java:401)




Build Log (for compile errors):
[...truncated 9547 lines...]



---------------------------------------------------------------------
To unsubscribe, e-mail: dev-unsubscribe@lucene.apache.org
For additional commands, e-mail: dev-help@lucene.apache.org


Mime
View raw message