lucene-dev mailing list archives

Site index · List index
Message view « Date » · « Thread »
Top « Date » · « Thread »
From Apache Jenkins Server <jenk...@builds.apache.org>
Subject [JENKINS] Lucene-Solr-tests-only-3.x - Build # 8780 - Failure
Date Sun, 12 Jun 2011 07:35:01 GMT
Build: https://builds.apache.org/job/Lucene-Solr-tests-only-3.x/8780/

61 tests failed.
REGRESSION:  org.apache.lucene.index.TestAddIndexes.testAddIndexesWithClose

Error Message:
CheckIndex failed

Stack Trace:
java.lang.RuntimeException: CheckIndex failed
	at org.apache.lucene.util._TestUtil.checkIndex(_TestUtil.java:147)
	at org.apache.lucene.store.MockDirectoryWrapper.close(MockDirectoryWrapper.java:481)
	at org.apache.lucene.index.TestAddIndexes$RunAddIndexesThreads.closeDir(TestAddIndexes.java:693)
	at org.apache.lucene.index.TestAddIndexes.testAddIndexesWithClose(TestAddIndexes.java:809)
	at org.apache.lucene.util.LuceneTestCase$LuceneTestCaseRunner.runChild(LuceneTestCase.java:1268)
	at org.apache.lucene.util.LuceneTestCase$LuceneTestCaseRunner.runChild(LuceneTestCase.java:1186)


REGRESSION:  org.apache.lucene.index.TestCrash.testCrashWhileIndexing

Error Message:
CheckIndex failed

Stack Trace:
java.lang.RuntimeException: CheckIndex failed
	at org.apache.lucene.util._TestUtil.checkIndex(_TestUtil.java:147)
	at org.apache.lucene.store.MockDirectoryWrapper.close(MockDirectoryWrapper.java:481)
	at org.apache.lucene.index.TestCrash.testCrashWhileIndexing(TestCrash.java:77)
	at org.apache.lucene.util.LuceneTestCase$LuceneTestCaseRunner.runChild(LuceneTestCase.java:1268)
	at org.apache.lucene.util.LuceneTestCase$LuceneTestCaseRunner.runChild(LuceneTestCase.java:1186)


REGRESSION:  org.apache.lucene.index.TestIndexWriter.testIndexNoDocuments

Error Message:
CheckIndex failed

Stack Trace:
java.lang.RuntimeException: CheckIndex failed
	at org.apache.lucene.util._TestUtil.checkIndex(_TestUtil.java:147)
	at org.apache.lucene.store.MockDirectoryWrapper.close(MockDirectoryWrapper.java:481)
	at org.apache.lucene.index.TestIndexWriter.testIndexNoDocuments(TestIndexWriter.java:343)
	at org.apache.lucene.util.LuceneTestCase$LuceneTestCaseRunner.runChild(LuceneTestCase.java:1268)
	at org.apache.lucene.util.LuceneTestCase$LuceneTestCaseRunner.runChild(LuceneTestCase.java:1186)


REGRESSION:  org.apache.lucene.index.TestIndexWriter.testOtherFiles

Error Message:
CheckIndex failed

Stack Trace:
java.lang.RuntimeException: CheckIndex failed
	at org.apache.lucene.util._TestUtil.checkIndex(_TestUtil.java:147)
	at org.apache.lucene.store.MockDirectoryWrapper.close(MockDirectoryWrapper.java:481)
	at org.apache.lucene.index.TestIndexWriter.testOtherFiles(TestIndexWriter.java:1307)
	at org.apache.lucene.util.LuceneTestCase$LuceneTestCaseRunner.runChild(LuceneTestCase.java:1268)
	at org.apache.lucene.util.LuceneTestCase$LuceneTestCaseRunner.runChild(LuceneTestCase.java:1186)


REGRESSION:  org.apache.lucene.index.TestIndexWriter.testEmptyFSDirWithNoLock

Error Message:
CheckIndex failed

Stack Trace:
java.lang.RuntimeException: CheckIndex failed
	at org.apache.lucene.util._TestUtil.checkIndex(_TestUtil.java:147)
	at org.apache.lucene.store.MockDirectoryWrapper.close(MockDirectoryWrapper.java:481)
	at org.apache.lucene.index.TestIndexWriter.testEmptyFSDirWithNoLock(TestIndexWriter.java:1698)
	at org.apache.lucene.util.LuceneTestCase$LuceneTestCaseRunner.runChild(LuceneTestCase.java:1268)
	at org.apache.lucene.util.LuceneTestCase$LuceneTestCaseRunner.runChild(LuceneTestCase.java:1186)


REGRESSION:  org.apache.lucene.index.TestIndexWriterCommit.testNoCommits

Error Message:
CheckIndex failed

Stack Trace:
java.lang.RuntimeException: CheckIndex failed
	at org.apache.lucene.util._TestUtil.checkIndex(_TestUtil.java:147)
	at org.apache.lucene.store.MockDirectoryWrapper.close(MockDirectoryWrapper.java:481)
	at org.apache.lucene.index.TestIndexWriterCommit.testNoCommits(TestIndexWriterCommit.java:501)
	at org.apache.lucene.util.LuceneTestCase$LuceneTestCaseRunner.runChild(LuceneTestCase.java:1268)
	at org.apache.lucene.util.LuceneTestCase$LuceneTestCaseRunner.runChild(LuceneTestCase.java:1186)


REGRESSION:  org.apache.lucene.index.TestIndexWriterCommit.testPrepareCommitNoChanges

Error Message:
CheckIndex failed

Stack Trace:
java.lang.RuntimeException: CheckIndex failed
	at org.apache.lucene.util._TestUtil.checkIndex(_TestUtil.java:147)
	at org.apache.lucene.store.MockDirectoryWrapper.close(MockDirectoryWrapper.java:481)
	at org.apache.lucene.index.TestIndexWriterCommit.testPrepareCommitNoChanges(TestIndexWriterCommit.java:628)
	at org.apache.lucene.util.LuceneTestCase$LuceneTestCaseRunner.runChild(LuceneTestCase.java:1268)
	at org.apache.lucene.util.LuceneTestCase$LuceneTestCaseRunner.runChild(LuceneTestCase.java:1186)


REGRESSION:  org.apache.lucene.index.TestIndexWriterConfig.testIndexWriterSetters

Error Message:
CheckIndex failed

Stack Trace:
java.lang.RuntimeException: CheckIndex failed
	at org.apache.lucene.util._TestUtil.checkIndex(_TestUtil.java:147)
	at org.apache.lucene.store.MockDirectoryWrapper.close(MockDirectoryWrapper.java:481)
	at org.apache.lucene.index.TestIndexWriterConfig.testIndexWriterSetters(TestIndexWriterConfig.java:306)
	at org.apache.lucene.util.LuceneTestCase$LuceneTestCaseRunner.runChild(LuceneTestCase.java:1268)
	at org.apache.lucene.util.LuceneTestCase$LuceneTestCaseRunner.runChild(LuceneTestCase.java:1186)


REGRESSION:  org.apache.lucene.index.TestIndexWriterExceptions.testRandomExceptions

Error Message:
CheckIndex failed

Stack Trace:
java.lang.RuntimeException: CheckIndex failed
	at org.apache.lucene.util._TestUtil.checkIndex(_TestUtil.java:147)
	at org.apache.lucene.index.TestIndexWriterExceptions$IndexerThread.run(TestIndexWriterExceptions.java:106)
	at org.apache.lucene.index.TestIndexWriterExceptions.testRandomExceptions(TestIndexWriterExceptions.java:181)
	at org.apache.lucene.util.LuceneTestCase$LuceneTestCaseRunner.runChild(LuceneTestCase.java:1268)
	at org.apache.lucene.util.LuceneTestCase$LuceneTestCaseRunner.runChild(LuceneTestCase.java:1186)


REGRESSION:  org.apache.lucene.index.TestIndexWriterExceptions.testRandomExceptionsThreads

Error Message:
Some threads threw uncaught exceptions!

Stack Trace:
junit.framework.AssertionFailedError: Some threads threw uncaught exceptions!
	at org.apache.lucene.util.LuceneTestCase$LuceneTestCaseRunner.runChild(LuceneTestCase.java:1268)
	at org.apache.lucene.util.LuceneTestCase$LuceneTestCaseRunner.runChild(LuceneTestCase.java:1186)
	at org.apache.lucene.util.LuceneTestCase.tearDown(LuceneTestCase.java:468)


REGRESSION:  org.apache.lucene.index.TestIndexWriterReader.testAfterCommit

Error Message:
CheckIndex failed

Stack Trace:
java.lang.RuntimeException: CheckIndex failed
	at org.apache.lucene.util._TestUtil.checkIndex(_TestUtil.java:147)
	at org.apache.lucene.index.TestIndexWriterReader.testAfterCommit(TestIndexWriterReader.java:678)
	at org.apache.lucene.util.LuceneTestCase$LuceneTestCaseRunner.runChild(LuceneTestCase.java:1268)
	at org.apache.lucene.util.LuceneTestCase$LuceneTestCaseRunner.runChild(LuceneTestCase.java:1186)


REGRESSION:  org.apache.lucene.index.TestIndexWriterReader.testEmptyIndex

Error Message:
CheckIndex failed

Stack Trace:
java.lang.RuntimeException: CheckIndex failed
	at org.apache.lucene.util._TestUtil.checkIndex(_TestUtil.java:147)
	at org.apache.lucene.store.MockDirectoryWrapper.close(MockDirectoryWrapper.java:481)
	at org.apache.lucene.index.TestIndexWriterReader.testEmptyIndex(TestIndexWriterReader.java:965)
	at org.apache.lucene.util.LuceneTestCase$LuceneTestCaseRunner.runChild(LuceneTestCase.java:1268)
	at org.apache.lucene.util.LuceneTestCase$LuceneTestCaseRunner.runChild(LuceneTestCase.java:1186)


REGRESSION:  org.apache.lucene.index.TestNewestSegment.testNewestSegment

Error Message:
CheckIndex failed

Stack Trace:
java.lang.RuntimeException: CheckIndex failed
	at org.apache.lucene.util._TestUtil.checkIndex(_TestUtil.java:147)
	at org.apache.lucene.store.MockDirectoryWrapper.close(MockDirectoryWrapper.java:481)
	at org.apache.lucene.index.TestNewestSegment.testNewestSegment(TestNewestSegment.java:31)
	at org.apache.lucene.util.LuceneTestCase$LuceneTestCaseRunner.runChild(LuceneTestCase.java:1268)
	at org.apache.lucene.util.LuceneTestCase$LuceneTestCaseRunner.runChild(LuceneTestCase.java:1186)


REGRESSION:  org.apache.lucene.index.TestParallelReaderEmptyIndex.testEmptyIndex

Error Message:
CheckIndex failed

Stack Trace:
java.lang.RuntimeException: CheckIndex failed
	at org.apache.lucene.util._TestUtil.checkIndex(_TestUtil.java:147)
	at org.apache.lucene.store.MockDirectoryWrapper.close(MockDirectoryWrapper.java:481)
	at org.apache.lucene.index.TestParallelReaderEmptyIndex.testEmptyIndex(TestParallelReaderEmptyIndex.java:66)
	at org.apache.lucene.util.LuceneTestCase$LuceneTestCaseRunner.runChild(LuceneTestCase.java:1268)
	at org.apache.lucene.util.LuceneTestCase$LuceneTestCaseRunner.runChild(LuceneTestCase.java:1186)


REGRESSION:  org.apache.lucene.index.TestPersistentSnapshotDeletionPolicy.testIllegalSnapshotId

Error Message:
CheckIndex failed

Stack Trace:
java.lang.RuntimeException: CheckIndex failed
	at org.apache.lucene.util._TestUtil.checkIndex(_TestUtil.java:147)
	at org.apache.lucene.store.MockDirectoryWrapper.close(MockDirectoryWrapper.java:481)
	at org.apache.lucene.index.TestPersistentSnapshotDeletionPolicy.tearDown(TestPersistentSnapshotDeletionPolicy.java:51)
	at org.apache.lucene.util.LuceneTestCase$LuceneTestCaseRunner.runChild(LuceneTestCase.java:1268)
	at org.apache.lucene.util.LuceneTestCase$LuceneTestCaseRunner.runChild(LuceneTestCase.java:1186)


REGRESSION:  org.apache.lucene.index.TestPersistentSnapshotDeletionPolicy.testInvalidSnapshotInfos

Error Message:
null

Stack Trace:
java.lang.NullPointerException
	at org.apache.lucene.index.TestPersistentSnapshotDeletionPolicy.tearDown(TestPersistentSnapshotDeletionPolicy.java:51)
	at org.apache.lucene.util.LuceneTestCase$LuceneTestCaseRunner.runChild(LuceneTestCase.java:1268)
	at org.apache.lucene.util.LuceneTestCase$LuceneTestCaseRunner.runChild(LuceneTestCase.java:1186)


REGRESSION:  org.apache.lucene.index.TestPersistentSnapshotDeletionPolicy.testNoSnapshotInfos

Error Message:
null

Stack Trace:
java.lang.NullPointerException
	at org.apache.lucene.index.TestPersistentSnapshotDeletionPolicy.tearDown(TestPersistentSnapshotDeletionPolicy.java:51)
	at org.apache.lucene.util.LuceneTestCase$LuceneTestCaseRunner.runChild(LuceneTestCase.java:1268)
	at org.apache.lucene.util.LuceneTestCase$LuceneTestCaseRunner.runChild(LuceneTestCase.java:1186)


REGRESSION:  org.apache.lucene.index.TestPersistentSnapshotDeletionPolicy.testTooManySnapshotInfos

Error Message:
null

Stack Trace:
java.lang.NullPointerException
	at org.apache.lucene.index.TestPersistentSnapshotDeletionPolicy.tearDown(TestPersistentSnapshotDeletionPolicy.java:51)
	at org.apache.lucene.util.LuceneTestCase$LuceneTestCaseRunner.runChild(LuceneTestCase.java:1268)
	at org.apache.lucene.util.LuceneTestCase$LuceneTestCaseRunner.runChild(LuceneTestCase.java:1186)


REGRESSION:  org.apache.lucene.index.TestPersistentSnapshotDeletionPolicy.testSnapshotRelease

Error Message:
null

Stack Trace:
java.lang.NullPointerException
	at org.apache.lucene.index.TestPersistentSnapshotDeletionPolicy.tearDown(TestPersistentSnapshotDeletionPolicy.java:51)
	at org.apache.lucene.util.LuceneTestCase$LuceneTestCaseRunner.runChild(LuceneTestCase.java:1268)
	at org.apache.lucene.util.LuceneTestCase$LuceneTestCaseRunner.runChild(LuceneTestCase.java:1186)


REGRESSION:  org.apache.lucene.index.TestPersistentSnapshotDeletionPolicy.testStaticRead

Error Message:
null

Stack Trace:
java.lang.NullPointerException
	at org.apache.lucene.index.TestPersistentSnapshotDeletionPolicy.tearDown(TestPersistentSnapshotDeletionPolicy.java:51)
	at org.apache.lucene.util.LuceneTestCase$LuceneTestCaseRunner.runChild(LuceneTestCase.java:1268)
	at org.apache.lucene.util.LuceneTestCase$LuceneTestCaseRunner.runChild(LuceneTestCase.java:1186)


REGRESSION:  org.apache.lucene.index.TestPersistentSnapshotDeletionPolicy.testSnapshotDeletionPolicy

Error Message:
null

Stack Trace:
java.lang.NullPointerException
	at org.apache.lucene.index.TestPersistentSnapshotDeletionPolicy.tearDown(TestPersistentSnapshotDeletionPolicy.java:51)
	at org.apache.lucene.util.LuceneTestCase$LuceneTestCaseRunner.runChild(LuceneTestCase.java:1268)
	at org.apache.lucene.util.LuceneTestCase$LuceneTestCaseRunner.runChild(LuceneTestCase.java:1186)


REGRESSION:  org.apache.lucene.index.TestPersistentSnapshotDeletionPolicy.testBasicSnapshots

Error Message:
null

Stack Trace:
java.lang.NullPointerException
	at org.apache.lucene.index.TestPersistentSnapshotDeletionPolicy.tearDown(TestPersistentSnapshotDeletionPolicy.java:51)
	at org.apache.lucene.util.LuceneTestCase$LuceneTestCaseRunner.runChild(LuceneTestCase.java:1268)
	at org.apache.lucene.util.LuceneTestCase$LuceneTestCaseRunner.runChild(LuceneTestCase.java:1186)


REGRESSION:  org.apache.lucene.index.TestPersistentSnapshotDeletionPolicy.testMultiThreadedSnapshotting

Error Message:
null

Stack Trace:
java.lang.NullPointerException
	at org.apache.lucene.index.TestPersistentSnapshotDeletionPolicy.tearDown(TestPersistentSnapshotDeletionPolicy.java:51)
	at org.apache.lucene.util.LuceneTestCase$LuceneTestCaseRunner.runChild(LuceneTestCase.java:1268)
	at org.apache.lucene.util.LuceneTestCase$LuceneTestCaseRunner.runChild(LuceneTestCase.java:1186)


REGRESSION:  org.apache.lucene.index.TestPersistentSnapshotDeletionPolicy.testRollbackToOldSnapshot

Error Message:
null

Stack Trace:
java.lang.NullPointerException
	at org.apache.lucene.index.TestPersistentSnapshotDeletionPolicy.tearDown(TestPersistentSnapshotDeletionPolicy.java:51)
	at org.apache.lucene.util.LuceneTestCase$LuceneTestCaseRunner.runChild(LuceneTestCase.java:1268)
	at org.apache.lucene.util.LuceneTestCase$LuceneTestCaseRunner.runChild(LuceneTestCase.java:1186)


REGRESSION:  org.apache.lucene.index.TestPersistentSnapshotDeletionPolicy.testReleaseSnapshot

Error Message:
null

Stack Trace:
java.lang.NullPointerException
	at org.apache.lucene.index.TestPersistentSnapshotDeletionPolicy.tearDown(TestPersistentSnapshotDeletionPolicy.java:51)
	at org.apache.lucene.util.LuceneTestCase$LuceneTestCaseRunner.runChild(LuceneTestCase.java:1268)
	at org.apache.lucene.util.LuceneTestCase$LuceneTestCaseRunner.runChild(LuceneTestCase.java:1186)


REGRESSION:  org.apache.lucene.index.TestPersistentSnapshotDeletionPolicy.testSnapshotLastCommitTwice

Error Message:
null

Stack Trace:
java.lang.NullPointerException
	at org.apache.lucene.index.TestPersistentSnapshotDeletionPolicy.tearDown(TestPersistentSnapshotDeletionPolicy.java:51)
	at org.apache.lucene.util.LuceneTestCase$LuceneTestCaseRunner.runChild(LuceneTestCase.java:1268)
	at org.apache.lucene.util.LuceneTestCase$LuceneTestCaseRunner.runChild(LuceneTestCase.java:1186)


REGRESSION:  org.apache.lucene.index.TestPersistentSnapshotDeletionPolicy.testMissingCommits

Error Message:
null

Stack Trace:
java.lang.NullPointerException
	at org.apache.lucene.index.TestPersistentSnapshotDeletionPolicy.tearDown(TestPersistentSnapshotDeletionPolicy.java:51)
	at org.apache.lucene.util.LuceneTestCase$LuceneTestCaseRunner.runChild(LuceneTestCase.java:1268)
	at org.apache.lucene.util.LuceneTestCase$LuceneTestCaseRunner.runChild(LuceneTestCase.java:1186)


FAILED:  junit.framework.TestSuite.org.apache.lucene.index.TestPersistentSnapshotDeletionPolicy

Error Message:
ensure your setUp() calls super.setUp() and your tearDown() calls super.tearDown()!!!

Stack Trace:
junit.framework.AssertionFailedError: ensure your setUp() calls super.setUp() and your tearDown()
calls super.tearDown()!!!
	at org.apache.lucene.util.LuceneTestCase.afterClassLuceneTestCaseJ4(LuceneTestCase.java:257)


REGRESSION:  org.apache.lucene.index.TestStressIndexing2.testRandomIWReader

Error Message:
CheckIndex failed

Stack Trace:
java.lang.RuntimeException: CheckIndex failed
	at org.apache.lucene.util._TestUtil.checkIndex(_TestUtil.java:147)
	at org.apache.lucene.index.TestStressIndexing2.indexRandomIWReader(TestStressIndexing2.java:192)
	at org.apache.lucene.index.TestStressIndexing2.testRandomIWReader(TestStressIndexing2.java:68)
	at org.apache.lucene.util.LuceneTestCase$LuceneTestCaseRunner.runChild(LuceneTestCase.java:1268)
	at org.apache.lucene.util.LuceneTestCase$LuceneTestCaseRunner.runChild(LuceneTestCase.java:1186)


REGRESSION:  org.apache.lucene.search.TestCachingWrapperFilter.testCachingWorks

Error Message:
CheckIndex failed

Stack Trace:
java.lang.RuntimeException: CheckIndex failed
	at org.apache.lucene.util._TestUtil.checkIndex(_TestUtil.java:147)
	at org.apache.lucene.store.MockDirectoryWrapper.close(MockDirectoryWrapper.java:481)
	at org.apache.lucene.search.TestCachingWrapperFilter.testCachingWorks(TestCachingWrapperFilter.java:60)
	at org.apache.lucene.util.LuceneTestCase$LuceneTestCaseRunner.runChild(LuceneTestCase.java:1268)
	at org.apache.lucene.util.LuceneTestCase$LuceneTestCaseRunner.runChild(LuceneTestCase.java:1186)


REGRESSION:  org.apache.lucene.search.TestCachingWrapperFilter.testNullDocIdSet

Error Message:
CheckIndex failed

Stack Trace:
java.lang.RuntimeException: CheckIndex failed
	at org.apache.lucene.util._TestUtil.checkIndex(_TestUtil.java:147)
	at org.apache.lucene.store.MockDirectoryWrapper.close(MockDirectoryWrapper.java:481)
	at org.apache.lucene.search.TestCachingWrapperFilter.testNullDocIdSet(TestCachingWrapperFilter.java:82)
	at org.apache.lucene.util.LuceneTestCase$LuceneTestCaseRunner.runChild(LuceneTestCase.java:1268)
	at org.apache.lucene.util.LuceneTestCase$LuceneTestCaseRunner.runChild(LuceneTestCase.java:1186)


REGRESSION:  org.apache.lucene.search.TestCachingWrapperFilter.testNullDocIdSetIterator

Error Message:
CheckIndex failed

Stack Trace:
java.lang.RuntimeException: CheckIndex failed
	at org.apache.lucene.util._TestUtil.checkIndex(_TestUtil.java:147)
	at org.apache.lucene.store.MockDirectoryWrapper.close(MockDirectoryWrapper.java:481)
	at org.apache.lucene.search.TestCachingWrapperFilter.testNullDocIdSetIterator(TestCachingWrapperFilter.java:109)
	at org.apache.lucene.util.LuceneTestCase$LuceneTestCaseRunner.runChild(LuceneTestCase.java:1268)
	at org.apache.lucene.util.LuceneTestCase$LuceneTestCaseRunner.runChild(LuceneTestCase.java:1186)


REGRESSION:  org.apache.lucene.search.TestPositiveScoresOnlyCollector.testNegativeScores

Error Message:
CheckIndex failed

Stack Trace:
java.lang.RuntimeException: CheckIndex failed
	at org.apache.lucene.util._TestUtil.checkIndex(_TestUtil.java:147)
	at org.apache.lucene.store.MockDirectoryWrapper.close(MockDirectoryWrapper.java:481)
	at org.apache.lucene.search.TestPositiveScoresOnlyCollector.testNegativeScores(TestPositiveScoresOnlyCollector.java:94)
	at org.apache.lucene.util.LuceneTestCase$LuceneTestCaseRunner.runChild(LuceneTestCase.java:1268)
	at org.apache.lucene.util.LuceneTestCase$LuceneTestCaseRunner.runChild(LuceneTestCase.java:1186)


REGRESSION:  org.apache.lucene.search.TestSort.testEmptyIndex

Error Message:
CheckIndex failed

Stack Trace:
java.lang.RuntimeException: CheckIndex failed
	at org.apache.lucene.util._TestUtil.checkIndex(_TestUtil.java:147)
	at org.apache.lucene.store.MockDirectoryWrapper.close(MockDirectoryWrapper.java:481)
	at org.apache.lucene.search.TestSort.tearDown(TestSort.java:236)
	at org.apache.lucene.util.LuceneTestCase$LuceneTestCaseRunner.runChild(LuceneTestCase.java:1268)
	at org.apache.lucene.util.LuceneTestCase$LuceneTestCaseRunner.runChild(LuceneTestCase.java:1186)


REGRESSION:  org.apache.lucene.search.TestSort.testBuiltInSorts

Error Message:
null

Stack Trace:
java.lang.NullPointerException
	at org.apache.lucene.search.TestSort.tearDown(TestSort.java:229)
	at org.apache.lucene.util.LuceneTestCase$LuceneTestCaseRunner.runChild(LuceneTestCase.java:1268)
	at org.apache.lucene.util.LuceneTestCase$LuceneTestCaseRunner.runChild(LuceneTestCase.java:1186)


REGRESSION:  org.apache.lucene.search.TestSort.testTypedSort

Error Message:
null

Stack Trace:
java.lang.NullPointerException
	at org.apache.lucene.search.TestSort.tearDown(TestSort.java:229)
	at org.apache.lucene.util.LuceneTestCase$LuceneTestCaseRunner.runChild(LuceneTestCase.java:1268)
	at org.apache.lucene.util.LuceneTestCase$LuceneTestCaseRunner.runChild(LuceneTestCase.java:1186)


REGRESSION:  org.apache.lucene.search.TestSort.testStringSort

Error Message:
null

Stack Trace:
java.lang.NullPointerException
	at org.apache.lucene.search.TestSort.tearDown(TestSort.java:229)
	at org.apache.lucene.util.LuceneTestCase$LuceneTestCaseRunner.runChild(LuceneTestCase.java:1268)
	at org.apache.lucene.util.LuceneTestCase$LuceneTestCaseRunner.runChild(LuceneTestCase.java:1186)


REGRESSION:  org.apache.lucene.search.TestSort.testCustomFieldParserSort

Error Message:
null

Stack Trace:
java.lang.NullPointerException
	at org.apache.lucene.search.TestSort.tearDown(TestSort.java:229)
	at org.apache.lucene.util.LuceneTestCase$LuceneTestCaseRunner.runChild(LuceneTestCase.java:1268)
	at org.apache.lucene.util.LuceneTestCase$LuceneTestCaseRunner.runChild(LuceneTestCase.java:1186)


REGRESSION:  org.apache.lucene.search.TestSort.testNewCustomFieldParserSort

Error Message:
null

Stack Trace:
java.lang.NullPointerException
	at org.apache.lucene.search.TestSort.tearDown(TestSort.java:229)
	at org.apache.lucene.util.LuceneTestCase$LuceneTestCaseRunner.runChild(LuceneTestCase.java:1268)
	at org.apache.lucene.util.LuceneTestCase$LuceneTestCaseRunner.runChild(LuceneTestCase.java:1186)


REGRESSION:  org.apache.lucene.search.TestSort.testReverseSort

Error Message:
null

Stack Trace:
java.lang.NullPointerException
	at org.apache.lucene.search.TestSort.tearDown(TestSort.java:229)
	at org.apache.lucene.util.LuceneTestCase$LuceneTestCaseRunner.runChild(LuceneTestCase.java:1268)
	at org.apache.lucene.util.LuceneTestCase$LuceneTestCaseRunner.runChild(LuceneTestCase.java:1186)


REGRESSION:  org.apache.lucene.search.TestSort.testEmptyFieldSort

Error Message:
null

Stack Trace:
java.lang.NullPointerException
	at org.apache.lucene.search.TestSort.tearDown(TestSort.java:229)
	at org.apache.lucene.util.LuceneTestCase$LuceneTestCaseRunner.runChild(LuceneTestCase.java:1268)
	at org.apache.lucene.util.LuceneTestCase$LuceneTestCaseRunner.runChild(LuceneTestCase.java:1186)


REGRESSION:  org.apache.lucene.search.TestSort.testSortCombos

Error Message:
null

Stack Trace:
java.lang.NullPointerException
	at org.apache.lucene.search.TestSort.tearDown(TestSort.java:229)
	at org.apache.lucene.util.LuceneTestCase$LuceneTestCaseRunner.runChild(LuceneTestCase.java:1268)
	at org.apache.lucene.util.LuceneTestCase$LuceneTestCaseRunner.runChild(LuceneTestCase.java:1186)


REGRESSION:  org.apache.lucene.search.TestSort.testLocaleSort

Error Message:
null

Stack Trace:
java.lang.NullPointerException
	at org.apache.lucene.search.TestSort.tearDown(TestSort.java:229)
	at org.apache.lucene.util.LuceneTestCase$LuceneTestCaseRunner.runChild(LuceneTestCase.java:1268)
	at org.apache.lucene.util.LuceneTestCase$LuceneTestCaseRunner.runChild(LuceneTestCase.java:1186)


REGRESSION:  org.apache.lucene.search.TestSort.testInternationalSort

Error Message:
null

Stack Trace:
java.lang.NullPointerException
	at org.apache.lucene.search.TestSort.tearDown(TestSort.java:229)
	at org.apache.lucene.util.LuceneTestCase$LuceneTestCaseRunner.runChild(LuceneTestCase.java:1268)
	at org.apache.lucene.util.LuceneTestCase$LuceneTestCaseRunner.runChild(LuceneTestCase.java:1186)


REGRESSION:  org.apache.lucene.search.TestSort.testInternationalMultiSearcherSort

Error Message:
null

Stack Trace:
java.lang.NullPointerException
	at org.apache.lucene.search.TestSort.tearDown(TestSort.java:229)
	at org.apache.lucene.util.LuceneTestCase$LuceneTestCaseRunner.runChild(LuceneTestCase.java:1268)
	at org.apache.lucene.util.LuceneTestCase$LuceneTestCaseRunner.runChild(LuceneTestCase.java:1186)


REGRESSION:  org.apache.lucene.search.TestSort.testMultiSort

Error Message:
null

Stack Trace:
java.lang.NullPointerException
	at org.apache.lucene.search.TestSort.tearDown(TestSort.java:229)
	at org.apache.lucene.util.LuceneTestCase$LuceneTestCaseRunner.runChild(LuceneTestCase.java:1268)
	at org.apache.lucene.util.LuceneTestCase$LuceneTestCaseRunner.runChild(LuceneTestCase.java:1186)


REGRESSION:  org.apache.lucene.search.TestSort.testParallelMultiSort

Error Message:
null

Stack Trace:
java.lang.NullPointerException
	at org.apache.lucene.search.TestSort.tearDown(TestSort.java:229)
	at org.apache.lucene.util.LuceneTestCase$LuceneTestCaseRunner.runChild(LuceneTestCase.java:1268)
	at org.apache.lucene.util.LuceneTestCase$LuceneTestCaseRunner.runChild(LuceneTestCase.java:1186)


REGRESSION:  org.apache.lucene.search.TestSort.testNormalizedScores

Error Message:
null

Stack Trace:
java.lang.NullPointerException
	at org.apache.lucene.search.TestSort.tearDown(TestSort.java:229)
	at org.apache.lucene.util.LuceneTestCase$LuceneTestCaseRunner.runChild(LuceneTestCase.java:1268)
	at org.apache.lucene.util.LuceneTestCase$LuceneTestCaseRunner.runChild(LuceneTestCase.java:1186)


REGRESSION:  org.apache.lucene.search.TestSort.testTopDocsScores

Error Message:
null

Stack Trace:
java.lang.NullPointerException
	at org.apache.lucene.search.TestSort.tearDown(TestSort.java:229)
	at org.apache.lucene.util.LuceneTestCase$LuceneTestCaseRunner.runChild(LuceneTestCase.java:1268)
	at org.apache.lucene.util.LuceneTestCase$LuceneTestCaseRunner.runChild(LuceneTestCase.java:1186)


REGRESSION:  org.apache.lucene.search.TestSort.testSortWithoutFillFields

Error Message:
null

Stack Trace:
java.lang.NullPointerException
	at org.apache.lucene.search.TestSort.tearDown(TestSort.java:229)
	at org.apache.lucene.util.LuceneTestCase$LuceneTestCaseRunner.runChild(LuceneTestCase.java:1268)
	at org.apache.lucene.util.LuceneTestCase$LuceneTestCaseRunner.runChild(LuceneTestCase.java:1186)


REGRESSION:  org.apache.lucene.search.TestSort.testSortWithoutScoreTracking

Error Message:
null

Stack Trace:
java.lang.NullPointerException
	at org.apache.lucene.search.TestSort.tearDown(TestSort.java:229)
	at org.apache.lucene.util.LuceneTestCase$LuceneTestCaseRunner.runChild(LuceneTestCase.java:1268)
	at org.apache.lucene.util.LuceneTestCase$LuceneTestCaseRunner.runChild(LuceneTestCase.java:1186)


REGRESSION:  org.apache.lucene.search.TestSort.testSortWithScoreNoMaxScoreTracking

Error Message:
null

Stack Trace:
java.lang.NullPointerException
	at org.apache.lucene.search.TestSort.tearDown(TestSort.java:229)
	at org.apache.lucene.util.LuceneTestCase$LuceneTestCaseRunner.runChild(LuceneTestCase.java:1268)
	at org.apache.lucene.util.LuceneTestCase$LuceneTestCaseRunner.runChild(LuceneTestCase.java:1186)


REGRESSION:  org.apache.lucene.search.TestSort.testSortWithScoreNoMaxScoreTrackingMulti

Error Message:
null

Stack Trace:
java.lang.NullPointerException
	at org.apache.lucene.search.TestSort.tearDown(TestSort.java:229)
	at org.apache.lucene.util.LuceneTestCase$LuceneTestCaseRunner.runChild(LuceneTestCase.java:1268)
	at org.apache.lucene.util.LuceneTestCase$LuceneTestCaseRunner.runChild(LuceneTestCase.java:1186)


REGRESSION:  org.apache.lucene.search.TestSort.testSortWithScoreAndMaxScoreTracking

Error Message:
null

Stack Trace:
java.lang.NullPointerException
	at org.apache.lucene.search.TestSort.tearDown(TestSort.java:229)
	at org.apache.lucene.util.LuceneTestCase$LuceneTestCaseRunner.runChild(LuceneTestCase.java:1268)
	at org.apache.lucene.util.LuceneTestCase$LuceneTestCaseRunner.runChild(LuceneTestCase.java:1186)


REGRESSION:  org.apache.lucene.search.TestSort.testOutOfOrderDocsScoringSort

Error Message:
null

Stack Trace:
java.lang.NullPointerException
	at org.apache.lucene.search.TestSort.tearDown(TestSort.java:229)
	at org.apache.lucene.util.LuceneTestCase$LuceneTestCaseRunner.runChild(LuceneTestCase.java:1268)
	at org.apache.lucene.util.LuceneTestCase$LuceneTestCaseRunner.runChild(LuceneTestCase.java:1186)


REGRESSION:  org.apache.lucene.search.TestSort.testOutOfOrderDocsScoringSortMulti

Error Message:
null

Stack Trace:
java.lang.NullPointerException
	at org.apache.lucene.search.TestSort.tearDown(TestSort.java:229)
	at org.apache.lucene.util.LuceneTestCase$LuceneTestCaseRunner.runChild(LuceneTestCase.java:1268)
	at org.apache.lucene.util.LuceneTestCase$LuceneTestCaseRunner.runChild(LuceneTestCase.java:1186)


REGRESSION:  org.apache.lucene.search.TestSort.testSortWithScoreAndMaxScoreTrackingNoResults

Error Message:
null

Stack Trace:
java.lang.NullPointerException
	at org.apache.lucene.search.TestSort.tearDown(TestSort.java:229)
	at org.apache.lucene.util.LuceneTestCase$LuceneTestCaseRunner.runChild(LuceneTestCase.java:1268)
	at org.apache.lucene.util.LuceneTestCase$LuceneTestCaseRunner.runChild(LuceneTestCase.java:1186)


REGRESSION:  org.apache.lucene.search.TestSort.testEmptyStringVsNullStringSort

Error Message:
null

Stack Trace:
java.lang.NullPointerException
	at org.apache.lucene.search.TestSort.tearDown(TestSort.java:229)
	at org.apache.lucene.util.LuceneTestCase$LuceneTestCaseRunner.runChild(LuceneTestCase.java:1268)
	at org.apache.lucene.util.LuceneTestCase$LuceneTestCaseRunner.runChild(LuceneTestCase.java:1186)


REGRESSION:  org.apache.lucene.search.TestSort.testLUCENE2142

Error Message:
null

Stack Trace:
java.lang.NullPointerException
	at org.apache.lucene.search.TestSort.tearDown(TestSort.java:229)
	at org.apache.lucene.util.LuceneTestCase$LuceneTestCaseRunner.runChild(LuceneTestCase.java:1268)
	at org.apache.lucene.util.LuceneTestCase$LuceneTestCaseRunner.runChild(LuceneTestCase.java:1186)


REGRESSION:  org.apache.lucene.search.TestSort.testCountingCollector

Error Message:
null

Stack Trace:
java.lang.NullPointerException
	at org.apache.lucene.search.TestSort.tearDown(TestSort.java:229)
	at org.apache.lucene.util.LuceneTestCase$LuceneTestCaseRunner.runChild(LuceneTestCase.java:1268)
	at org.apache.lucene.util.LuceneTestCase$LuceneTestCaseRunner.runChild(LuceneTestCase.java:1186)


FAILED:  junit.framework.TestSuite.org.apache.lucene.search.TestSort

Error Message:
ensure your setUp() calls super.setUp() and your tearDown() calls super.tearDown()!!!

Stack Trace:
junit.framework.AssertionFailedError: ensure your setUp() calls super.setUp() and your tearDown()
calls super.tearDown()!!!
	at org.apache.lucene.util.LuceneTestCase.afterClassLuceneTestCaseJ4(LuceneTestCase.java:257)




Build Log (for compile errors):
[...truncated 6225 lines...]



---------------------------------------------------------------------
To unsubscribe, e-mail: dev-unsubscribe@lucene.apache.org
For additional commands, e-mail: dev-help@lucene.apache.org


Mime
View raw message