lucene-dev mailing list archives

Site index · List index
Message view « Date » · « Thread »
Top « Date » · « Thread »
From Apache Jenkins Server <jenk...@builds.apache.org>
Subject [JENKINS] Lucene-Solr-tests-only-trunk - Build # 8832 - Failure
Date Tue, 14 Jun 2011 16:26:06 GMT
Build: https://builds.apache.org/job/Lucene-Solr-tests-only-trunk/8832/

20 tests failed.
REGRESSION:  org.apache.lucene.index.TestIndexReaderReopen.testThreadSafety

Error Message:
Error occurred in thread Thread-73: /usr/home/hudson/hudson-slave/workspace/Lucene-Solr-tests-only-trunk/checkout/lucene/build/test/4/test6102461040tmp/_b_1.skp
(Too many open files in system)

Stack Trace:
junit.framework.AssertionFailedError: Error occurred in thread Thread-73:
/usr/home/hudson/hudson-slave/workspace/Lucene-Solr-tests-only-trunk/checkout/lucene/build/test/4/test6102461040tmp/_b_1.skp
(Too many open files in system)
	at org.apache.lucene.util.LuceneTestCase$LuceneTestCaseRunner.runChild(LuceneTestCase.java:1403)
	at org.apache.lucene.util.LuceneTestCase$LuceneTestCaseRunner.runChild(LuceneTestCase.java:1321)
/usr/home/hudson/hudson-slave/workspace/Lucene-Solr-tests-only-trunk/checkout/lucene/build/test/4/test6102461040tmp/_b_1.skp
(Too many open files in system)
	at org.apache.lucene.index.TestIndexReaderReopen.testThreadSafety(TestIndexReaderReopen.java:822)


REGRESSION:  org.apache.lucene.search.TestComplexExplanations.testCSQ4

Error Message:
CheckIndex failed

Stack Trace:
java.lang.RuntimeException: CheckIndex failed
	at org.apache.lucene.util._TestUtil.checkIndex(_TestUtil.java:158)
	at org.apache.lucene.util._TestUtil.checkIndex(_TestUtil.java:144)
	at org.apache.lucene.store.MockDirectoryWrapper.close(MockDirectoryWrapper.java:477)
	at org.apache.lucene.search.TestExplanations.tearDown(TestExplanations.java:66)
	at org.apache.lucene.search.TestComplexExplanations.tearDown(TestComplexExplanations.java:43)
	at org.apache.lucene.util.LuceneTestCase$LuceneTestCaseRunner.runChild(LuceneTestCase.java:1403)
	at org.apache.lucene.util.LuceneTestCase$LuceneTestCaseRunner.runChild(LuceneTestCase.java:1321)


REGRESSION:  org.apache.lucene.search.TestComplexExplanations.testDMQ10

Error Message:
null

Stack Trace:
java.lang.NullPointerException
	at org.apache.lucene.search.TestComplexExplanations.tearDown(TestComplexExplanations.java:42)
	at org.apache.lucene.util.LuceneTestCase$LuceneTestCaseRunner.runChild(LuceneTestCase.java:1403)
	at org.apache.lucene.util.LuceneTestCase$LuceneTestCaseRunner.runChild(LuceneTestCase.java:1321)


REGRESSION:  org.apache.lucene.search.TestComplexExplanations.testMPQ7

Error Message:
null

Stack Trace:
java.lang.NullPointerException
	at org.apache.lucene.search.TestComplexExplanations.tearDown(TestComplexExplanations.java:42)
	at org.apache.lucene.util.LuceneTestCase$LuceneTestCaseRunner.runChild(LuceneTestCase.java:1403)
	at org.apache.lucene.util.LuceneTestCase$LuceneTestCaseRunner.runChild(LuceneTestCase.java:1321)


REGRESSION:  org.apache.lucene.search.TestComplexExplanations.testBQ12

Error Message:
null

Stack Trace:
java.lang.NullPointerException
	at org.apache.lucene.search.TestComplexExplanations.tearDown(TestComplexExplanations.java:42)
	at org.apache.lucene.util.LuceneTestCase$LuceneTestCaseRunner.runChild(LuceneTestCase.java:1403)
	at org.apache.lucene.util.LuceneTestCase$LuceneTestCaseRunner.runChild(LuceneTestCase.java:1321)


REGRESSION:  org.apache.lucene.search.TestComplexExplanations.testBQ13

Error Message:
null

Stack Trace:
java.lang.NullPointerException
	at org.apache.lucene.search.TestComplexExplanations.tearDown(TestComplexExplanations.java:42)
	at org.apache.lucene.util.LuceneTestCase$LuceneTestCaseRunner.runChild(LuceneTestCase.java:1403)
	at org.apache.lucene.util.LuceneTestCase$LuceneTestCaseRunner.runChild(LuceneTestCase.java:1321)


REGRESSION:  org.apache.lucene.search.TestComplexExplanations.testBQ18

Error Message:
null

Stack Trace:
java.lang.NullPointerException
	at org.apache.lucene.search.TestComplexExplanations.tearDown(TestComplexExplanations.java:42)
	at org.apache.lucene.util.LuceneTestCase$LuceneTestCaseRunner.runChild(LuceneTestCase.java:1403)
	at org.apache.lucene.util.LuceneTestCase$LuceneTestCaseRunner.runChild(LuceneTestCase.java:1321)


REGRESSION:  org.apache.lucene.search.TestComplexExplanations.testBQ21

Error Message:
null

Stack Trace:
java.lang.NullPointerException
	at org.apache.lucene.search.TestComplexExplanations.tearDown(TestComplexExplanations.java:42)
	at org.apache.lucene.util.LuceneTestCase$LuceneTestCaseRunner.runChild(LuceneTestCase.java:1403)
	at org.apache.lucene.util.LuceneTestCase$LuceneTestCaseRunner.runChild(LuceneTestCase.java:1321)


REGRESSION:  org.apache.lucene.search.TestComplexExplanations.testBQ22

Error Message:
null

Stack Trace:
java.lang.NullPointerException
	at org.apache.lucene.search.TestComplexExplanations.tearDown(TestComplexExplanations.java:42)
	at org.apache.lucene.util.LuceneTestCase$LuceneTestCaseRunner.runChild(LuceneTestCase.java:1403)
	at org.apache.lucene.util.LuceneTestCase$LuceneTestCaseRunner.runChild(LuceneTestCase.java:1321)


REGRESSION:  org.apache.lucene.search.TestComplexExplanations.testST3

Error Message:
null

Stack Trace:
java.lang.NullPointerException
	at org.apache.lucene.search.TestComplexExplanations.tearDown(TestComplexExplanations.java:42)
	at org.apache.lucene.util.LuceneTestCase$LuceneTestCaseRunner.runChild(LuceneTestCase.java:1403)
	at org.apache.lucene.util.LuceneTestCase$LuceneTestCaseRunner.runChild(LuceneTestCase.java:1321)


REGRESSION:  org.apache.lucene.search.TestComplexExplanations.testST6

Error Message:
null

Stack Trace:
java.lang.NullPointerException
	at org.apache.lucene.search.TestComplexExplanations.tearDown(TestComplexExplanations.java:42)
	at org.apache.lucene.util.LuceneTestCase$LuceneTestCaseRunner.runChild(LuceneTestCase.java:1403)
	at org.apache.lucene.util.LuceneTestCase$LuceneTestCaseRunner.runChild(LuceneTestCase.java:1321)


REGRESSION:  org.apache.lucene.search.TestComplexExplanations.testSF3

Error Message:
null

Stack Trace:
java.lang.NullPointerException
	at org.apache.lucene.search.TestComplexExplanations.tearDown(TestComplexExplanations.java:42)
	at org.apache.lucene.util.LuceneTestCase$LuceneTestCaseRunner.runChild(LuceneTestCase.java:1403)
	at org.apache.lucene.util.LuceneTestCase$LuceneTestCaseRunner.runChild(LuceneTestCase.java:1321)


REGRESSION:  org.apache.lucene.search.TestComplexExplanations.testSF7

Error Message:
null

Stack Trace:
java.lang.NullPointerException
	at org.apache.lucene.search.TestComplexExplanations.tearDown(TestComplexExplanations.java:42)
	at org.apache.lucene.util.LuceneTestCase$LuceneTestCaseRunner.runChild(LuceneTestCase.java:1403)
	at org.apache.lucene.util.LuceneTestCase$LuceneTestCaseRunner.runChild(LuceneTestCase.java:1321)


REGRESSION:  org.apache.lucene.search.TestComplexExplanations.testSNot3

Error Message:
null

Stack Trace:
java.lang.NullPointerException
	at org.apache.lucene.search.TestComplexExplanations.tearDown(TestComplexExplanations.java:42)
	at org.apache.lucene.util.LuceneTestCase$LuceneTestCaseRunner.runChild(LuceneTestCase.java:1403)
	at org.apache.lucene.util.LuceneTestCase$LuceneTestCaseRunner.runChild(LuceneTestCase.java:1321)


REGRESSION:  org.apache.lucene.search.TestComplexExplanations.testSNot6

Error Message:
null

Stack Trace:
java.lang.NullPointerException
	at org.apache.lucene.search.TestComplexExplanations.tearDown(TestComplexExplanations.java:42)
	at org.apache.lucene.util.LuceneTestCase$LuceneTestCaseRunner.runChild(LuceneTestCase.java:1403)
	at org.apache.lucene.util.LuceneTestCase$LuceneTestCaseRunner.runChild(LuceneTestCase.java:1321)


REGRESSION:  org.apache.lucene.search.TestComplexExplanations.testSNot8

Error Message:
null

Stack Trace:
java.lang.NullPointerException
	at org.apache.lucene.search.TestComplexExplanations.tearDown(TestComplexExplanations.java:42)
	at org.apache.lucene.util.LuceneTestCase$LuceneTestCaseRunner.runChild(LuceneTestCase.java:1403)
	at org.apache.lucene.util.LuceneTestCase$LuceneTestCaseRunner.runChild(LuceneTestCase.java:1321)


REGRESSION:  org.apache.lucene.search.TestComplexExplanations.testSNot9

Error Message:
null

Stack Trace:
java.lang.NullPointerException
	at org.apache.lucene.search.TestComplexExplanations.tearDown(TestComplexExplanations.java:42)
	at org.apache.lucene.util.LuceneTestCase$LuceneTestCaseRunner.runChild(LuceneTestCase.java:1403)
	at org.apache.lucene.util.LuceneTestCase$LuceneTestCaseRunner.runChild(LuceneTestCase.java:1321)


REGRESSION:  org.apache.lucene.search.TestComplexExplanations.testNoop

Error Message:
null

Stack Trace:
java.lang.NullPointerException
	at org.apache.lucene.search.TestComplexExplanations.tearDown(TestComplexExplanations.java:42)
	at org.apache.lucene.util.LuceneTestCase$LuceneTestCaseRunner.runChild(LuceneTestCase.java:1403)
	at org.apache.lucene.util.LuceneTestCase$LuceneTestCaseRunner.runChild(LuceneTestCase.java:1321)


FAILED:  junit.framework.TestSuite.org.apache.lucene.search.TestComplexExplanations

Error Message:
ensure your setUp() calls super.setUp() and your tearDown() calls super.tearDown()!!!

Stack Trace:
junit.framework.AssertionFailedError: ensure your setUp() calls super.setUp() and your tearDown()
calls super.tearDown()!!!
	at org.apache.lucene.util.LuceneTestCase.afterClassLuceneTestCaseJ4(LuceneTestCase.java:401)


REGRESSION:  org.apache.lucene.search.TestSort.testStringSort

Error Message:
/usr/home/hudson/hudson-slave/workspace/Lucene-Solr-tests-only-trunk/checkout/lucene/build/test/4/test6102461048tmp/_35_1.tii
(Too many open files in system)

Stack Trace:
java.io.FileNotFoundException: /usr/home/hudson/hudson-slave/workspace/Lucene-Solr-tests-only-trunk/checkout/lucene/build/test/4/test6102461048tmp/_35_1.tii
(Too many open files in system)
	at java.io.RandomAccessFile.open(Native Method)
	at java.io.RandomAccessFile.<init>(RandomAccessFile.java:233)
	at org.apache.lucene.store.FSDirectory$FSIndexOutput.<init>(FSDirectory.java:416)
	at org.apache.lucene.store.FSDirectory.createOutput(FSDirectory.java:293)
	at org.apache.lucene.store.MockDirectoryWrapper.createOutput(MockDirectoryWrapper.java:375)
	at org.apache.lucene.index.codecs.FixedGapTermsIndexWriter.<init>(FixedGapTermsIndexWriter.java:61)
	at org.apache.lucene.index.codecs.mocksep.MockSepCodec.fieldsConsumer(MockSepCodec.java:68)
	at org.apache.lucene.index.PerFieldCodecWrapper$FieldsWriter.<init>(PerFieldCodecWrapper.java:73)
	at org.apache.lucene.index.PerFieldCodecWrapper.fieldsConsumer(PerFieldCodecWrapper.java:61)
	at org.apache.lucene.index.FreqProxTermsWriter.flush(FreqProxTermsWriter.java:58)
	at org.apache.lucene.index.TermsHash.flush(TermsHash.java:117)
	at org.apache.lucene.index.DocInverter.flush(DocInverter.java:80)
	at org.apache.lucene.index.DocFieldProcessor.flush(DocFieldProcessor.java:79)
	at org.apache.lucene.index.DocumentsWriterPerThread.flush(DocumentsWriterPerThread.java:459)
	at org.apache.lucene.index.DocumentsWriter.doFlush(DocumentsWriter.java:421)
	at org.apache.lucene.index.DocumentsWriter.postUpdate(DocumentsWriter.java:313)
	at org.apache.lucene.index.DocumentsWriter.updateDocument(DocumentsWriter.java:385)
	at org.apache.lucene.index.IndexWriter.updateDocument(IndexWriter.java:1474)
	at org.apache.lucene.index.IndexWriter.addDocument(IndexWriter.java:1234)
	at org.apache.lucene.index.IndexWriter.addDocument(IndexWriter.java:1215)
	at org.apache.lucene.search.TestSort.getFullStrings(TestSort.java:185)
	at org.apache.lucene.search.TestSort.testStringSort(TestSort.java:370)
	at org.apache.lucene.util.LuceneTestCase$LuceneTestCaseRunner.runChild(LuceneTestCase.java:1403)
	at org.apache.lucene.util.LuceneTestCase$LuceneTestCaseRunner.runChild(LuceneTestCase.java:1321)




Build Log (for compile errors):
[...truncated 3933 lines...]



---------------------------------------------------------------------
To unsubscribe, e-mail: dev-unsubscribe@lucene.apache.org
For additional commands, e-mail: dev-help@lucene.apache.org


Mime
View raw message