lucene-dev mailing list archives

Site index · List index
Message view « Date » · « Thread »
Top « Date » · « Thread »
From Apache Jenkins Server <jenk...@builds.apache.org>
Subject [JENKINS] Lucene-Solr-tests-only-trunk - Build # 8953 - Failure
Date Mon, 20 Jun 2011 21:01:44 GMT
Build: https://builds.apache.org/job/Lucene-Solr-tests-only-trunk/8953/

8 tests failed.
FAILED:  org.apache.lucene.util.automaton.TestMinimize.testElements

Error Message:
Forked Java VM exited abnormally. Please note the time in the report does not reflect the
time until the VM exit.

Stack Trace:
junit.framework.AssertionFailedError: Forked Java VM exited abnormally. Please note the time
in the report does not reflect the time until the VM exit.
	at java.lang.Thread.run(Thread.java:636)


REGRESSION:  org.apache.lucene.index.TestIndexReaderReopen.testThreadSafety

Error Message:
Error occurred in thread Thread-107: /usr/home/hudson/hudson-slave/workspace/Lucene-Solr-tests-only-trunk/checkout/lucene/build/test/7/test5658056595tmp/_g_5.pyl
(Too many open files in system)

Stack Trace:
junit.framework.AssertionFailedError: Error occurred in thread Thread-107:
/usr/home/hudson/hudson-slave/workspace/Lucene-Solr-tests-only-trunk/checkout/lucene/build/test/7/test5658056595tmp/_g_5.pyl
(Too many open files in system)
	at org.apache.lucene.util.LuceneTestCase$LuceneTestCaseRunner.runChild(LuceneTestCase.java:1415)
	at org.apache.lucene.util.LuceneTestCase$LuceneTestCaseRunner.runChild(LuceneTestCase.java:1333)
/usr/home/hudson/hudson-slave/workspace/Lucene-Solr-tests-only-trunk/checkout/lucene/build/test/7/test5658056595tmp/_g_5.pyl
(Too many open files in system)
	at org.apache.lucene.index.TestIndexReaderReopen.testThreadSafety(TestIndexReaderReopen.java:822)


REGRESSION:  org.apache.lucene.index.TestStressIndexing2.testRandomIWReader

Error Message:
/usr/home/hudson/hudson-slave/workspace/Lucene-Solr-tests-only-trunk/checkout/lucene/build/test/5/test4023440248tmp/_c_1.tib
(Too many open files in system)

Stack Trace:
java.io.FileNotFoundException: /usr/home/hudson/hudson-slave/workspace/Lucene-Solr-tests-only-trunk/checkout/lucene/build/test/5/test4023440248tmp/_c_1.tib
(Too many open files in system)
	at java.io.RandomAccessFile.open(Native Method)
	at java.io.RandomAccessFile.<init>(RandomAccessFile.java:233)
	at org.apache.lucene.store.FSDirectory$FSIndexOutput.<init>(FSDirectory.java:416)
	at org.apache.lucene.store.FSDirectory.createOutput(FSDirectory.java:293)
	at org.apache.lucene.store.MockDirectoryWrapper.createOutput(MockDirectoryWrapper.java:375)
	at org.apache.lucene.index.codecs.BlockTermsWriter.<init>(BlockTermsWriter.java:75)
	at org.apache.lucene.index.codecs.mockrandom.MockRandomCodec.fieldsConsumer(MockRandomCodec.java:226)
	at org.apache.lucene.index.PerFieldCodecWrapper$FieldsWriter.<init>(PerFieldCodecWrapper.java:73)
	at org.apache.lucene.index.PerFieldCodecWrapper.fieldsConsumer(PerFieldCodecWrapper.java:61)
	at org.apache.lucene.index.SegmentMerger.mergeTerms(SegmentMerger.java:565)
	at org.apache.lucene.index.SegmentMerger.merge(SegmentMerger.java:116)
	at org.apache.lucene.index.IndexWriter.mergeMiddle(IndexWriter.java:3466)
	at org.apache.lucene.index.IndexWriter.merge(IndexWriter.java:3110)
	at org.apache.lucene.index.SerialMergeScheduler.merge(SerialMergeScheduler.java:37)
	at org.apache.lucene.index.IndexWriter.maybeMerge(IndexWriter.java:1877)
	at org.apache.lucene.index.IndexWriter.maybeMerge(IndexWriter.java:1872)
	at org.apache.lucene.index.IndexWriter.maybeMerge(IndexWriter.java:1868)
	at org.apache.lucene.index.IndexWriter.getReader(IndexWriter.java:401)
	at org.apache.lucene.index.IndexWriter.getReader(IndexWriter.java:287)
	at org.apache.lucene.index.TestStressIndexing2.testRandomIWReader(TestStressIndexing2.java:67)
	at org.apache.lucene.util.LuceneTestCase$LuceneTestCaseRunner.runChild(LuceneTestCase.java:1415)
	at org.apache.lucene.util.LuceneTestCase$LuceneTestCaseRunner.runChild(LuceneTestCase.java:1333)


REGRESSION:  org.apache.lucene.search.TestBooleanOr.testElements

Error Message:
org/apache/lucene/search/MatchAllDocsQuery$MatchAllScorer

Stack Trace:
java.lang.NoClassDefFoundError: org/apache/lucene/search/MatchAllDocsQuery$MatchAllScorer
	at org.apache.lucene.search.MatchAllDocsQuery.createWeight(MatchAllDocsQuery.java:153)
	at org.apache.lucene.search.IndexSearcher.createNormalizedWeight(IndexSearcher.java:676)
	at org.apache.lucene.search.QueryWrapperFilter.getDocIdSet(QueryWrapperFilter.java:55)
	at org.apache.lucene.index.BufferedDeletesStream.applyQueryDeletes(BufferedDeletesStream.java:441)
	at org.apache.lucene.index.BufferedDeletesStream.applyDeletes(BufferedDeletesStream.java:281)
	at org.apache.lucene.index.IndexWriter.applyAllDeletes(IndexWriter.java:2836)
	at org.apache.lucene.index.IndexWriter.maybeApplyDeletes(IndexWriter.java:2827)
	at org.apache.lucene.index.IndexWriter.doFlush(IndexWriter.java:2803)
	at org.apache.lucene.index.IndexWriter.flush(IndexWriter.java:2772)
	at org.apache.lucene.index.IndexWriter.prepareCommit(IndexWriter.java:2638)
	at org.apache.lucene.index.IndexWriter.commitInternal(IndexWriter.java:2711)
	at org.apache.lucene.index.IndexWriter.commit(IndexWriter.java:2693)
	at org.apache.lucene.index.IndexWriter.commit(IndexWriter.java:2677)
	at org.apache.lucene.search.QueryUtils.makeEmptyIndex(QueryUtils.java:178)
	at org.apache.lucene.search.QueryUtils.wrapUnderlyingReader(QueryUtils.java:150)
	at org.apache.lucene.search.QueryUtils.check(QueryUtils.java:116)
	at org.apache.lucene.search.QueryUtils.check(QueryUtils.java:106)
	at org.apache.lucene.search.TestBooleanOr.search(TestBooleanOr.java:45)
	at org.apache.lucene.search.TestBooleanOr.testElements(TestBooleanOr.java:50)
	at org.apache.lucene.util.LuceneTestCase$LuceneTestCaseRunner.runChild(LuceneTestCase.java:1415)
	at org.apache.lucene.util.LuceneTestCase$LuceneTestCaseRunner.runChild(LuceneTestCase.java:1333)
Caused by: java.lang.ClassNotFoundException: org.apache.lucene.search.MatchAllDocsQuery$MatchAllScorer
	at java.net.URLClassLoader$1.run(URLClassLoader.java:214)
	at java.security.AccessController.doPrivileged(Native Method)
	at java.net.URLClassLoader.findClass(URLClassLoader.java:205)
	at java.lang.ClassLoader.loadClass(ClassLoader.java:321)
	at sun.misc.Launcher$AppClassLoader.loadClass(Launcher.java:294)
	at java.lang.ClassLoader.loadClass(ClassLoader.java:266)
Caused by: java.io.FileNotFoundException: /usr/home/hudson/hudson-slave/workspace/Lucene-Solr-tests-only-trunk/checkout/lucene/build/classes/java/org/apache/lucene/search/MatchAllDocsQuery$MatchAllScorer.class
(Too many open files in system)
	at java.io.FileInputStream.open(Native Method)
	at java.io.FileInputStream.<init>(FileInputStream.java:137)
	at sun.misc.URLClassPath$FileLoader$1.getInputStream(URLClassPath.java:1005)
	at sun.misc.Resource.cachedInputStream(Resource.java:77)
	at sun.misc.Resource.getByteBuffer(Resource.java:160)
	at java.net.URLClassLoader.defineClass(URLClassLoader.java:266)
	at java.net.URLClassLoader.access$000(URLClassLoader.java:73)
	at java.net.URLClassLoader$1.run(URLClassLoader.java:212)


REGRESSION:  org.apache.lucene.search.TestBooleanOr.testFlat

Error Message:
org/apache/lucene/search/DisjunctionSumScorer

Stack Trace:
java.lang.NoClassDefFoundError: org/apache/lucene/search/DisjunctionSumScorer
	at org.apache.lucene.search.BooleanQuery$BooleanWeight.scorer(BooleanQuery.java:332)
	at org.apache.lucene.search.AssertingIndexSearcher$1.scorer(AssertingIndexSearcher.java:76)
	at org.apache.lucene.search.IndexSearcher.search(IndexSearcher.java:546)
	at org.apache.lucene.search.IndexSearcher.search(IndexSearcher.java:331)
	at org.apache.lucene.search.QueryUtils.checkFirstSkipTo(QueryUtils.java:333)
	at org.apache.lucene.search.QueryUtils.check(QueryUtils.java:112)
	at org.apache.lucene.search.QueryUtils.check(QueryUtils.java:106)
	at org.apache.lucene.search.TestBooleanOr.search(TestBooleanOr.java:45)
	at org.apache.lucene.search.TestBooleanOr.testFlat(TestBooleanOr.java:68)
	at org.apache.lucene.util.LuceneTestCase$LuceneTestCaseRunner.runChild(LuceneTestCase.java:1415)
	at org.apache.lucene.util.LuceneTestCase$LuceneTestCaseRunner.runChild(LuceneTestCase.java:1333)
Caused by: java.lang.ClassNotFoundException: org.apache.lucene.search.DisjunctionSumScorer
	at java.net.URLClassLoader$1.run(URLClassLoader.java:214)
	at java.security.AccessController.doPrivileged(Native Method)
	at java.net.URLClassLoader.findClass(URLClassLoader.java:205)
	at java.lang.ClassLoader.loadClass(ClassLoader.java:321)
	at sun.misc.Launcher$AppClassLoader.loadClass(Launcher.java:294)
	at java.lang.ClassLoader.loadClass(ClassLoader.java:266)
Caused by: java.io.FileNotFoundException: /usr/home/hudson/hudson-slave/workspace/Lucene-Solr-tests-only-trunk/checkout/lucene/build/classes/java/org/apache/lucene/search/DisjunctionSumScorer.class
(Too many open files in system)
	at java.io.FileInputStream.open(Native Method)
	at java.io.FileInputStream.<init>(FileInputStream.java:137)
	at sun.misc.URLClassPath$FileLoader$1.getInputStream(URLClassPath.java:1005)
	at sun.misc.Resource.cachedInputStream(Resource.java:77)
	at sun.misc.Resource.getByteBuffer(Resource.java:160)
	at java.net.URLClassLoader.defineClass(URLClassLoader.java:266)
	at java.net.URLClassLoader.access$000(URLClassLoader.java:73)
	at java.net.URLClassLoader$1.run(URLClassLoader.java:212)


REGRESSION:  org.apache.lucene.search.TestBooleanOr.testParenthesisMust

Error Message:
org/apache/lucene/search/DisjunctionSumScorer

Stack Trace:
java.lang.NoClassDefFoundError: org/apache/lucene/search/DisjunctionSumScorer
	at org.apache.lucene.search.BooleanQuery$BooleanWeight.scorer(BooleanQuery.java:332)
	at org.apache.lucene.search.BooleanQuery$BooleanWeight.scorer(BooleanQuery.java:302)
	at org.apache.lucene.search.AssertingIndexSearcher$1.scorer(AssertingIndexSearcher.java:76)
	at org.apache.lucene.search.IndexSearcher.search(IndexSearcher.java:546)
	at org.apache.lucene.search.IndexSearcher.search(IndexSearcher.java:331)
	at org.apache.lucene.search.QueryUtils.checkFirstSkipTo(QueryUtils.java:333)
	at org.apache.lucene.search.QueryUtils.check(QueryUtils.java:112)
	at org.apache.lucene.search.QueryUtils.check(QueryUtils.java:106)
	at org.apache.lucene.search.TestBooleanOr.search(TestBooleanOr.java:45)
	at org.apache.lucene.search.TestBooleanOr.testParenthesisMust(TestBooleanOr.java:87)
	at org.apache.lucene.util.LuceneTestCase$LuceneTestCaseRunner.runChild(LuceneTestCase.java:1415)
	at org.apache.lucene.util.LuceneTestCase$LuceneTestCaseRunner.runChild(LuceneTestCase.java:1333)
Caused by: java.lang.ClassNotFoundException: org.apache.lucene.search.DisjunctionSumScorer
	at java.net.URLClassLoader$1.run(URLClassLoader.java:214)
	at java.security.AccessController.doPrivileged(Native Method)
	at java.net.URLClassLoader.findClass(URLClassLoader.java:205)
	at java.lang.ClassLoader.loadClass(ClassLoader.java:321)
	at sun.misc.Launcher$AppClassLoader.loadClass(Launcher.java:294)
	at java.lang.ClassLoader.loadClass(ClassLoader.java:266)
Caused by: java.io.FileNotFoundException: /usr/home/hudson/hudson-slave/workspace/Lucene-Solr-tests-only-trunk/checkout/lucene/build/classes/java/org/apache/lucene/search/DisjunctionSumScorer.class
(Too many open files in system)
	at java.io.FileInputStream.open(Native Method)
	at java.io.FileInputStream.<init>(FileInputStream.java:137)
	at sun.misc.URLClassPath$FileLoader$1.getInputStream(URLClassPath.java:1005)
	at sun.misc.Resource.cachedInputStream(Resource.java:77)
	at sun.misc.Resource.getByteBuffer(Resource.java:160)
	at java.net.URLClassLoader.defineClass(URLClassLoader.java:266)
	at java.net.URLClassLoader.access$000(URLClassLoader.java:73)
	at java.net.URLClassLoader$1.run(URLClassLoader.java:212)


REGRESSION:  org.apache.lucene.search.TestBooleanOr.testParenthesisMust2

Error Message:
org/apache/lucene/search/DisjunctionSumScorer

Stack Trace:
java.lang.NoClassDefFoundError: org/apache/lucene/search/DisjunctionSumScorer
	at org.apache.lucene.search.BooleanQuery$BooleanWeight.scorer(BooleanQuery.java:332)
	at org.apache.lucene.search.BooleanQuery$BooleanWeight.scorer(BooleanQuery.java:302)
	at org.apache.lucene.search.AssertingIndexSearcher$1.scorer(AssertingIndexSearcher.java:76)
	at org.apache.lucene.search.IndexSearcher.search(IndexSearcher.java:546)
	at org.apache.lucene.search.IndexSearcher.search(IndexSearcher.java:331)
	at org.apache.lucene.search.QueryUtils.checkFirstSkipTo(QueryUtils.java:333)
	at org.apache.lucene.search.QueryUtils.check(QueryUtils.java:112)
	at org.apache.lucene.search.QueryUtils.check(QueryUtils.java:106)
	at org.apache.lucene.search.TestBooleanOr.search(TestBooleanOr.java:45)
	at org.apache.lucene.search.TestBooleanOr.testParenthesisMust2(TestBooleanOr.java:106)
	at org.apache.lucene.util.LuceneTestCase$LuceneTestCaseRunner.runChild(LuceneTestCase.java:1415)
	at org.apache.lucene.util.LuceneTestCase$LuceneTestCaseRunner.runChild(LuceneTestCase.java:1333)
Caused by: java.lang.ClassNotFoundException: org.apache.lucene.search.DisjunctionSumScorer
	at java.net.URLClassLoader$1.run(URLClassLoader.java:214)
	at java.security.AccessController.doPrivileged(Native Method)
	at java.net.URLClassLoader.findClass(URLClassLoader.java:205)
	at java.lang.ClassLoader.loadClass(ClassLoader.java:321)
	at sun.misc.Launcher$AppClassLoader.loadClass(Launcher.java:294)
	at java.lang.ClassLoader.loadClass(ClassLoader.java:266)
Caused by: java.io.FileNotFoundException: /usr/home/hudson/hudson-slave/workspace/Lucene-Solr-tests-only-trunk/checkout/lucene/build/classes/java/org/apache/lucene/search/DisjunctionSumScorer.class
(Too many open files in system)
	at java.io.FileInputStream.open(Native Method)
	at java.io.FileInputStream.<init>(FileInputStream.java:137)
	at sun.misc.URLClassPath$FileLoader$1.getInputStream(URLClassPath.java:1005)
	at sun.misc.Resource.cachedInputStream(Resource.java:77)
	at sun.misc.Resource.getByteBuffer(Resource.java:160)
	at java.net.URLClassLoader.defineClass(URLClassLoader.java:266)
	at java.net.URLClassLoader.access$000(URLClassLoader.java:73)
	at java.net.URLClassLoader$1.run(URLClassLoader.java:212)


REGRESSION:  org.apache.lucene.search.TestBooleanOr.testParenthesisShould

Error Message:
org/apache/lucene/search/DisjunctionSumScorer

Stack Trace:
java.lang.NoClassDefFoundError: org/apache/lucene/search/DisjunctionSumScorer
	at org.apache.lucene.search.BooleanQuery$BooleanWeight.scorer(BooleanQuery.java:332)
	at org.apache.lucene.search.BooleanQuery$BooleanWeight.scorer(BooleanQuery.java:302)
	at org.apache.lucene.search.AssertingIndexSearcher$1.scorer(AssertingIndexSearcher.java:76)
	at org.apache.lucene.search.IndexSearcher.search(IndexSearcher.java:546)
	at org.apache.lucene.search.IndexSearcher.search(IndexSearcher.java:331)
	at org.apache.lucene.search.QueryUtils.checkFirstSkipTo(QueryUtils.java:333)
	at org.apache.lucene.search.QueryUtils.check(QueryUtils.java:112)
	at org.apache.lucene.search.QueryUtils.check(QueryUtils.java:106)
	at org.apache.lucene.search.TestBooleanOr.search(TestBooleanOr.java:45)
	at org.apache.lucene.search.TestBooleanOr.testParenthesisShould(TestBooleanOr.java:125)
	at org.apache.lucene.util.LuceneTestCase$LuceneTestCaseRunner.runChild(LuceneTestCase.java:1415)
	at org.apache.lucene.util.LuceneTestCase$LuceneTestCaseRunner.runChild(LuceneTestCase.java:1333)
Caused by: java.lang.ClassNotFoundException: org.apache.lucene.search.DisjunctionSumScorer
	at java.net.URLClassLoader$1.run(URLClassLoader.java:214)
	at java.security.AccessController.doPrivileged(Native Method)
	at java.net.URLClassLoader.findClass(URLClassLoader.java:205)
	at java.lang.ClassLoader.loadClass(ClassLoader.java:321)
	at sun.misc.Launcher$AppClassLoader.loadClass(Launcher.java:294)
	at java.lang.ClassLoader.loadClass(ClassLoader.java:266)
Caused by: java.io.FileNotFoundException: /usr/home/hudson/hudson-slave/workspace/Lucene-Solr-tests-only-trunk/checkout/lucene/build/classes/java/org/apache/lucene/search/DisjunctionSumScorer.class
(Too many open files in system)
	at java.io.FileInputStream.open(Native Method)
	at java.io.FileInputStream.<init>(FileInputStream.java:137)
	at sun.misc.URLClassPath$FileLoader$1.getInputStream(URLClassPath.java:1005)
	at sun.misc.Resource.cachedInputStream(Resource.java:77)
	at sun.misc.Resource.getByteBuffer(Resource.java:160)
	at java.net.URLClassLoader.defineClass(URLClassLoader.java:266)
	at java.net.URLClassLoader.access$000(URLClassLoader.java:73)
	at java.net.URLClassLoader$1.run(URLClassLoader.java:212)




Build Log (for compile errors):
[...truncated 3986 lines...]



---------------------------------------------------------------------
To unsubscribe, e-mail: dev-unsubscribe@lucene.apache.org
For additional commands, e-mail: dev-help@lucene.apache.org


Mime
View raw message