lucene-dev mailing list archives

Site index · List index
Message view « Date » · « Thread »
Top « Date » · « Thread »
From Apache Jenkins Server <jenk...@builds.apache.org>
Subject [JENKINS] Lucene-Solr-tests-only-trunk - Build # 8775 - Failure
Date Sun, 12 Jun 2011 07:41:46 GMT
Build: https://builds.apache.org/job/Lucene-Solr-tests-only-trunk/8775/

55 tests failed.
REGRESSION:  org.apache.lucene.index.TestAddIndexes.testAddIndexesWithClose

Error Message:
CheckIndex failed

Stack Trace:
java.lang.RuntimeException: CheckIndex failed
	at org.apache.lucene.util._TestUtil.checkIndex(_TestUtil.java:158)
	at org.apache.lucene.util._TestUtil.checkIndex(_TestUtil.java:144)
	at org.apache.lucene.store.MockDirectoryWrapper.close(MockDirectoryWrapper.java:477)
	at org.apache.lucene.index.TestAddIndexes$RunAddIndexesThreads.closeDir(TestAddIndexes.java:702)
	at org.apache.lucene.index.TestAddIndexes.testAddIndexesWithClose(TestAddIndexes.java:818)
	at org.apache.lucene.util.LuceneTestCase$LuceneTestCaseRunner.runChild(LuceneTestCase.java:1403)
	at org.apache.lucene.util.LuceneTestCase$LuceneTestCaseRunner.runChild(LuceneTestCase.java:1321)


REGRESSION:  org.apache.lucene.index.TestAddIndexes.testAddIndexMissingCodec

Error Message:
CheckIndex failed

Stack Trace:
java.lang.RuntimeException: CheckIndex failed
	at org.apache.lucene.util._TestUtil.checkIndex(_TestUtil.java:158)
	at org.apache.lucene.util._TestUtil.checkIndex(_TestUtil.java:144)
	at org.apache.lucene.store.MockDirectoryWrapper.close(MockDirectoryWrapper.java:477)
	at org.apache.lucene.index.TestAddIndexes.testAddIndexMissingCodec(TestAddIndexes.java:1176)
	at org.apache.lucene.util.LuceneTestCase$LuceneTestCaseRunner.runChild(LuceneTestCase.java:1403)
	at org.apache.lucene.util.LuceneTestCase$LuceneTestCaseRunner.runChild(LuceneTestCase.java:1321)


REGRESSION:  org.apache.lucene.index.TestCrash.testCrashWhileIndexing

Error Message:
CheckIndex failed

Stack Trace:
java.lang.RuntimeException: CheckIndex failed
	at org.apache.lucene.util._TestUtil.checkIndex(_TestUtil.java:158)
	at org.apache.lucene.util._TestUtil.checkIndex(_TestUtil.java:144)
	at org.apache.lucene.store.MockDirectoryWrapper.close(MockDirectoryWrapper.java:477)
	at org.apache.lucene.index.TestCrash.testCrashWhileIndexing(TestCrash.java:74)
	at org.apache.lucene.util.LuceneTestCase$LuceneTestCaseRunner.runChild(LuceneTestCase.java:1403)
	at org.apache.lucene.util.LuceneTestCase$LuceneTestCaseRunner.runChild(LuceneTestCase.java:1321)


REGRESSION:  org.apache.lucene.index.TestIndexWriter.testIndexNoDocuments

Error Message:
CheckIndex failed

Stack Trace:
java.lang.RuntimeException: CheckIndex failed
	at org.apache.lucene.util._TestUtil.checkIndex(_TestUtil.java:158)
	at org.apache.lucene.util._TestUtil.checkIndex(_TestUtil.java:144)
	at org.apache.lucene.store.MockDirectoryWrapper.close(MockDirectoryWrapper.java:477)
	at org.apache.lucene.index.TestIndexWriter.testIndexNoDocuments(TestIndexWriter.java:250)
	at org.apache.lucene.util.LuceneTestCase$LuceneTestCaseRunner.runChild(LuceneTestCase.java:1403)
	at org.apache.lucene.util.LuceneTestCase$LuceneTestCaseRunner.runChild(LuceneTestCase.java:1321)


REGRESSION:  org.apache.lucene.index.TestIndexWriter.testOtherFiles

Error Message:
CheckIndex failed

Stack Trace:
java.lang.RuntimeException: CheckIndex failed
	at org.apache.lucene.util._TestUtil.checkIndex(_TestUtil.java:158)
	at org.apache.lucene.util._TestUtil.checkIndex(_TestUtil.java:144)
	at org.apache.lucene.store.MockDirectoryWrapper.close(MockDirectoryWrapper.java:477)
	at org.apache.lucene.index.TestIndexWriter.testOtherFiles(TestIndexWriter.java:1040)
	at org.apache.lucene.util.LuceneTestCase$LuceneTestCaseRunner.runChild(LuceneTestCase.java:1403)
	at org.apache.lucene.util.LuceneTestCase$LuceneTestCaseRunner.runChild(LuceneTestCase.java:1321)


REGRESSION:  org.apache.lucene.index.TestIndexWriter.testEmptyFSDirWithNoLock

Error Message:
CheckIndex failed

Stack Trace:
java.lang.RuntimeException: CheckIndex failed
	at org.apache.lucene.util._TestUtil.checkIndex(_TestUtil.java:158)
	at org.apache.lucene.util._TestUtil.checkIndex(_TestUtil.java:144)
	at org.apache.lucene.store.MockDirectoryWrapper.close(MockDirectoryWrapper.java:477)
	at org.apache.lucene.index.TestIndexWriter.testEmptyFSDirWithNoLock(TestIndexWriter.java:1449)
	at org.apache.lucene.util.LuceneTestCase$LuceneTestCaseRunner.runChild(LuceneTestCase.java:1403)
	at org.apache.lucene.util.LuceneTestCase$LuceneTestCaseRunner.runChild(LuceneTestCase.java:1321)


REGRESSION:  org.apache.lucene.index.TestIndexWriterCommit.testNoCommits

Error Message:
CheckIndex failed

Stack Trace:
java.lang.RuntimeException: CheckIndex failed
	at org.apache.lucene.util._TestUtil.checkIndex(_TestUtil.java:158)
	at org.apache.lucene.util._TestUtil.checkIndex(_TestUtil.java:144)
	at org.apache.lucene.store.MockDirectoryWrapper.close(MockDirectoryWrapper.java:477)
	at org.apache.lucene.index.TestIndexWriterCommit.testNoCommits(TestIndexWriterCommit.java:501)
	at org.apache.lucene.util.LuceneTestCase$LuceneTestCaseRunner.runChild(LuceneTestCase.java:1403)
	at org.apache.lucene.util.LuceneTestCase$LuceneTestCaseRunner.runChild(LuceneTestCase.java:1321)


REGRESSION:  org.apache.lucene.index.TestIndexWriterCommit.testPrepareCommitNoChanges

Error Message:
CheckIndex failed

Stack Trace:
java.lang.RuntimeException: CheckIndex failed
	at org.apache.lucene.util._TestUtil.checkIndex(_TestUtil.java:158)
	at org.apache.lucene.util._TestUtil.checkIndex(_TestUtil.java:144)
	at org.apache.lucene.store.MockDirectoryWrapper.close(MockDirectoryWrapper.java:477)
	at org.apache.lucene.index.TestIndexWriterCommit.testPrepareCommitNoChanges(TestIndexWriterCommit.java:628)
	at org.apache.lucene.util.LuceneTestCase$LuceneTestCaseRunner.runChild(LuceneTestCase.java:1403)
	at org.apache.lucene.util.LuceneTestCase$LuceneTestCaseRunner.runChild(LuceneTestCase.java:1321)


REGRESSION:  org.apache.lucene.index.TestIndexWriterExceptions.testRandomExceptions

Error Message:
CheckIndex failed

Stack Trace:
java.lang.RuntimeException: CheckIndex failed
	at org.apache.lucene.util._TestUtil.checkIndex(_TestUtil.java:158)
	at org.apache.lucene.util._TestUtil.checkIndex(_TestUtil.java:144)
	at org.apache.lucene.index.TestIndexWriterExceptions$IndexerThread.run(TestIndexWriterExceptions.java:138)
	at org.apache.lucene.index.TestIndexWriterExceptions.testRandomExceptions(TestIndexWriterExceptions.java:213)
	at org.apache.lucene.util.LuceneTestCase$LuceneTestCaseRunner.runChild(LuceneTestCase.java:1403)
	at org.apache.lucene.util.LuceneTestCase$LuceneTestCaseRunner.runChild(LuceneTestCase.java:1321)


REGRESSION:  org.apache.lucene.index.TestIndexWriterExceptions.testRandomExceptionsThreads

Error Message:
Some threads threw uncaught exceptions!

Stack Trace:
junit.framework.AssertionFailedError: Some threads threw uncaught exceptions!
	at org.apache.lucene.util.LuceneTestCase$LuceneTestCaseRunner.runChild(LuceneTestCase.java:1403)
	at org.apache.lucene.util.LuceneTestCase$LuceneTestCaseRunner.runChild(LuceneTestCase.java:1321)
	at org.apache.lucene.util.LuceneTestCase.tearDown(LuceneTestCase.java:603)


REGRESSION:  org.apache.lucene.index.TestIndexWriterReader.testAfterCommit

Error Message:
CheckIndex failed

Stack Trace:
java.lang.RuntimeException: CheckIndex failed
	at org.apache.lucene.util._TestUtil.checkIndex(_TestUtil.java:158)
	at org.apache.lucene.util._TestUtil.checkIndex(_TestUtil.java:144)
	at org.apache.lucene.index.TestIndexWriterReader.testAfterCommit(TestIndexWriterReader.java:690)
	at org.apache.lucene.util.LuceneTestCase$LuceneTestCaseRunner.runChild(LuceneTestCase.java:1403)
	at org.apache.lucene.util.LuceneTestCase$LuceneTestCaseRunner.runChild(LuceneTestCase.java:1321)


REGRESSION:  org.apache.lucene.index.TestIndexWriterReader.testEmptyIndex

Error Message:
CheckIndex failed

Stack Trace:
java.lang.RuntimeException: CheckIndex failed
	at org.apache.lucene.util._TestUtil.checkIndex(_TestUtil.java:158)
	at org.apache.lucene.util._TestUtil.checkIndex(_TestUtil.java:144)
	at org.apache.lucene.store.MockDirectoryWrapper.close(MockDirectoryWrapper.java:477)
	at org.apache.lucene.index.TestIndexWriterReader.testEmptyIndex(TestIndexWriterReader.java:975)
	at org.apache.lucene.util.LuceneTestCase$LuceneTestCaseRunner.runChild(LuceneTestCase.java:1403)
	at org.apache.lucene.util.LuceneTestCase$LuceneTestCaseRunner.runChild(LuceneTestCase.java:1321)


REGRESSION:  org.apache.lucene.index.TestNewestSegment.testNewestSegment

Error Message:
CheckIndex failed

Stack Trace:
java.lang.RuntimeException: CheckIndex failed
	at org.apache.lucene.util._TestUtil.checkIndex(_TestUtil.java:158)
	at org.apache.lucene.util._TestUtil.checkIndex(_TestUtil.java:144)
	at org.apache.lucene.store.MockDirectoryWrapper.close(MockDirectoryWrapper.java:477)
	at org.apache.lucene.index.TestNewestSegment.testNewestSegment(TestNewestSegment.java:30)
	at org.apache.lucene.util.LuceneTestCase$LuceneTestCaseRunner.runChild(LuceneTestCase.java:1403)
	at org.apache.lucene.util.LuceneTestCase$LuceneTestCaseRunner.runChild(LuceneTestCase.java:1321)


REGRESSION:  org.apache.lucene.index.TestParallelReaderEmptyIndex.testEmptyIndex

Error Message:
CheckIndex failed

Stack Trace:
java.lang.RuntimeException: CheckIndex failed
	at org.apache.lucene.util._TestUtil.checkIndex(_TestUtil.java:158)
	at org.apache.lucene.util._TestUtil.checkIndex(_TestUtil.java:144)
	at org.apache.lucene.store.MockDirectoryWrapper.close(MockDirectoryWrapper.java:477)
	at org.apache.lucene.index.TestParallelReaderEmptyIndex.testEmptyIndex(TestParallelReaderEmptyIndex.java:66)
	at org.apache.lucene.util.LuceneTestCase$LuceneTestCaseRunner.runChild(LuceneTestCase.java:1403)
	at org.apache.lucene.util.LuceneTestCase$LuceneTestCaseRunner.runChild(LuceneTestCase.java:1321)


REGRESSION:  org.apache.lucene.index.TestPersistentSnapshotDeletionPolicy.testIllegalSnapshotId

Error Message:
CheckIndex failed

Stack Trace:
java.lang.RuntimeException: CheckIndex failed
	at org.apache.lucene.util._TestUtil.checkIndex(_TestUtil.java:158)
	at org.apache.lucene.util._TestUtil.checkIndex(_TestUtil.java:144)
	at org.apache.lucene.store.MockDirectoryWrapper.close(MockDirectoryWrapper.java:477)
	at org.apache.lucene.index.TestPersistentSnapshotDeletionPolicy.tearDown(TestPersistentSnapshotDeletionPolicy.java:51)
	at org.apache.lucene.util.LuceneTestCase$LuceneTestCaseRunner.runChild(LuceneTestCase.java:1403)
	at org.apache.lucene.util.LuceneTestCase$LuceneTestCaseRunner.runChild(LuceneTestCase.java:1321)


REGRESSION:  org.apache.lucene.index.TestPersistentSnapshotDeletionPolicy.testInvalidSnapshotInfos

Error Message:
null

Stack Trace:
java.lang.NullPointerException
	at org.apache.lucene.index.TestPersistentSnapshotDeletionPolicy.tearDown(TestPersistentSnapshotDeletionPolicy.java:51)
	at org.apache.lucene.util.LuceneTestCase$LuceneTestCaseRunner.runChild(LuceneTestCase.java:1403)
	at org.apache.lucene.util.LuceneTestCase$LuceneTestCaseRunner.runChild(LuceneTestCase.java:1321)


REGRESSION:  org.apache.lucene.index.TestPersistentSnapshotDeletionPolicy.testNoSnapshotInfos

Error Message:
null

Stack Trace:
java.lang.NullPointerException
	at org.apache.lucene.index.TestPersistentSnapshotDeletionPolicy.tearDown(TestPersistentSnapshotDeletionPolicy.java:51)
	at org.apache.lucene.util.LuceneTestCase$LuceneTestCaseRunner.runChild(LuceneTestCase.java:1403)
	at org.apache.lucene.util.LuceneTestCase$LuceneTestCaseRunner.runChild(LuceneTestCase.java:1321)


REGRESSION:  org.apache.lucene.index.TestPersistentSnapshotDeletionPolicy.testTooManySnapshotInfos

Error Message:
null

Stack Trace:
java.lang.NullPointerException
	at org.apache.lucene.index.TestPersistentSnapshotDeletionPolicy.tearDown(TestPersistentSnapshotDeletionPolicy.java:51)
	at org.apache.lucene.util.LuceneTestCase$LuceneTestCaseRunner.runChild(LuceneTestCase.java:1403)
	at org.apache.lucene.util.LuceneTestCase$LuceneTestCaseRunner.runChild(LuceneTestCase.java:1321)


REGRESSION:  org.apache.lucene.index.TestPersistentSnapshotDeletionPolicy.testSnapshotRelease

Error Message:
null

Stack Trace:
java.lang.NullPointerException
	at org.apache.lucene.index.TestPersistentSnapshotDeletionPolicy.tearDown(TestPersistentSnapshotDeletionPolicy.java:51)
	at org.apache.lucene.util.LuceneTestCase$LuceneTestCaseRunner.runChild(LuceneTestCase.java:1403)
	at org.apache.lucene.util.LuceneTestCase$LuceneTestCaseRunner.runChild(LuceneTestCase.java:1321)


REGRESSION:  org.apache.lucene.index.TestPersistentSnapshotDeletionPolicy.testStaticRead

Error Message:
null

Stack Trace:
java.lang.NullPointerException
	at org.apache.lucene.index.TestPersistentSnapshotDeletionPolicy.tearDown(TestPersistentSnapshotDeletionPolicy.java:51)
	at org.apache.lucene.util.LuceneTestCase$LuceneTestCaseRunner.runChild(LuceneTestCase.java:1403)
	at org.apache.lucene.util.LuceneTestCase$LuceneTestCaseRunner.runChild(LuceneTestCase.java:1321)


REGRESSION:  org.apache.lucene.index.TestPersistentSnapshotDeletionPolicy.testSnapshotDeletionPolicy

Error Message:
null

Stack Trace:
java.lang.NullPointerException
	at org.apache.lucene.index.TestPersistentSnapshotDeletionPolicy.tearDown(TestPersistentSnapshotDeletionPolicy.java:51)
	at org.apache.lucene.util.LuceneTestCase$LuceneTestCaseRunner.runChild(LuceneTestCase.java:1403)
	at org.apache.lucene.util.LuceneTestCase$LuceneTestCaseRunner.runChild(LuceneTestCase.java:1321)


REGRESSION:  org.apache.lucene.index.TestPersistentSnapshotDeletionPolicy.testBasicSnapshots

Error Message:
null

Stack Trace:
java.lang.NullPointerException
	at org.apache.lucene.index.TestPersistentSnapshotDeletionPolicy.tearDown(TestPersistentSnapshotDeletionPolicy.java:51)
	at org.apache.lucene.util.LuceneTestCase$LuceneTestCaseRunner.runChild(LuceneTestCase.java:1403)
	at org.apache.lucene.util.LuceneTestCase$LuceneTestCaseRunner.runChild(LuceneTestCase.java:1321)


REGRESSION:  org.apache.lucene.index.TestPersistentSnapshotDeletionPolicy.testMultiThreadedSnapshotting

Error Message:
null

Stack Trace:
java.lang.NullPointerException
	at org.apache.lucene.index.TestPersistentSnapshotDeletionPolicy.tearDown(TestPersistentSnapshotDeletionPolicy.java:51)
	at org.apache.lucene.util.LuceneTestCase$LuceneTestCaseRunner.runChild(LuceneTestCase.java:1403)
	at org.apache.lucene.util.LuceneTestCase$LuceneTestCaseRunner.runChild(LuceneTestCase.java:1321)


REGRESSION:  org.apache.lucene.index.TestPersistentSnapshotDeletionPolicy.testRollbackToOldSnapshot

Error Message:
null

Stack Trace:
java.lang.NullPointerException
	at org.apache.lucene.index.TestPersistentSnapshotDeletionPolicy.tearDown(TestPersistentSnapshotDeletionPolicy.java:51)
	at org.apache.lucene.util.LuceneTestCase$LuceneTestCaseRunner.runChild(LuceneTestCase.java:1403)
	at org.apache.lucene.util.LuceneTestCase$LuceneTestCaseRunner.runChild(LuceneTestCase.java:1321)


REGRESSION:  org.apache.lucene.index.TestPersistentSnapshotDeletionPolicy.testReleaseSnapshot

Error Message:
null

Stack Trace:
java.lang.NullPointerException
	at org.apache.lucene.index.TestPersistentSnapshotDeletionPolicy.tearDown(TestPersistentSnapshotDeletionPolicy.java:51)
	at org.apache.lucene.util.LuceneTestCase$LuceneTestCaseRunner.runChild(LuceneTestCase.java:1403)
	at org.apache.lucene.util.LuceneTestCase$LuceneTestCaseRunner.runChild(LuceneTestCase.java:1321)


REGRESSION:  org.apache.lucene.index.TestPersistentSnapshotDeletionPolicy.testSnapshotLastCommitTwice

Error Message:
null

Stack Trace:
java.lang.NullPointerException
	at org.apache.lucene.index.TestPersistentSnapshotDeletionPolicy.tearDown(TestPersistentSnapshotDeletionPolicy.java:51)
	at org.apache.lucene.util.LuceneTestCase$LuceneTestCaseRunner.runChild(LuceneTestCase.java:1403)
	at org.apache.lucene.util.LuceneTestCase$LuceneTestCaseRunner.runChild(LuceneTestCase.java:1321)


REGRESSION:  org.apache.lucene.index.TestPersistentSnapshotDeletionPolicy.testMissingCommits

Error Message:
null

Stack Trace:
java.lang.NullPointerException
	at org.apache.lucene.index.TestPersistentSnapshotDeletionPolicy.tearDown(TestPersistentSnapshotDeletionPolicy.java:51)
	at org.apache.lucene.util.LuceneTestCase$LuceneTestCaseRunner.runChild(LuceneTestCase.java:1403)
	at org.apache.lucene.util.LuceneTestCase$LuceneTestCaseRunner.runChild(LuceneTestCase.java:1321)


FAILED:  junit.framework.TestSuite.org.apache.lucene.index.TestPersistentSnapshotDeletionPolicy

Error Message:
ensure your setUp() calls super.setUp() and your tearDown() calls super.tearDown()!!!

Stack Trace:
junit.framework.AssertionFailedError: ensure your setUp() calls super.setUp() and your tearDown()
calls super.tearDown()!!!
	at org.apache.lucene.util.LuceneTestCase.afterClassLuceneTestCaseJ4(LuceneTestCase.java:401)


REGRESSION:  org.apache.lucene.index.TestStressIndexing2.testRandomIWReader

Error Message:
CheckIndex failed

Stack Trace:
java.lang.RuntimeException: CheckIndex failed
	at org.apache.lucene.util._TestUtil.checkIndex(_TestUtil.java:158)
	at org.apache.lucene.util._TestUtil.checkIndex(_TestUtil.java:144)
	at org.apache.lucene.index.TestStressIndexing2.indexRandomIWReader(TestStressIndexing2.java:192)
	at org.apache.lucene.index.TestStressIndexing2.testRandomIWReader(TestStressIndexing2.java:66)
	at org.apache.lucene.util.LuceneTestCase$LuceneTestCaseRunner.runChild(LuceneTestCase.java:1403)
	at org.apache.lucene.util.LuceneTestCase$LuceneTestCaseRunner.runChild(LuceneTestCase.java:1321)


REGRESSION:  org.apache.lucene.search.TestBooleanScorer.testEmptyBucketWithMoreDocs

Error Message:
CheckIndex failed

Stack Trace:
java.lang.RuntimeException: CheckIndex failed
	at org.apache.lucene.util._TestUtil.checkIndex(_TestUtil.java:158)
	at org.apache.lucene.util._TestUtil.checkIndex(_TestUtil.java:144)
	at org.apache.lucene.store.MockDirectoryWrapper.close(MockDirectoryWrapper.java:477)
	at org.apache.lucene.search.TestBooleanScorer.testEmptyBucketWithMoreDocs(TestBooleanScorer.java:101)
	at org.apache.lucene.util.LuceneTestCase$LuceneTestCaseRunner.runChild(LuceneTestCase.java:1403)
	at org.apache.lucene.util.LuceneTestCase$LuceneTestCaseRunner.runChild(LuceneTestCase.java:1321)


REGRESSION:  org.apache.lucene.search.TestCachingWrapperFilter.testCachingWorks

Error Message:
CheckIndex failed

Stack Trace:
java.lang.RuntimeException: CheckIndex failed
	at org.apache.lucene.util._TestUtil.checkIndex(_TestUtil.java:158)
	at org.apache.lucene.util._TestUtil.checkIndex(_TestUtil.java:144)
	at org.apache.lucene.store.MockDirectoryWrapper.close(MockDirectoryWrapper.java:477)
	at org.apache.lucene.search.TestCachingWrapperFilter.testCachingWorks(TestCachingWrapperFilter.java:62)
	at org.apache.lucene.util.LuceneTestCase$LuceneTestCaseRunner.runChild(LuceneTestCase.java:1403)
	at org.apache.lucene.util.LuceneTestCase$LuceneTestCaseRunner.runChild(LuceneTestCase.java:1321)


REGRESSION:  org.apache.lucene.search.TestCachingWrapperFilter.testNullDocIdSet

Error Message:
CheckIndex failed

Stack Trace:
java.lang.RuntimeException: CheckIndex failed
	at org.apache.lucene.util._TestUtil.checkIndex(_TestUtil.java:158)
	at org.apache.lucene.util._TestUtil.checkIndex(_TestUtil.java:144)
	at org.apache.lucene.store.MockDirectoryWrapper.close(MockDirectoryWrapper.java:477)
	at org.apache.lucene.search.TestCachingWrapperFilter.testNullDocIdSet(TestCachingWrapperFilter.java:85)
	at org.apache.lucene.util.LuceneTestCase$LuceneTestCaseRunner.runChild(LuceneTestCase.java:1403)
	at org.apache.lucene.util.LuceneTestCase$LuceneTestCaseRunner.runChild(LuceneTestCase.java:1321)


REGRESSION:  org.apache.lucene.search.TestCachingWrapperFilter.testNullDocIdSetIterator

Error Message:
CheckIndex failed

Stack Trace:
java.lang.RuntimeException: CheckIndex failed
	at org.apache.lucene.util._TestUtil.checkIndex(_TestUtil.java:158)
	at org.apache.lucene.util._TestUtil.checkIndex(_TestUtil.java:144)
	at org.apache.lucene.store.MockDirectoryWrapper.close(MockDirectoryWrapper.java:477)
	at org.apache.lucene.search.TestCachingWrapperFilter.testNullDocIdSetIterator(TestCachingWrapperFilter.java:113)
	at org.apache.lucene.util.LuceneTestCase$LuceneTestCaseRunner.runChild(LuceneTestCase.java:1403)
	at org.apache.lucene.util.LuceneTestCase$LuceneTestCaseRunner.runChild(LuceneTestCase.java:1321)


REGRESSION:  org.apache.lucene.search.TestFieldCache.testEmptyIndex

Error Message:
CheckIndex failed

Stack Trace:
java.lang.RuntimeException: CheckIndex failed
	at org.apache.lucene.util._TestUtil.checkIndex(_TestUtil.java:158)
	at org.apache.lucene.util._TestUtil.checkIndex(_TestUtil.java:144)
	at org.apache.lucene.store.MockDirectoryWrapper.close(MockDirectoryWrapper.java:477)
	at org.apache.lucene.search.TestFieldCache.testEmptyIndex(TestFieldCache.java:223)
	at org.apache.lucene.util.LuceneTestCase$LuceneTestCaseRunner.runChild(LuceneTestCase.java:1403)
	at org.apache.lucene.util.LuceneTestCase$LuceneTestCaseRunner.runChild(LuceneTestCase.java:1321)


REGRESSION:  org.apache.lucene.search.TestPositiveScoresOnlyCollector.testNegativeScores

Error Message:
CheckIndex failed

Stack Trace:
java.lang.RuntimeException: CheckIndex failed
	at org.apache.lucene.util._TestUtil.checkIndex(_TestUtil.java:158)
	at org.apache.lucene.util._TestUtil.checkIndex(_TestUtil.java:144)
	at org.apache.lucene.store.MockDirectoryWrapper.close(MockDirectoryWrapper.java:477)
	at org.apache.lucene.search.TestPositiveScoresOnlyCollector.testNegativeScores(TestPositiveScoresOnlyCollector.java:94)
	at org.apache.lucene.util.LuceneTestCase$LuceneTestCaseRunner.runChild(LuceneTestCase.java:1403)
	at org.apache.lucene.util.LuceneTestCase$LuceneTestCaseRunner.runChild(LuceneTestCase.java:1321)


REGRESSION:  org.apache.lucene.search.TestScoreCachingWrappingScorer.testGetScores

Error Message:
CheckIndex failed

Stack Trace:
java.lang.RuntimeException: CheckIndex failed
	at org.apache.lucene.util._TestUtil.checkIndex(_TestUtil.java:158)
	at org.apache.lucene.util._TestUtil.checkIndex(_TestUtil.java:144)
	at org.apache.lucene.store.MockDirectoryWrapper.close(MockDirectoryWrapper.java:477)
	at org.apache.lucene.search.TestScoreCachingWrappingScorer.testGetScores(TestScoreCachingWrappingScorer.java:124)
	at org.apache.lucene.util.LuceneTestCase$LuceneTestCaseRunner.runChild(LuceneTestCase.java:1403)
	at org.apache.lucene.util.LuceneTestCase$LuceneTestCaseRunner.runChild(LuceneTestCase.java:1321)


REGRESSION:  org.apache.lucene.search.TestSort.testEmptyIndex

Error Message:
CheckIndex failed

Stack Trace:
java.lang.RuntimeException: CheckIndex failed
	at org.apache.lucene.util._TestUtil.checkIndex(_TestUtil.java:158)
	at org.apache.lucene.util._TestUtil.checkIndex(_TestUtil.java:144)
	at org.apache.lucene.store.MockDirectoryWrapper.close(MockDirectoryWrapper.java:477)
	at org.apache.lucene.search.TestSort.tearDown(TestSort.java:265)
	at org.apache.lucene.util.LuceneTestCase$LuceneTestCaseRunner.runChild(LuceneTestCase.java:1403)
	at org.apache.lucene.util.LuceneTestCase$LuceneTestCaseRunner.runChild(LuceneTestCase.java:1321)


REGRESSION:  org.apache.lucene.search.TestSort.testNewCustomFieldParserSort

Error Message:
null

Stack Trace:
java.lang.NullPointerException
	at org.apache.lucene.search.TestSort.tearDown(TestSort.java:258)
	at org.apache.lucene.util.LuceneTestCase$LuceneTestCaseRunner.runChild(LuceneTestCase.java:1403)
	at org.apache.lucene.util.LuceneTestCase$LuceneTestCaseRunner.runChild(LuceneTestCase.java:1321)


REGRESSION:  org.apache.lucene.search.TestSort.testReverseSort

Error Message:
null

Stack Trace:
java.lang.NullPointerException
	at org.apache.lucene.search.TestSort.tearDown(TestSort.java:258)
	at org.apache.lucene.util.LuceneTestCase$LuceneTestCaseRunner.runChild(LuceneTestCase.java:1403)
	at org.apache.lucene.util.LuceneTestCase$LuceneTestCaseRunner.runChild(LuceneTestCase.java:1321)


REGRESSION:  org.apache.lucene.search.TestSort.testEmptyFieldSort

Error Message:
null

Stack Trace:
java.lang.NullPointerException
	at org.apache.lucene.search.TestSort.tearDown(TestSort.java:258)
	at org.apache.lucene.util.LuceneTestCase$LuceneTestCaseRunner.runChild(LuceneTestCase.java:1403)
	at org.apache.lucene.util.LuceneTestCase$LuceneTestCaseRunner.runChild(LuceneTestCase.java:1321)


REGRESSION:  org.apache.lucene.search.TestSort.testSortCombos

Error Message:
null

Stack Trace:
java.lang.NullPointerException
	at org.apache.lucene.search.TestSort.tearDown(TestSort.java:258)
	at org.apache.lucene.util.LuceneTestCase$LuceneTestCaseRunner.runChild(LuceneTestCase.java:1403)
	at org.apache.lucene.util.LuceneTestCase$LuceneTestCaseRunner.runChild(LuceneTestCase.java:1321)


REGRESSION:  org.apache.lucene.search.TestSort.testParallelMultiSort

Error Message:
null

Stack Trace:
java.lang.NullPointerException
	at org.apache.lucene.search.TestSort.tearDown(TestSort.java:258)
	at org.apache.lucene.util.LuceneTestCase$LuceneTestCaseRunner.runChild(LuceneTestCase.java:1403)
	at org.apache.lucene.util.LuceneTestCase$LuceneTestCaseRunner.runChild(LuceneTestCase.java:1321)


REGRESSION:  org.apache.lucene.search.TestSort.testTopDocsScores

Error Message:
null

Stack Trace:
java.lang.NullPointerException
	at org.apache.lucene.search.TestSort.tearDown(TestSort.java:258)
	at org.apache.lucene.util.LuceneTestCase$LuceneTestCaseRunner.runChild(LuceneTestCase.java:1403)
	at org.apache.lucene.util.LuceneTestCase$LuceneTestCaseRunner.runChild(LuceneTestCase.java:1321)


REGRESSION:  org.apache.lucene.search.TestSort.testSortWithoutFillFields

Error Message:
null

Stack Trace:
java.lang.NullPointerException
	at org.apache.lucene.search.TestSort.tearDown(TestSort.java:258)
	at org.apache.lucene.util.LuceneTestCase$LuceneTestCaseRunner.runChild(LuceneTestCase.java:1403)
	at org.apache.lucene.util.LuceneTestCase$LuceneTestCaseRunner.runChild(LuceneTestCase.java:1321)


REGRESSION:  org.apache.lucene.search.TestSort.testSortWithoutScoreTracking

Error Message:
null

Stack Trace:
java.lang.NullPointerException
	at org.apache.lucene.search.TestSort.tearDown(TestSort.java:258)
	at org.apache.lucene.util.LuceneTestCase$LuceneTestCaseRunner.runChild(LuceneTestCase.java:1403)
	at org.apache.lucene.util.LuceneTestCase$LuceneTestCaseRunner.runChild(LuceneTestCase.java:1321)


REGRESSION:  org.apache.lucene.search.TestSort.testSortWithScoreNoMaxScoreTracking

Error Message:
null

Stack Trace:
java.lang.NullPointerException
	at org.apache.lucene.search.TestSort.tearDown(TestSort.java:258)
	at org.apache.lucene.util.LuceneTestCase$LuceneTestCaseRunner.runChild(LuceneTestCase.java:1403)
	at org.apache.lucene.util.LuceneTestCase$LuceneTestCaseRunner.runChild(LuceneTestCase.java:1321)


REGRESSION:  org.apache.lucene.search.TestSort.testSortWithScoreNoMaxScoreTrackingMulti

Error Message:
null

Stack Trace:
java.lang.NullPointerException
	at org.apache.lucene.search.TestSort.tearDown(TestSort.java:258)
	at org.apache.lucene.util.LuceneTestCase$LuceneTestCaseRunner.runChild(LuceneTestCase.java:1403)
	at org.apache.lucene.util.LuceneTestCase$LuceneTestCaseRunner.runChild(LuceneTestCase.java:1321)


REGRESSION:  org.apache.lucene.search.TestSort.testSortWithScoreAndMaxScoreTracking

Error Message:
null

Stack Trace:
java.lang.NullPointerException
	at org.apache.lucene.search.TestSort.tearDown(TestSort.java:258)
	at org.apache.lucene.util.LuceneTestCase$LuceneTestCaseRunner.runChild(LuceneTestCase.java:1403)
	at org.apache.lucene.util.LuceneTestCase$LuceneTestCaseRunner.runChild(LuceneTestCase.java:1321)


REGRESSION:  org.apache.lucene.search.TestSort.testOutOfOrderDocsScoringSort

Error Message:
null

Stack Trace:
java.lang.NullPointerException
	at org.apache.lucene.search.TestSort.tearDown(TestSort.java:258)
	at org.apache.lucene.util.LuceneTestCase$LuceneTestCaseRunner.runChild(LuceneTestCase.java:1403)
	at org.apache.lucene.util.LuceneTestCase$LuceneTestCaseRunner.runChild(LuceneTestCase.java:1321)


REGRESSION:  org.apache.lucene.search.TestSort.testOutOfOrderDocsScoringSortMulti

Error Message:
null

Stack Trace:
java.lang.NullPointerException
	at org.apache.lucene.search.TestSort.tearDown(TestSort.java:258)
	at org.apache.lucene.util.LuceneTestCase$LuceneTestCaseRunner.runChild(LuceneTestCase.java:1403)
	at org.apache.lucene.util.LuceneTestCase$LuceneTestCaseRunner.runChild(LuceneTestCase.java:1321)


REGRESSION:  org.apache.lucene.search.TestSort.testSortWithScoreAndMaxScoreTrackingNoResults

Error Message:
null

Stack Trace:
java.lang.NullPointerException
	at org.apache.lucene.search.TestSort.tearDown(TestSort.java:258)
	at org.apache.lucene.util.LuceneTestCase$LuceneTestCaseRunner.runChild(LuceneTestCase.java:1403)
	at org.apache.lucene.util.LuceneTestCase$LuceneTestCaseRunner.runChild(LuceneTestCase.java:1321)


REGRESSION:  org.apache.lucene.search.TestSort.testEmptyStringVsNullStringSort

Error Message:
null

Stack Trace:
java.lang.NullPointerException
	at org.apache.lucene.search.TestSort.tearDown(TestSort.java:258)
	at org.apache.lucene.util.LuceneTestCase$LuceneTestCaseRunner.runChild(LuceneTestCase.java:1403)
	at org.apache.lucene.util.LuceneTestCase$LuceneTestCaseRunner.runChild(LuceneTestCase.java:1321)


REGRESSION:  org.apache.lucene.search.TestSort.testLUCENE2142

Error Message:
null

Stack Trace:
java.lang.NullPointerException
	at org.apache.lucene.search.TestSort.tearDown(TestSort.java:258)
	at org.apache.lucene.util.LuceneTestCase$LuceneTestCaseRunner.runChild(LuceneTestCase.java:1403)
	at org.apache.lucene.util.LuceneTestCase$LuceneTestCaseRunner.runChild(LuceneTestCase.java:1321)


REGRESSION:  org.apache.lucene.search.TestSort.testCountingCollector

Error Message:
null

Stack Trace:
java.lang.NullPointerException
	at org.apache.lucene.search.TestSort.tearDown(TestSort.java:258)
	at org.apache.lucene.util.LuceneTestCase$LuceneTestCaseRunner.runChild(LuceneTestCase.java:1403)
	at org.apache.lucene.util.LuceneTestCase$LuceneTestCaseRunner.runChild(LuceneTestCase.java:1321)


FAILED:  junit.framework.TestSuite.org.apache.lucene.search.TestSort

Error Message:
ensure your setUp() calls super.setUp() and your tearDown() calls super.tearDown()!!!

Stack Trace:
junit.framework.AssertionFailedError: ensure your setUp() calls super.setUp() and your tearDown()
calls super.tearDown()!!!
	at org.apache.lucene.util.LuceneTestCase.afterClassLuceneTestCaseJ4(LuceneTestCase.java:401)




Build Log (for compile errors):
[...truncated 4438 lines...]



---------------------------------------------------------------------
To unsubscribe, e-mail: dev-unsubscribe@lucene.apache.org
For additional commands, e-mail: dev-help@lucene.apache.org


Mime
View raw message