lucene-dev mailing list archives

Site index · List index
Message view « Date » · « Thread »
Top « Date » · « Thread »
From "Uwe Schindler" <...@thetaphi.de>
Subject RE: [JENKINS] Lucene-Solr-tests-only-3.x - Build # 8781 - Still Failing
Date Sun, 12 Jun 2011 09:45:44 GMT
Fix is easy, just initialize:

result.maxSegmentName = -1;

(previously it was 0, which is the default for integer that are uninitialized) before the loop over the segments. Will commit this soon.

-----
Uwe Schindler
H.-H.-Meier-Allee 63, D-28213 Bremen
http://www.thetaphi.de
eMail: uwe@thetaphi.de


> -----Original Message-----
> From: Uwe Schindler [mailto:uwe@thetaphi.de]
> Sent: Sunday, June 12, 2011 11:40 AM
> To: dev@lucene.apache.org; simon.willnauer@gmail.com
> Subject: RE: [JENKINS] Lucene-Solr-tests-only-3.x - Build # 8781 - Still Failing
> 
> Will do!
> 
> -----
> Uwe Schindler
> H.-H.-Meier-Allee 63, D-28213 Bremen
> http://www.thetaphi.de
> eMail: uwe@thetaphi.de
> 
> 
> > -----Original Message-----
> > From: Simon Willnauer [mailto:simon.willnauer@googlemail.com]
> > Sent: Sunday, June 12, 2011 11:09 AM
> > To: dev@lucene.apache.org
> > Subject: Re: [JENKINS] Lucene-Solr-tests-only-3.x - Build # 8781 -
> > Still Failing
> >
> > seems there is a problem with this check here... if no segs are present...
> >
> > I don't have time to port etc. can somebody else go and do it?
> > something like that:
> >
> > Index: lucene/src/java/org/apache/lucene/index/CheckIndex.java
> >
> ==========================================================
> > =========
> > --- lucene/src/java/org/apache/lucene/index/CheckIndex.java
> > 	(revision 1134890)
> > +++ lucene/src/java/org/apache/lucene/index/CheckIndex.java
> > 	(working copy)
> > @@ -568,7 +568,7 @@
> >      } else
> >        msg("WARNING: " + result.numBadSegments + " broken segments
> > (containing " + result.totLoseDocCount + " documents) detected");
> >
> > -    if ( ! (result.validCounter = (result.maxSegmentName < sis.counter))) {
> > +    if ( result.maxSegmentName != 0 && ! (result.validCounter =
> > (result.maxSegmentName < sis.counter))) {
> >        result.clean = false;
> >        result.newSegments.counter = result.maxSegmentName + 1;
> >        msg("ERROR: Next segment name counter " + sis.counter + " is
> > not greater than max segment name " + result.maxSegmentName);
> >
> >
> > On Sun, Jun 12, 2011 at 11:00 AM, Uwe Schindler <uwe@thetaphi.de>
> wrote:
> > > We have some serious problem with CheckIndex on 3.x and trunk, seems
> > to be related to Steven's changes?
> > >
> > > -----
> > > Uwe Schindler
> > > H.-H.-Meier-Allee 63, D-28213 Bremen http://www.thetaphi.de
> > > eMail: uwe@thetaphi.de
> > >
> > >> -----Original Message-----
> > >> From: Apache Jenkins Server [mailto:jenkins@builds.apache.org]
> > >> Sent: Sunday, June 12, 2011 10:53 AM
> > >> To: dev@lucene.apache.org
> > >> Subject: [JENKINS] Lucene-Solr-tests-only-3.x - Build # 8781 -
> > >> Still Failing
> > >>
> > >> Build:
> > >> https://builds.apache.org/job/Lucene-Solr-tests-only-3.x/8781/
> > >>
> > >> 62 tests failed.
> > >> REGRESSION:
> > >>
> >
> org.apache.lucene.index.TestAddIndexes.testAddIndexesWithCloseNoWait
> > >>
> > >> Error Message:
> > >> CheckIndex failed
> > >>
> > >> Stack Trace:
> > >> java.lang.RuntimeException: CheckIndex failed
> > >>       at
> > >> org.apache.lucene.util._TestUtil.checkIndex(_TestUtil.java:147)
> > >>       at
> > >>
> >
> org.apache.lucene.store.MockDirectoryWrapper.close(MockDirectoryWrapp
> > >> er.java:481)
> > >>       at
> > >>
> >
> org.apache.lucene.index.TestAddIndexes$RunAddIndexesThreads.closeDir(
> > >> TestAddIndexes.java:693)
> > >>       at
> > >>
> >
> org.apache.lucene.index.TestAddIndexes.testAddIndexesWithCloseNoWait(
> > >> TestAddIndexes.java:901)
> > >>       at
> > >>
> > org.apache.lucene.util.LuceneTestCase$LuceneTestCaseRunner.runChild(L
> > >> uc
> > >> eneTestCase.java:1268)
> > >>       at
> > >>
> > org.apache.lucene.util.LuceneTestCase$LuceneTestCaseRunner.runChild(L
> > >> uc
> > >> eneTestCase.java:1186)
> > >>
> > >>
> > >> REGRESSION:
> > >> org.apache.lucene.index.TestAddIndexes.testAddIndexesWithRollback
> > >>
> > >> Error Message:
> > >> CheckIndex failed
> > >>
> > >> Stack Trace:
> > >> java.lang.RuntimeException: CheckIndex failed
> > >>       at
> > >> org.apache.lucene.util._TestUtil.checkIndex(_TestUtil.java:147)
> > >>       at
> > >>
> >
> org.apache.lucene.store.MockDirectoryWrapper.close(MockDirectoryWrapp
> > >> er.java:481)
> > >>       at
> > >>
> >
> org.apache.lucene.index.TestAddIndexes$RunAddIndexesThreads.closeDir(
> > >> TestAddIndexes.java:693)
> > >>       at
> > >>
> >
> org.apache.lucene.index.TestAddIndexes.testAddIndexesWithRollback(Tes
> > >> t
> > >> AddIndexes.java:924)
> > >>       at
> > >>
> > org.apache.lucene.util.LuceneTestCase$LuceneTestCaseRunner.runChild(L
> > >> uc
> > >> eneTestCase.java:1268)
> > >>       at
> > >>
> > org.apache.lucene.util.LuceneTestCase$LuceneTestCaseRunner.runChild(L
> > >> uc
> > >> eneTestCase.java:1186)
> > >>
> > >>
> > >> FAILED:  org.apache.lucene.index.TestCrash.testCrashWhileIndexing
> > >>
> > >> Error Message:
> > >> CheckIndex failed
> > >>
> > >> Stack Trace:
> > >> java.lang.RuntimeException: CheckIndex failed
> > >>       at
> > >> org.apache.lucene.util._TestUtil.checkIndex(_TestUtil.java:147)
> > >>       at
> > >>
> >
> org.apache.lucene.store.MockDirectoryWrapper.close(MockDirectoryWrapp
> > >> er.java:481)
> > >>       at
> > >> org.apache.lucene.index.TestCrash.testCrashWhileIndexing(TestCrash.
> > >> ja
> > >> va:7
> > >> 7)
> > >>       at
> > >>
> > org.apache.lucene.util.LuceneTestCase$LuceneTestCaseRunner.runChild(L
> > >> uc
> > >> eneTestCase.java:1268)
> > >>       at
> > >>
> > org.apache.lucene.util.LuceneTestCase$LuceneTestCaseRunner.runChild(L
> > >> uc
> > >> eneTestCase.java:1186)
> > >>
> > >>
> > >>
> > FAILED:  org.apache.lucene.index.TestIndexWriter.testIndexNoDocuments
> > >>
> > >> Error Message:
> > >> CheckIndex failed
> > >>
> > >> Stack Trace:
> > >> java.lang.RuntimeException: CheckIndex failed
> > >>       at
> > >> org.apache.lucene.util._TestUtil.checkIndex(_TestUtil.java:147)
> > >>       at
> > >>
> >
> org.apache.lucene.store.MockDirectoryWrapper.close(MockDirectoryWrapp
> > >> er.java:481)
> > >>       at
> > >>
> >
> org.apache.lucene.index.TestIndexWriter.testIndexNoDocuments(TestInde
> > >> xWriter.java:343)
> > >>       at
> > >>
> > org.apache.lucene.util.LuceneTestCase$LuceneTestCaseRunner.runChild(L
> > >> uc
> > >> eneTestCase.java:1268)
> > >>       at
> > >>
> > org.apache.lucene.util.LuceneTestCase$LuceneTestCaseRunner.runChild(L
> > >> uc
> > >> eneTestCase.java:1186)
> > >>
> > >>
> > >> FAILED:  org.apache.lucene.index.TestIndexWriter.testOtherFiles
> > >>
> > >> Error Message:
> > >> CheckIndex failed
> > >>
> > >> Stack Trace:
> > >> java.lang.RuntimeException: CheckIndex failed
> > >>       at
> > >> org.apache.lucene.util._TestUtil.checkIndex(_TestUtil.java:147)
> > >>       at
> > >>
> >
> org.apache.lucene.store.MockDirectoryWrapper.close(MockDirectoryWrapp
> > >> er.java:481)
> > >>       at
> > >> org.apache.lucene.index.TestIndexWriter.testOtherFiles(TestIndexWri
> > >> te
> > >> r.ja
> > >> va:1307)
> > >>       at
> > >>
> > org.apache.lucene.util.LuceneTestCase$LuceneTestCaseRunner.runChild(L
> > >> uc
> > >> eneTestCase.java:1268)
> > >>       at
> > >>
> > org.apache.lucene.util.LuceneTestCase$LuceneTestCaseRunner.runChild(L
> > >> uc
> > >> eneTestCase.java:1186)
> > >>
> > >>
> > >> FAILED:
> > >> org.apache.lucene.index.TestIndexWriter.testEmptyFSDirWithNoLock
> > >>
> > >> Error Message:
> > >> CheckIndex failed
> > >>
> > >> Stack Trace:
> > >> java.lang.RuntimeException: CheckIndex failed
> > >>       at
> > >> org.apache.lucene.util._TestUtil.checkIndex(_TestUtil.java:147)
> > >>       at
> > >>
> >
> org.apache.lucene.store.MockDirectoryWrapper.close(MockDirectoryWrapp
> > >> er.java:481)
> > >>       at
> > >>
> > org.apache.lucene.index.TestIndexWriter.testEmptyFSDirWithNoLock(Test
> > >> In
> > >> dexWriter.java:1698)
> > >>       at
> > >>
> > org.apache.lucene.util.LuceneTestCase$LuceneTestCaseRunner.runChild(L
> > >> uc
> > >> eneTestCase.java:1268)
> > >>       at
> > >>
> > org.apache.lucene.util.LuceneTestCase$LuceneTestCaseRunner.runChild(L
> > >> uc
> > >> eneTestCase.java:1186)
> > >>
> > >>
> > >>
> > FAILED:  org.apache.lucene.index.TestIndexWriterCommit.testNoCommits
> > >>
> > >> Error Message:
> > >> CheckIndex failed
> > >>
> > >> Stack Trace:
> > >> java.lang.RuntimeException: CheckIndex failed
> > >>       at
> > >> org.apache.lucene.util._TestUtil.checkIndex(_TestUtil.java:147)
> > >>       at
> > >>
> >
> org.apache.lucene.store.MockDirectoryWrapper.close(MockDirectoryWrapp
> > >> er.java:481)
> > >>       at
> > >>
> >
> org.apache.lucene.index.TestIndexWriterCommit.testNoCommits(TestIndex
> > >> WriterCommit.java:501)
> > >>       at
> > >>
> > org.apache.lucene.util.LuceneTestCase$LuceneTestCaseRunner.runChild(L
> > >> uc
> > >> eneTestCase.java:1268)
> > >>       at
> > >>
> > org.apache.lucene.util.LuceneTestCase$LuceneTestCaseRunner.runChild(L
> > >> uc
> > >> eneTestCase.java:1186)
> > >>
> > >>
> > >> FAILED:
> > >>
> >
> org.apache.lucene.index.TestIndexWriterCommit.testPrepareCommitNoCha
> > >> nges
> > >>
> > >> Error Message:
> > >> CheckIndex failed
> > >>
> > >> Stack Trace:
> > >> java.lang.RuntimeException: CheckIndex failed
> > >>       at
> > >> org.apache.lucene.util._TestUtil.checkIndex(_TestUtil.java:147)
> > >>       at
> > >>
> >
> org.apache.lucene.store.MockDirectoryWrapper.close(MockDirectoryWrapp
> > >> er.java:481)
> > >>       at
> > >>
> >
> org.apache.lucene.index.TestIndexWriterCommit.testPrepareCommitNoCha
> > >> nges(TestIndexWriterCommit.java:628)
> > >>       at
> > >>
> > org.apache.lucene.util.LuceneTestCase$LuceneTestCaseRunner.runChild(L
> > >> uc
> > >> eneTestCase.java:1268)
> > >>       at
> > >>
> > org.apache.lucene.util.LuceneTestCase$LuceneTestCaseRunner.runChild(L
> > >> uc
> > >> eneTestCase.java:1186)
> > >>
> > >>
> > >> FAILED:
> > >> org.apache.lucene.index.TestIndexWriterConfig.testIndexWriterSetter
> > >> s
> > >>
> > >> Error Message:
> > >> CheckIndex failed
> > >>
> > >> Stack Trace:
> > >> java.lang.RuntimeException: CheckIndex failed
> > >>       at
> > >> org.apache.lucene.util._TestUtil.checkIndex(_TestUtil.java:147)
> > >>       at
> > >>
> >
> org.apache.lucene.store.MockDirectoryWrapper.close(MockDirectoryWrapp
> > >> er.java:481)
> > >>       at
> > >> org.apache.lucene.index.TestIndexWriterConfig.testIndexWriterSetter
> > >> s(
> > >> Tes
> > >> tIndexWriterConfig.java:306)
> > >>       at
> > >>
> > org.apache.lucene.util.LuceneTestCase$LuceneTestCaseRunner.runChild(L
> > >> uc
> > >> eneTestCase.java:1268)
> > >>       at
> > >>
> > org.apache.lucene.util.LuceneTestCase$LuceneTestCaseRunner.runChild(L
> > >> uc
> > >> eneTestCase.java:1186)
> > >>
> > >>
> > >> FAILED:
> > >>
> >
> org.apache.lucene.index.TestIndexWriterExceptions.testRandomException
> > >> s
> > >>
> > >> Error Message:
> > >> CheckIndex failed
> > >>
> > >> Stack Trace:
> > >> java.lang.RuntimeException: CheckIndex failed
> > >>       at
> > >> org.apache.lucene.util._TestUtil.checkIndex(_TestUtil.java:147)
> > >>       at
> > >>
> > org.apache.lucene.index.TestIndexWriterExceptions$IndexerThread.run(T
> > >> es
> > >> tIndexWriterExceptions.java:106)
> > >>       at
> > >>
> >
> org.apache.lucene.index.TestIndexWriterExceptions.testRandomException
> > >> s
> > >> (TestIndexWriterExceptions.java:181)
> > >>       at
> > >>
> > org.apache.lucene.util.LuceneTestCase$LuceneTestCaseRunner.runChild(L
> > >> uc
> > >> eneTestCase.java:1268)
> > >>       at
> > >>
> > org.apache.lucene.util.LuceneTestCase$LuceneTestCaseRunner.runChild(L
> > >> uc
> > >> eneTestCase.java:1186)
> > >>
> > >>
> > >> FAILED:
> > >>
> >
> org.apache.lucene.index.TestIndexWriterExceptions.testRandomException
> > >> s
> > >> Threads
> > >>
> > >> Error Message:
> > >> Some threads threw uncaught exceptions!
> > >>
> > >> Stack Trace:
> > >> junit.framework.AssertionFailedError: Some threads threw uncaught
> > >> exceptions!
> > >>       at
> > >>
> > org.apache.lucene.util.LuceneTestCase$LuceneTestCaseRunner.runChild(L
> > >> uc
> > >> eneTestCase.java:1268)
> > >>       at
> > >>
> > org.apache.lucene.util.LuceneTestCase$LuceneTestCaseRunner.runChild(L
> > >> uc
> > >> eneTestCase.java:1186)
> > >>       at
> > >>
> > org.apache.lucene.util.LuceneTestCase.tearDown(LuceneTestCase.java:46
> > >> 8)
> > >>
> > >>
> > >> FAILED:
> > >> org.apache.lucene.index.TestIndexWriterReader.testAfterCommit
> > >>
> > >> Error Message:
> > >> CheckIndex failed
> > >>
> > >> Stack Trace:
> > >> java.lang.RuntimeException: CheckIndex failed
> > >>       at
> > >> org.apache.lucene.util._TestUtil.checkIndex(_TestUtil.java:147)
> > >>       at
> > >>
> > org.apache.lucene.index.TestIndexWriterReader.testAfterCommit(TestInd
> > >> e
> > >> xWriterReader.java:678)
> > >>       at
> > >>
> > org.apache.lucene.util.LuceneTestCase$LuceneTestCaseRunner.runChild(L
> > >> uc
> > >> eneTestCase.java:1268)
> > >>       at
> > >>
> > org.apache.lucene.util.LuceneTestCase$LuceneTestCaseRunner.runChild(L
> > >> uc
> > >> eneTestCase.java:1186)
> > >>
> > >>
> > >>
> > FAILED:  org.apache.lucene.index.TestIndexWriterReader.testEmptyIndex
> > >>
> > >> Error Message:
> > >> CheckIndex failed
> > >>
> > >> Stack Trace:
> > >> java.lang.RuntimeException: CheckIndex failed
> > >>       at
> > >> org.apache.lucene.util._TestUtil.checkIndex(_TestUtil.java:147)
> > >>       at
> > >>
> >
> org.apache.lucene.store.MockDirectoryWrapper.close(MockDirectoryWrapp
> > >> er.java:481)
> > >>       at
> > >>
> >
> org.apache.lucene.index.TestIndexWriterReader.testEmptyIndex(TestInde
> > >> x
> > >> WriterReader.java:965)
> > >>       at
> > >>
> > org.apache.lucene.util.LuceneTestCase$LuceneTestCaseRunner.runChild(L
> > >> uc
> > >> eneTestCase.java:1268)
> > >>       at
> > >>
> > org.apache.lucene.util.LuceneTestCase$LuceneTestCaseRunner.runChild(L
> > >> uc
> > >> eneTestCase.java:1186)
> > >>
> > >>
> > >>
> > FAILED:
> org.apache.lucene.index.TestNewestSegment.testNewestSegment
> > >>
> > >> Error Message:
> > >> CheckIndex failed
> > >>
> > >> Stack Trace:
> > >> java.lang.RuntimeException: CheckIndex failed
> > >>       at
> > >> org.apache.lucene.util._TestUtil.checkIndex(_TestUtil.java:147)
> > >>       at
> > >>
> >
> org.apache.lucene.store.MockDirectoryWrapper.close(MockDirectoryWrapp
> > >> er.java:481)
> > >>       at
> > >>
> >
> org.apache.lucene.index.TestNewestSegment.testNewestSegment(TestNe
> > >> westSegment.java:31)
> > >>       at
> > >>
> > org.apache.lucene.util.LuceneTestCase$LuceneTestCaseRunner.runChild(L
> > >> uc
> > >> eneTestCase.java:1268)
> > >>       at
> > >>
> > org.apache.lucene.util.LuceneTestCase$LuceneTestCaseRunner.runChild(L
> > >> uc
> > >> eneTestCase.java:1186)
> > >>
> > >>
> > >> FAILED:
> > >>
> org.apache.lucene.index.TestParallelReaderEmptyIndex.testEmptyIndex
> > >>
> > >> Error Message:
> > >> CheckIndex failed
> > >>
> > >> Stack Trace:
> > >> java.lang.RuntimeException: CheckIndex failed
> > >>       at
> > >> org.apache.lucene.util._TestUtil.checkIndex(_TestUtil.java:147)
> > >>       at
> > >>
> >
> org.apache.lucene.store.MockDirectoryWrapper.close(MockDirectoryWrapp
> > >> er.java:481)
> > >>       at
> > >>
> > org.apache.lucene.index.TestParallelReaderEmptyIndex.testEmptyIndex(T
> > >> e
> > >> stParallelReaderEmptyIndex.java:66)
> > >>       at
> > >>
> > org.apache.lucene.util.LuceneTestCase$LuceneTestCaseRunner.runChild(L
> > >> uc
> > >> eneTestCase.java:1268)
> > >>       at
> > >>
> > org.apache.lucene.util.LuceneTestCase$LuceneTestCaseRunner.runChild(L
> > >> uc
> > >> eneTestCase.java:1186)
> > >>
> > >>
> > >> FAILED:
> > >> org.apache.lucene.index.TestPersistentSnapshotDeletionPolicy.testIl
> > >> le
> > >> galSn
> > >> apshotId
> > >>
> > >> Error Message:
> > >> CheckIndex failed
> > >>
> > >> Stack Trace:
> > >> java.lang.RuntimeException: CheckIndex failed
> > >>       at
> > >> org.apache.lucene.util._TestUtil.checkIndex(_TestUtil.java:147)
> > >>       at
> > >>
> >
> org.apache.lucene.store.MockDirectoryWrapper.close(MockDirectoryWrapp
> > >> er.java:481)
> > >>       at
> > >>
> > org.apache.lucene.index.TestPersistentSnapshotDeletionPolicy.tearDown
> > >> (T
> > >> estPersistentSnapshotDeletionPolicy.java:51)
> > >>       at
> > >>
> > org.apache.lucene.util.LuceneTestCase$LuceneTestCaseRunner.runChild(L
> > >> uc
> > >> eneTestCase.java:1268)
> > >>       at
> > >>
> > org.apache.lucene.util.LuceneTestCase$LuceneTestCaseRunner.runChild(L
> > >> uc
> > >> eneTestCase.java:1186)
> > >>
> > >>
> > >> FAILED:
> > >> org.apache.lucene.index.TestPersistentSnapshotDeletionPolicy.testIn
> > >> va
> > >> lidSn
> > >> apshotInfos
> > >>
> > >> Error Message:
> > >> null
> > >>
> > >> Stack Trace:
> > >> java.lang.NullPointerException
> > >>       at
> > >>
> > org.apache.lucene.index.TestPersistentSnapshotDeletionPolicy.tearDown
> > >> (T
> > >> estPersistentSnapshotDeletionPolicy.java:51)
> > >>       at
> > >>
> > org.apache.lucene.util.LuceneTestCase$LuceneTestCaseRunner.runChild(L
> > >> uc
> > >> eneTestCase.java:1268)
> > >>       at
> > >>
> > org.apache.lucene.util.LuceneTestCase$LuceneTestCaseRunner.runChild(L
> > >> uc
> > >> eneTestCase.java:1186)
> > >>
> > >>
> > >> FAILED:
> > >> org.apache.lucene.index.TestPersistentSnapshotDeletionPolicy.testNo
> > >> Sn
> > >> aps
> > >> hotInfos
> > >>
> > >> Error Message:
> > >> null
> > >>
> > >> Stack Trace:
> > >> java.lang.NullPointerException
> > >>       at
> > >>
> > org.apache.lucene.index.TestPersistentSnapshotDeletionPolicy.tearDown
> > >> (T
> > >> estPersistentSnapshotDeletionPolicy.java:51)
> > >>       at
> > >>
> > org.apache.lucene.util.LuceneTestCase$LuceneTestCaseRunner.runChild(L
> > >> uc
> > >> eneTestCase.java:1268)
> > >>       at
> > >>
> > org.apache.lucene.util.LuceneTestCase$LuceneTestCaseRunner.runChild(L
> > >> uc
> > >> eneTestCase.java:1186)
> > >>
> > >>
> > >> FAILED:
> > >> org.apache.lucene.index.TestPersistentSnapshotDeletionPolicy.testTo
> > >> oM
> > >> an
> > >> ySnapshotInfos
> > >>
> > >> Error Message:
> > >> null
> > >>
> > >> Stack Trace:
> > >> java.lang.NullPointerException
> > >>       at
> > >>
> > org.apache.lucene.index.TestPersistentSnapshotDeletionPolicy.tearDown
> > >> (T
> > >> estPersistentSnapshotDeletionPolicy.java:51)
> > >>       at
> > >>
> > org.apache.lucene.util.LuceneTestCase$LuceneTestCaseRunner.runChild(L
> > >> uc
> > >> eneTestCase.java:1268)
> > >>       at
> > >>
> > org.apache.lucene.util.LuceneTestCase$LuceneTestCaseRunner.runChild(L
> > >> uc
> > >> eneTestCase.java:1186)
> > >>
> > >>
> > >> FAILED:
> > >> org.apache.lucene.index.TestPersistentSnapshotDeletionPolicy.testSn
> > >> ap
> > >> sho
> > >> tRelease
> > >>
> > >> Error Message:
> > >> null
> > >>
> > >> Stack Trace:
> > >> java.lang.NullPointerException
> > >>       at
> > >>
> > org.apache.lucene.index.TestPersistentSnapshotDeletionPolicy.tearDown
> > >> (T
> > >> estPersistentSnapshotDeletionPolicy.java:51)
> > >>       at
> > >>
> > org.apache.lucene.util.LuceneTestCase$LuceneTestCaseRunner.runChild(L
> > >> uc
> > >> eneTestCase.java:1268)
> > >>       at
> > >>
> > org.apache.lucene.util.LuceneTestCase$LuceneTestCaseRunner.runChild(L
> > >> uc
> > >> eneTestCase.java:1186)
> > >>
> > >>
> > >> FAILED:
> > >> org.apache.lucene.index.TestPersistentSnapshotDeletionPolicy.testSt
> > >> at
> > >> icRe
> > >> ad
> > >>
> > >> Error Message:
> > >> null
> > >>
> > >> Stack Trace:
> > >> java.lang.NullPointerException
> > >>       at
> > >>
> > org.apache.lucene.index.TestPersistentSnapshotDeletionPolicy.tearDown
> > >> (T
> > >> estPersistentSnapshotDeletionPolicy.java:51)
> > >>       at
> > >>
> > org.apache.lucene.util.LuceneTestCase$LuceneTestCaseRunner.runChild(L
> > >> uc
> > >> eneTestCase.java:1268)
> > >>       at
> > >>
> > org.apache.lucene.util.LuceneTestCase$LuceneTestCaseRunner.runChild(L
> > >> uc
> > >> eneTestCase.java:1186)
> > >>
> > >>
> > >> FAILED:
> > >> org.apache.lucene.index.TestPersistentSnapshotDeletionPolicy.testSn
> > >> ap
> > >> sho
> > >> tDeletionPolicy
> > >>
> > >> Error Message:
> > >> null
> > >>
> > >> Stack Trace:
> > >> java.lang.NullPointerException
> > >>       at
> > >>
> > org.apache.lucene.index.TestPersistentSnapshotDeletionPolicy.tearDown
> > >> (T
> > >> estPersistentSnapshotDeletionPolicy.java:51)
> > >>       at
> > >>
> > org.apache.lucene.util.LuceneTestCase$LuceneTestCaseRunner.runChild(L
> > >> uc
> > >> eneTestCase.java:1268)
> > >>       at
> > >>
> > org.apache.lucene.util.LuceneTestCase$LuceneTestCaseRunner.runChild(L
> > >> uc
> > >> eneTestCase.java:1186)
> > >>
> > >>
> > >> FAILED:
> > >> org.apache.lucene.index.TestPersistentSnapshotDeletionPolicy.testBa
> > >> si
> > >> cSna
> > >> pshots
> > >>
> > >> Error Message:
> > >> null
> > >>
> > >> Stack Trace:
> > >> java.lang.NullPointerException
> > >>       at
> > >>
> > org.apache.lucene.index.TestPersistentSnapshotDeletionPolicy.tearDown
> > >> (T
> > >> estPersistentSnapshotDeletionPolicy.java:51)
> > >>       at
> > >>
> > org.apache.lucene.util.LuceneTestCase$LuceneTestCaseRunner.runChild(L
> > >> uc
> > >> eneTestCase.java:1268)
> > >>       at
> > >>
> > org.apache.lucene.util.LuceneTestCase$LuceneTestCaseRunner.runChild(L
> > >> uc
> > >> eneTestCase.java:1186)
> > >>
> > >>
> > >> FAILED:
> > >> org.apache.lucene.index.TestPersistentSnapshotDeletionPolicy.testMu
> > >> lt
> > >> iThr
> > >> eadedSnapshotting
> > >>
> > >> Error Message:
> > >> null
> > >>
> > >> Stack Trace:
> > >> java.lang.NullPointerException
> > >>       at
> > >>
> > org.apache.lucene.index.TestPersistentSnapshotDeletionPolicy.tearDown
> > >> (T
> > >> estPersistentSnapshotDeletionPolicy.java:51)
> > >>       at
> > >>
> > org.apache.lucene.util.LuceneTestCase$LuceneTestCaseRunner.runChild(L
> > >> uc
> > >> eneTestCase.java:1268)
> > >>       at
> > >>
> > org.apache.lucene.util.LuceneTestCase$LuceneTestCaseRunner.runChild(L
> > >> uc
> > >> eneTestCase.java:1186)
> > >>
> > >>
> > >> FAILED:
> > >> org.apache.lucene.index.TestPersistentSnapshotDeletionPolicy.testRo
> > >> ll
> > >> back
> > >> ToOldSnapshot
> > >>
> > >> Error Message:
> > >> null
> > >>
> > >> Stack Trace:
> > >> java.lang.NullPointerException
> > >>       at
> > >>
> > org.apache.lucene.index.TestPersistentSnapshotDeletionPolicy.tearDown
> > >> (T
> > >> estPersistentSnapshotDeletionPolicy.java:51)
> > >>       at
> > >>
> > org.apache.lucene.util.LuceneTestCase$LuceneTestCaseRunner.runChild(L
> > >> uc
> > >> eneTestCase.java:1268)
> > >>       at
> > >>
> > org.apache.lucene.util.LuceneTestCase$LuceneTestCaseRunner.runChild(L
> > >> uc
> > >> eneTestCase.java:1186)
> > >>
> > >>
> > >> FAILED:
> > >> org.apache.lucene.index.TestPersistentSnapshotDeletionPolicy.testRe
> > >> le
> > >> aseS
> > >> napshot
> > >>
> > >> Error Message:
> > >> null
> > >>
> > >> Stack Trace:
> > >> java.lang.NullPointerException
> > >>       at
> > >>
> > org.apache.lucene.index.TestPersistentSnapshotDeletionPolicy.tearDown
> > >> (T
> > >> estPersistentSnapshotDeletionPolicy.java:51)
> > >>       at
> > >>
> > org.apache.lucene.util.LuceneTestCase$LuceneTestCaseRunner.runChild(L
> > >> uc
> > >> eneTestCase.java:1268)
> > >>       at
> > >>
> > org.apache.lucene.util.LuceneTestCase$LuceneTestCaseRunner.runChild(L
> > >> uc
> > >> eneTestCase.java:1186)
> > >>
> > >>
> > >> FAILED:
> > >> org.apache.lucene.index.TestPersistentSnapshotDeletionPolicy.testSn
> > >> ap
> > >> sho
> > >> tLastCommitTwice
> > >>
> > >> Error Message:
> > >> null
> > >>
> > >> Stack Trace:
> > >> java.lang.NullPointerException
> > >>       at
> > >>
> > org.apache.lucene.index.TestPersistentSnapshotDeletionPolicy.tearDown
> > >> (T
> > >> estPersistentSnapshotDeletionPolicy.java:51)
> > >>       at
> > >>
> > org.apache.lucene.util.LuceneTestCase$LuceneTestCaseRunner.runChild(L
> > >> uc
> > >> eneTestCase.java:1268)
> > >>       at
> > >>
> > org.apache.lucene.util.LuceneTestCase$LuceneTestCaseRunner.runChild(L
> > >> uc
> > >> eneTestCase.java:1186)
> > >>
> > >>
> > >> FAILED:
> > >> org.apache.lucene.index.TestPersistentSnapshotDeletionPolicy.testMi
> > >> ss
> > >> ingC
> > >> ommits
> > >>
> > >> Error Message:
> > >> null
> > >>
> > >> Stack Trace:
> > >> java.lang.NullPointerException
> > >>       at
> > >>
> > org.apache.lucene.index.TestPersistentSnapshotDeletionPolicy.tearDown
> > >> (T
> > >> estPersistentSnapshotDeletionPolicy.java:51)
> > >>       at
> > >>
> > org.apache.lucene.util.LuceneTestCase$LuceneTestCaseRunner.runChild(L
> > >> uc
> > >> eneTestCase.java:1268)
> > >>       at
> > >>
> > org.apache.lucene.util.LuceneTestCase$LuceneTestCaseRunner.runChild(L
> > >> uc
> > >> eneTestCase.java:1186)
> > >>
> > >>
> > >> FAILED:
> > >> junit.framework.TestSuite.org.apache.lucene.index.TestPersistentSna
> > >> ps
> > >> hot
> > >> DeletionPolicy
> > >>
> > >> Error Message:
> > >> ensure your setUp() calls super.setUp() and your tearDown() calls
> > >> super.tearDown()!!!
> > >>
> > >> Stack Trace:
> > >> junit.framework.AssertionFailedError: ensure your setUp() calls
> > >> super.setUp() and your tearDown() calls super.tearDown()!!!
> > >>       at
> > >> org.apache.lucene.util.LuceneTestCase.afterClassLuceneTestCaseJ4(Lu
> > >> ce
> > >> neT
> > >> estCase.java:257)
> > >>
> > >>
> > >> FAILED:
> > >> org.apache.lucene.index.TestStressIndexing2.testRandomIWReader
> > >>
> > >> Error Message:
> > >> CheckIndex failed
> > >>
> > >> Stack Trace:
> > >> java.lang.RuntimeException: CheckIndex failed
> > >>       at
> > >> org.apache.lucene.util._TestUtil.checkIndex(_TestUtil.java:147)
> > >>       at
> > >>
> >
> org.apache.lucene.index.TestStressIndexing2.indexRandomIWReader(TestS
> > >> tressIndexing2.java:192)
> > >>       at
> > >>
> >
> org.apache.lucene.index.TestStressIndexing2.testRandomIWReader(TestSt
> > >> r
> > >> essIndexing2.java:68)
> > >>       at
> > >>
> > org.apache.lucene.util.LuceneTestCase$LuceneTestCaseRunner.runChild(L
> > >> uc
> > >> eneTestCase.java:1268)
> > >>       at
> > >>
> > org.apache.lucene.util.LuceneTestCase$LuceneTestCaseRunner.runChild(L
> > >> uc
> > >> eneTestCase.java:1186)
> > >>
> > >>
> > >> FAILED:
> > >> org.apache.lucene.search.TestCachingWrapperFilter.testCachingWorks
> > >>
> > >> Error Message:
> > >> CheckIndex failed
> > >>
> > >> Stack Trace:
> > >> java.lang.RuntimeException: CheckIndex failed
> > >>       at
> > >> org.apache.lucene.util._TestUtil.checkIndex(_TestUtil.java:147)
> > >>       at
> > >>
> >
> org.apache.lucene.store.MockDirectoryWrapper.close(MockDirectoryWrapp
> > >> er.java:481)
> > >>       at
> > >>
> > org.apache.lucene.search.TestCachingWrapperFilter.testCachingWorks(Te
> > >> st
> > >> CachingWrapperFilter.java:60)
> > >>       at
> > >>
> > org.apache.lucene.util.LuceneTestCase$LuceneTestCaseRunner.runChild(L
> > >> uc
> > >> eneTestCase.java:1268)
> > >>       at
> > >>
> > org.apache.lucene.util.LuceneTestCase$LuceneTestCaseRunner.runChild(L
> > >> uc
> > >> eneTestCase.java:1186)
> > >>
> > >>
> > >> FAILED:
> > >> org.apache.lucene.search.TestCachingWrapperFilter.testNullDocIdSet
> > >>
> > >> Error Message:
> > >> CheckIndex failed
> > >>
> > >> Stack Trace:
> > >> java.lang.RuntimeException: CheckIndex failed
> > >>       at
> > >> org.apache.lucene.util._TestUtil.checkIndex(_TestUtil.java:147)
> > >>       at
> > >>
> >
> org.apache.lucene.store.MockDirectoryWrapper.close(MockDirectoryWrapp
> > >> er.java:481)
> > >>       at
> > >> org.apache.lucene.search.TestCachingWrapperFilter.testNullDocIdSet(
> > >> Te
> > >> stC
> > >> achingWrapperFilter.java:82)
> > >>       at
> > >>
> > org.apache.lucene.util.LuceneTestCase$LuceneTestCaseRunner.runChild(L
> > >> uc
> > >> eneTestCase.java:1268)
> > >>       at
> > >>
> > org.apache.lucene.util.LuceneTestCase$LuceneTestCaseRunner.runChild(L
> > >> uc
> > >> eneTestCase.java:1186)
> > >>
> > >>
> > >> FAILED:
> > >> org.apache.lucene.search.TestCachingWrapperFilter.testNullDocIdSetI
> > >> te
> > >> rato
> > >> r
> > >>
> > >> Error Message:
> > >> CheckIndex failed
> > >>
> > >> Stack Trace:
> > >> java.lang.RuntimeException: CheckIndex failed
> > >>       at
> > >> org.apache.lucene.util._TestUtil.checkIndex(_TestUtil.java:147)
> > >>       at
> > >>
> >
> org.apache.lucene.store.MockDirectoryWrapper.close(MockDirectoryWrapp
> > >> er.java:481)
> > >>       at
> > >> org.apache.lucene.search.TestCachingWrapperFilter.testNullDocIdSetI
> > >> te
> > >> rato
> > >> r(TestCachingWrapperFilter.java:109)
> > >>       at
> > >>
> > org.apache.lucene.util.LuceneTestCase$LuceneTestCaseRunner.runChild(L
> > >> uc
> > >> eneTestCase.java:1268)
> > >>       at
> > >>
> > org.apache.lucene.util.LuceneTestCase$LuceneTestCaseRunner.runChild(L
> > >> uc
> > >> eneTestCase.java:1186)
> > >>
> > >>
> > >> FAILED:
> > >> org.apache.lucene.search.TestPositiveScoresOnlyCollector.testNegati
> > >> ve
> > >> Scor
> > >> es
> > >>
> > >> Error Message:
> > >> CheckIndex failed
> > >>
> > >> Stack Trace:
> > >> java.lang.RuntimeException: CheckIndex failed
> > >>       at
> > >> org.apache.lucene.util._TestUtil.checkIndex(_TestUtil.java:147)
> > >>       at
> > >>
> >
> org.apache.lucene.store.MockDirectoryWrapper.close(MockDirectoryWrapp
> > >> er.java:481)
> > >>       at
> > >> org.apache.lucene.search.TestPositiveScoresOnlyCollector.testNegati
> > >> ve
> > >> Scor
> > >> es(TestPositiveScoresOnlyCollector.java:94)
> > >>       at
> > >>
> > org.apache.lucene.util.LuceneTestCase$LuceneTestCaseRunner.runChild(L
> > >> uc
> > >> eneTestCase.java:1268)
> > >>       at
> > >>
> > org.apache.lucene.util.LuceneTestCase$LuceneTestCaseRunner.runChild(L
> > >> uc
> > >> eneTestCase.java:1186)
> > >>
> > >>
> > >> FAILED:  org.apache.lucene.search.TestSort.testEmptyIndex
> > >>
> > >> Error Message:
> > >> CheckIndex failed
> > >>
> > >> Stack Trace:
> > >> java.lang.RuntimeException: CheckIndex failed
> > >>       at
> > >> org.apache.lucene.util._TestUtil.checkIndex(_TestUtil.java:147)
> > >>       at
> > >>
> >
> org.apache.lucene.store.MockDirectoryWrapper.close(MockDirectoryWrapp
> > >> er.java:481)
> > >>       at
> > >> org.apache.lucene.search.TestSort.tearDown(TestSort.java:236)
> > >>       at
> > >>
> > org.apache.lucene.util.LuceneTestCase$LuceneTestCaseRunner.runChild(L
> > >> uc
> > >> eneTestCase.java:1268)
> > >>       at
> > >>
> > org.apache.lucene.util.LuceneTestCase$LuceneTestCaseRunner.runChild(L
> > >> uc
> > >> eneTestCase.java:1186)
> > >>
> > >>
> > >> FAILED:  org.apache.lucene.search.TestSort.testBuiltInSorts
> > >>
> > >> Error Message:
> > >> null
> > >>
> > >> Stack Trace:
> > >> java.lang.NullPointerException
> > >>       at
> > >> org.apache.lucene.search.TestSort.tearDown(TestSort.java:229)
> > >>       at
> > >>
> > org.apache.lucene.util.LuceneTestCase$LuceneTestCaseRunner.runChild(L
> > >> uc
> > >> eneTestCase.java:1268)
> > >>       at
> > >>
> > org.apache.lucene.util.LuceneTestCase$LuceneTestCaseRunner.runChild(L
> > >> uc
> > >> eneTestCase.java:1186)
> > >>
> > >>
> > >> FAILED:  org.apache.lucene.search.TestSort.testTypedSort
> > >>
> > >> Error Message:
> > >> null
> > >>
> > >> Stack Trace:
> > >> java.lang.NullPointerException
> > >>       at
> > >> org.apache.lucene.search.TestSort.tearDown(TestSort.java:229)
> > >>       at
> > >>
> > org.apache.lucene.util.LuceneTestCase$LuceneTestCaseRunner.runChild(L
> > >> uc
> > >> eneTestCase.java:1268)
> > >>       at
> > >>
> > org.apache.lucene.util.LuceneTestCase$LuceneTestCaseRunner.runChild(L
> > >> uc
> > >> eneTestCase.java:1186)
> > >>
> > >>
> > >> FAILED:  org.apache.lucene.search.TestSort.testStringSort
> > >>
> > >> Error Message:
> > >> null
> > >>
> > >> Stack Trace:
> > >> java.lang.NullPointerException
> > >>       at
> > >> org.apache.lucene.search.TestSort.tearDown(TestSort.java:229)
> > >>       at
> > >>
> > org.apache.lucene.util.LuceneTestCase$LuceneTestCaseRunner.runChild(L
> > >> uc
> > >> eneTestCase.java:1268)
> > >>       at
> > >>
> > org.apache.lucene.util.LuceneTestCase$LuceneTestCaseRunner.runChild(L
> > >> uc
> > >> eneTestCase.java:1186)
> > >>
> > >>
> > >> FAILED:
> > >> org.apache.lucene.search.TestSort.testCustomFieldParserSort
> > >>
> > >> Error Message:
> > >> null
> > >>
> > >> Stack Trace:
> > >> java.lang.NullPointerException
> > >>       at
> > >> org.apache.lucene.search.TestSort.tearDown(TestSort.java:229)
> > >>       at
> > >>
> > org.apache.lucene.util.LuceneTestCase$LuceneTestCaseRunner.runChild(L
> > >> uc
> > >> eneTestCase.java:1268)
> > >>       at
> > >>
> > org.apache.lucene.util.LuceneTestCase$LuceneTestCaseRunner.runChild(L
> > >> uc
> > >> eneTestCase.java:1186)
> > >>
> > >>
> > >> FAILED:
> > >> org.apache.lucene.search.TestSort.testNewCustomFieldParserSort
> > >>
> > >> Error Message:
> > >> null
> > >>
> > >> Stack Trace:
> > >> java.lang.NullPointerException
> > >>       at
> > >> org.apache.lucene.search.TestSort.tearDown(TestSort.java:229)
> > >>       at
> > >>
> > org.apache.lucene.util.LuceneTestCase$LuceneTestCaseRunner.runChild(L
> > >> uc
> > >> eneTestCase.java:1268)
> > >>       at
> > >>
> > org.apache.lucene.util.LuceneTestCase$LuceneTestCaseRunner.runChild(L
> > >> uc
> > >> eneTestCase.java:1186)
> > >>
> > >>
> > >> FAILED:  org.apache.lucene.search.TestSort.testReverseSort
> > >>
> > >> Error Message:
> > >> null
> > >>
> > >> Stack Trace:
> > >> java.lang.NullPointerException
> > >>       at
> > >> org.apache.lucene.search.TestSort.tearDown(TestSort.java:229)
> > >>       at
> > >>
> > org.apache.lucene.util.LuceneTestCase$LuceneTestCaseRunner.runChild(L
> > >> uc
> > >> eneTestCase.java:1268)
> > >>       at
> > >>
> > org.apache.lucene.util.LuceneTestCase$LuceneTestCaseRunner.runChild(L
> > >> uc
> > >> eneTestCase.java:1186)
> > >>
> > >>
> > >> FAILED:  org.apache.lucene.search.TestSort.testEmptyFieldSort
> > >>
> > >> Error Message:
> > >> null
> > >>
> > >> Stack Trace:
> > >> java.lang.NullPointerException
> > >>       at
> > >> org.apache.lucene.search.TestSort.tearDown(TestSort.java:229)
> > >>       at
> > >>
> > org.apache.lucene.util.LuceneTestCase$LuceneTestCaseRunner.runChild(L
> > >> uc
> > >> eneTestCase.java:1268)
> > >>       at
> > >>
> > org.apache.lucene.util.LuceneTestCase$LuceneTestCaseRunner.runChild(L
> > >> uc
> > >> eneTestCase.java:1186)
> > >>
> > >>
> > >> FAILED:  org.apache.lucene.search.TestSort.testSortCombos
> > >>
> > >> Error Message:
> > >> null
> > >>
> > >> Stack Trace:
> > >> java.lang.NullPointerException
> > >>       at
> > >> org.apache.lucene.search.TestSort.tearDown(TestSort.java:229)
> > >>       at
> > >>
> > org.apache.lucene.util.LuceneTestCase$LuceneTestCaseRunner.runChild(L
> > >> uc
> > >> eneTestCase.java:1268)
> > >>       at
> > >>
> > org.apache.lucene.util.LuceneTestCase$LuceneTestCaseRunner.runChild(L
> > >> uc
> > >> eneTestCase.java:1186)
> > >>
> > >>
> > >> FAILED:  org.apache.lucene.search.TestSort.testLocaleSort
> > >>
> > >> Error Message:
> > >> null
> > >>
> > >> Stack Trace:
> > >> java.lang.NullPointerException
> > >>       at
> > >> org.apache.lucene.search.TestSort.tearDown(TestSort.java:229)
> > >>       at
> > >>
> > org.apache.lucene.util.LuceneTestCase$LuceneTestCaseRunner.runChild(L
> > >> uc
> > >> eneTestCase.java:1268)
> > >>       at
> > >>
> > org.apache.lucene.util.LuceneTestCase$LuceneTestCaseRunner.runChild(L
> > >> uc
> > >> eneTestCase.java:1186)
> > >>
> > >>
> > >> FAILED:  org.apache.lucene.search.TestSort.testInternationalSort
> > >>
> > >> Error Message:
> > >> null
> > >>
> > >> Stack Trace:
> > >> java.lang.NullPointerException
> > >>       at
> > >> org.apache.lucene.search.TestSort.tearDown(TestSort.java:229)
> > >>       at
> > >>
> > org.apache.lucene.util.LuceneTestCase$LuceneTestCaseRunner.runChild(L
> > >> uc
> > >> eneTestCase.java:1268)
> > >>       at
> > >>
> > org.apache.lucene.util.LuceneTestCase$LuceneTestCaseRunner.runChild(L
> > >> uc
> > >> eneTestCase.java:1186)
> > >>
> > >>
> > >> FAILED:
> > >> org.apache.lucene.search.TestSort.testInternationalMultiSearcherSor
> > >> t
> > >>
> > >> Error Message:
> > >> null
> > >>
> > >> Stack Trace:
> > >> java.lang.NullPointerException
> > >>       at
> > >> org.apache.lucene.search.TestSort.tearDown(TestSort.java:229)
> > >>       at
> > >>
> > org.apache.lucene.util.LuceneTestCase$LuceneTestCaseRunner.runChild(L
> > >> uc
> > >> eneTestCase.java:1268)
> > >>       at
> > >>
> > org.apache.lucene.util.LuceneTestCase$LuceneTestCaseRunner.runChild(L
> > >> uc
> > >> eneTestCase.java:1186)
> > >>
> > >>
> > >> FAILED:  org.apache.lucene.search.TestSort.testMultiSort
> > >>
> > >> Error Message:
> > >> null
> > >>
> > >> Stack Trace:
> > >> java.lang.NullPointerException
> > >>       at
> > >> org.apache.lucene.search.TestSort.tearDown(TestSort.java:229)
> > >>       at
> > >>
> > org.apache.lucene.util.LuceneTestCase$LuceneTestCaseRunner.runChild(L
> > >> uc
> > >> eneTestCase.java:1268)
> > >>       at
> > >>
> > org.apache.lucene.util.LuceneTestCase$LuceneTestCaseRunner.runChild(L
> > >> uc
> > >> eneTestCase.java:1186)
> > >>
> > >>
> > >> FAILED:  org.apache.lucene.search.TestSort.testParallelMultiSort
> > >>
> > >> Error Message:
> > >> null
> > >>
> > >> Stack Trace:
> > >> java.lang.NullPointerException
> > >>       at
> > >> org.apache.lucene.search.TestSort.tearDown(TestSort.java:229)
> > >>       at
> > >>
> > org.apache.lucene.util.LuceneTestCase$LuceneTestCaseRunner.runChild(L
> > >> uc
> > >> eneTestCase.java:1268)
> > >>       at
> > >>
> > org.apache.lucene.util.LuceneTestCase$LuceneTestCaseRunner.runChild(L
> > >> uc
> > >> eneTestCase.java:1186)
> > >>
> > >>
> > >> FAILED:  org.apache.lucene.search.TestSort.testNormalizedScores
> > >>
> > >> Error Message:
> > >> null
> > >>
> > >> Stack Trace:
> > >> java.lang.NullPointerException
> > >>       at
> > >> org.apache.lucene.search.TestSort.tearDown(TestSort.java:229)
> > >>       at
> > >>
> > org.apache.lucene.util.LuceneTestCase$LuceneTestCaseRunner.runChild(L
> > >> uc
> > >> eneTestCase.java:1268)
> > >>       at
> > >>
> > org.apache.lucene.util.LuceneTestCase$LuceneTestCaseRunner.runChild(L
> > >> uc
> > >> eneTestCase.java:1186)
> > >>
> > >>
> > >> FAILED:  org.apache.lucene.search.TestSort.testTopDocsScores
> > >>
> > >> Error Message:
> > >> null
> > >>
> > >> Stack Trace:
> > >> java.lang.NullPointerException
> > >>       at
> > >> org.apache.lucene.search.TestSort.tearDown(TestSort.java:229)
> > >>       at
> > >>
> > org.apache.lucene.util.LuceneTestCase$LuceneTestCaseRunner.runChild(L
> > >> uc
> > >> eneTestCase.java:1268)
> > >>       at
> > >>
> > org.apache.lucene.util.LuceneTestCase$LuceneTestCaseRunner.runChild(L
> > >> uc
> > >> eneTestCase.java:1186)
> > >>
> > >>
> > >> FAILED:
> > >> org.apache.lucene.search.TestSort.testSortWithoutFillFields
> > >>
> > >> Error Message:
> > >> null
> > >>
> > >> Stack Trace:
> > >> java.lang.NullPointerException
> > >>       at
> > >> org.apache.lucene.search.TestSort.tearDown(TestSort.java:229)
> > >>       at
> > >>
> > org.apache.lucene.util.LuceneTestCase$LuceneTestCaseRunner.runChild(L
> > >> uc
> > >> eneTestCase.java:1268)
> > >>       at
> > >>
> > org.apache.lucene.util.LuceneTestCase$LuceneTestCaseRunner.runChild(L
> > >> uc
> > >> eneTestCase.java:1186)
> > >>
> > >>
> > >> FAILED:
> > >> org.apache.lucene.search.TestSort.testSortWithoutScoreTracking
> > >>
> > >> Error Message:
> > >> null
> > >>
> > >> Stack Trace:
> > >> java.lang.NullPointerException
> > >>       at
> > >> org.apache.lucene.search.TestSort.tearDown(TestSort.java:229)
> > >>       at
> > >>
> > org.apache.lucene.util.LuceneTestCase$LuceneTestCaseRunner.runChild(L
> > >> uc
> > >> eneTestCase.java:1268)
> > >>       at
> > >>
> > org.apache.lucene.util.LuceneTestCase$LuceneTestCaseRunner.runChild(L
> > >> uc
> > >> eneTestCase.java:1186)
> > >>
> > >>
> > >> FAILED:
> > >>
> > org.apache.lucene.search.TestSort.testSortWithScoreNoMaxScoreTracking
> > >>
> > >> Error Message:
> > >> null
> > >>
> > >> Stack Trace:
> > >> java.lang.NullPointerException
> > >>       at
> > >> org.apache.lucene.search.TestSort.tearDown(TestSort.java:229)
> > >>       at
> > >>
> > org.apache.lucene.util.LuceneTestCase$LuceneTestCaseRunner.runChild(L
> > >> uc
> > >> eneTestCase.java:1268)
> > >>       at
> > >>
> > org.apache.lucene.util.LuceneTestCase$LuceneTestCaseRunner.runChild(L
> > >> uc
> > >> eneTestCase.java:1186)
> > >>
> > >>
> > >> FAILED:
> > >>
> > org.apache.lucene.search.TestSort.testSortWithScoreNoMaxScoreTracking
> > >> M
> > >> ulti
> > >>
> > >> Error Message:
> > >> null
> > >>
> > >> Stack Trace:
> > >> java.lang.NullPointerException
> > >>       at
> > >> org.apache.lucene.search.TestSort.tearDown(TestSort.java:229)
> > >>       at
> > >>
> > org.apache.lucene.util.LuceneTestCase$LuceneTestCaseRunner.runChild(L
> > >> uc
> > >> eneTestCase.java:1268)
> > >>       at
> > >>
> > org.apache.lucene.util.LuceneTestCase$LuceneTestCaseRunner.runChild(L
> > >> uc
> > >> eneTestCase.java:1186)
> > >>
> > >>
> > >> FAILED:
> > >>
> > org.apache.lucene.search.TestSort.testSortWithScoreAndMaxScoreTrackin
> > >> g
> > >>
> > >> Error Message:
> > >> null
> > >>
> > >> Stack Trace:
> > >> java.lang.NullPointerException
> > >>       at
> > >> org.apache.lucene.search.TestSort.tearDown(TestSort.java:229)
> > >>       at
> > >>
> > org.apache.lucene.util.LuceneTestCase$LuceneTestCaseRunner.runChild(L
> > >> uc
> > >> eneTestCase.java:1268)
> > >>       at
> > >>
> > org.apache.lucene.util.LuceneTestCase$LuceneTestCaseRunner.runChild(L
> > >> uc
> > >> eneTestCase.java:1186)
> > >>
> > >>
> > >> FAILED:
> > >> org.apache.lucene.search.TestSort.testOutOfOrderDocsScoringSort
> > >>
> > >> Error Message:
> > >> null
> > >>
> > >> Stack Trace:
> > >> java.lang.NullPointerException
> > >>       at
> > >> org.apache.lucene.search.TestSort.tearDown(TestSort.java:229)
> > >>       at
> > >>
> > org.apache.lucene.util.LuceneTestCase$LuceneTestCaseRunner.runChild(L
> > >> uc
> > >> eneTestCase.java:1268)
> > >>       at
> > >>
> > org.apache.lucene.util.LuceneTestCase$LuceneTestCaseRunner.runChild(L
> > >> uc
> > >> eneTestCase.java:1186)
> > >>
> > >>
> > >> FAILED:
> > >>
> org.apache.lucene.search.TestSort.testOutOfOrderDocsScoringSortMult
> > >> i
> > >>
> > >> Error Message:
> > >> null
> > >>
> > >> Stack Trace:
> > >> java.lang.NullPointerException
> > >>       at
> > >> org.apache.lucene.search.TestSort.tearDown(TestSort.java:229)
> > >>       at
> > >>
> > org.apache.lucene.util.LuceneTestCase$LuceneTestCaseRunner.runChild(L
> > >> uc
> > >> eneTestCase.java:1268)
> > >>       at
> > >>
> > org.apache.lucene.util.LuceneTestCase$LuceneTestCaseRunner.runChild(L
> > >> uc
> > >> eneTestCase.java:1186)
> > >>
> > >>
> > >> FAILED:
> > >>
> > org.apache.lucene.search.TestSort.testSortWithScoreAndMaxScoreTrackin
> > >> g
> > >> NoResults
> > >>
> > >> Error Message:
> > >> null
> > >>
> > >> Stack Trace:
> > >> java.lang.NullPointerException
> > >>       at
> > >> org.apache.lucene.search.TestSort.tearDown(TestSort.java:229)
> > >>       at
> > >>
> > org.apache.lucene.util.LuceneTestCase$LuceneTestCaseRunner.runChild(L
> > >> uc
> > >> eneTestCase.java:1268)
> > >>       at
> > >>
> > org.apache.lucene.util.LuceneTestCase$LuceneTestCaseRunner.runChild(L
> > >> uc
> > >> eneTestCase.java:1186)
> > >>
> > >>
> > >> FAILED:
> > >> org.apache.lucene.search.TestSort.testEmptyStringVsNullStringSort
> > >>
> > >> Error Message:
> > >> null
> > >>
> > >> Stack Trace:
> > >> java.lang.NullPointerException
> > >>       at
> > >> org.apache.lucene.search.TestSort.tearDown(TestSort.java:229)
> > >>       at
> > >>
> > org.apache.lucene.util.LuceneTestCase$LuceneTestCaseRunner.runChild(L
> > >> uc
> > >> eneTestCase.java:1268)
> > >>       at
> > >>
> > org.apache.lucene.util.LuceneTestCase$LuceneTestCaseRunner.runChild(L
> > >> uc
> > >> eneTestCase.java:1186)
> > >>
> > >>
> > >> FAILED:  org.apache.lucene.search.TestSort.testLUCENE2142
> > >>
> > >> Error Message:
> > >> null
> > >>
> > >> Stack Trace:
> > >> java.lang.NullPointerException
> > >>       at
> > >> org.apache.lucene.search.TestSort.tearDown(TestSort.java:229)
> > >>       at
> > >>
> > org.apache.lucene.util.LuceneTestCase$LuceneTestCaseRunner.runChild(L
> > >> uc
> > >> eneTestCase.java:1268)
> > >>       at
> > >>
> > org.apache.lucene.util.LuceneTestCase$LuceneTestCaseRunner.runChild(L
> > >> uc
> > >> eneTestCase.java:1186)
> > >>
> > >>
> > >> FAILED:  org.apache.lucene.search.TestSort.testCountingCollector
> > >>
> > >> Error Message:
> > >> null
> > >>
> > >> Stack Trace:
> > >> java.lang.NullPointerException
> > >>       at
> > >> org.apache.lucene.search.TestSort.tearDown(TestSort.java:229)
> > >>       at
> > >>
> > org.apache.lucene.util.LuceneTestCase$LuceneTestCaseRunner.runChild(L
> > >> uc
> > >> eneTestCase.java:1268)
> > >>       at
> > >>
> > org.apache.lucene.util.LuceneTestCase$LuceneTestCaseRunner.runChild(L
> > >> uc
> > >> eneTestCase.java:1186)
> > >>
> > >>
> > >> FAILED:
> > >> junit.framework.TestSuite.org.apache.lucene.search.TestSort
> > >>
> > >> Error Message:
> > >> ensure your setUp() calls super.setUp() and your tearDown() calls
> > >> super.tearDown()!!!
> > >>
> > >> Stack Trace:
> > >> junit.framework.AssertionFailedError: ensure your setUp() calls
> > >> super.setUp() and your tearDown() calls super.tearDown()!!!
> > >>       at
> > >> org.apache.lucene.util.LuceneTestCase.afterClassLuceneTestCaseJ4(Lu
> > >> ce
> > >> neT
> > >> estCase.java:257)
> > >>
> > >>
> > >>
> > >>
> > >> Build Log (for compile errors):
> > >> [...truncated 6091 lines...]
> > >>
> > >>
> > >>
> > >> -------------------------------------------------------------------
> > >> -- To unsubscribe, e-mail: dev-unsubscribe@lucene.apache.org For
> > >> additional commands, e-mail: dev-help@lucene.apache.org
> > >
> > >
> > >
> > > --------------------------------------------------------------------
> > > - To unsubscribe, e-mail: dev-unsubscribe@lucene.apache.org For
> > > additional commands, e-mail: dev-help@lucene.apache.org
> > >
> > >
> >
> > ---------------------------------------------------------------------
> > To unsubscribe, e-mail: dev-unsubscribe@lucene.apache.org For
> > additional commands, e-mail: dev-help@lucene.apache.org
> 
> 
> 
> ---------------------------------------------------------------------
> To unsubscribe, e-mail: dev-unsubscribe@lucene.apache.org For additional
> commands, e-mail: dev-help@lucene.apache.org



---------------------------------------------------------------------
To unsubscribe, e-mail: dev-unsubscribe@lucene.apache.org
For additional commands, e-mail: dev-help@lucene.apache.org


Mime
View raw message