lucene-dev mailing list archives

Site index · List index
Message view « Date » · « Thread »
Top « Date » · « Thread »
From Simon Willnauer <simon.willna...@googlemail.com>
Subject Re: [JENKINS] Lucene-Solr-tests-only-trunk - Build # 8380 - Failure
Date Thu, 26 May 2011 00:35:10 GMT
just committed a fix for this

simon
On Thu, May 26, 2011 at 2:32 AM, Simon Willnauer
<simon.willnauer@googlemail.com> wrote:
> that assert is broken... I am working on fixing this...
>
> simon
>
> On Thu, May 26, 2011 at 1:25 AM, Apache Jenkins Server
> <hudson@hudson.apache.org> wrote:
>> Build: https://builds.apache.org/hudson/job/Lucene-Solr-tests-only-trunk/8380/
>>
>> 45 tests failed.
>> REGRESSION:  org.apache.lucene.index.TestCodecs.testSepPositionAfterMerge
>>
>> Error Message:
>> separate norms file (.s*) is not allowed in .cfs: _2_0.skp
>>
>> Stack Trace:
>> junit.framework.AssertionFailedError: separate norms file (.s*) is not allowed in .cfs: _2_0.skp
>>        at org.apache.lucene.util.LuceneTestCase$LuceneTestCaseRunner.runChild(LuceneTestCase.java:1333)
>>        at org.apache.lucene.util.LuceneTestCase$LuceneTestCaseRunner.runChild(LuceneTestCase.java:1251)
>>        at org.apache.lucene.index.SegmentMerger.createCompoundFile(SegmentMerger.java:139)
>>        at org.apache.lucene.index.IndexWriter.mergeMiddle(IndexWriter.java:3420)
>>        at org.apache.lucene.index.IndexWriter.merge(IndexWriter.java:3035)
>>        at org.apache.lucene.index.SerialMergeScheduler.merge(SerialMergeScheduler.java:37)
>>        at org.apache.lucene.index.IndexWriter.maybeMerge(IndexWriter.java:1866)
>>        at org.apache.lucene.index.IndexWriter.maybeMerge(IndexWriter.java:1861)
>>        at org.apache.lucene.index.IndexWriter.maybeMerge(IndexWriter.java:1857)
>>        at org.apache.lucene.index.IndexWriter.flush(IndexWriter.java:2701)
>>        at org.apache.lucene.index.IndexWriter.prepareCommit(IndexWriter.java:2566)
>>        at org.apache.lucene.index.IndexWriter.commitInternal(IndexWriter.java:2639)
>>        at org.apache.lucene.index.IndexWriter.commit(IndexWriter.java:2621)
>>        at org.apache.lucene.index.IndexWriter.commit(IndexWriter.java:2605)
>>        at org.apache.lucene.index.TestCodecs.testSepPositionAfterMerge(TestCodecs.java:345)
>>
>>
>> REGRESSION:  org.apache.lucene.index.TestDirectoryReader.testIsCurrent
>>
>> Error Message:
>> Some threads threw uncaught exceptions!
>>
>> Stack Trace:
>> junit.framework.AssertionFailedError: Some threads threw uncaught exceptions!
>>        at org.apache.lucene.util.LuceneTestCase$LuceneTestCaseRunner.runChild(LuceneTestCase.java:1333)
>>        at org.apache.lucene.util.LuceneTestCase$LuceneTestCaseRunner.runChild(LuceneTestCase.java:1251)
>>        at org.apache.lucene.util.LuceneTestCase.tearDown(LuceneTestCase.java:591)
>>        at org.apache.lucene.index.TestDirectoryReader.tearDown(TestDirectoryReader.java:58)
>>
>>
>> REGRESSION:  org.apache.lucene.index.TestDoc.testIndexAndMerge
>>
>> Error Message:
>> separate norms file (.s*) is not allowed in .cfs: merge_0.sd
>>
>> Stack Trace:
>> junit.framework.AssertionFailedError: separate norms file (.s*) is not allowed in .cfs: merge_0.sd
>>        at org.apache.lucene.util.LuceneTestCase$LuceneTestCaseRunner.runChild(LuceneTestCase.java:1333)
>>        at org.apache.lucene.util.LuceneTestCase$LuceneTestCaseRunner.runChild(LuceneTestCase.java:1251)
>>        at org.apache.lucene.index.SegmentMerger.createCompoundFile(SegmentMerger.java:139)
>>        at org.apache.lucene.index.TestDoc.merge(TestDoc.java:211)
>>        at org.apache.lucene.index.TestDoc.testIndexAndMerge(TestDoc.java:165)
>>
>>
>> REGRESSION:  org.apache.lucene.index.TestGlobalFieldNumbers.testGlobalFieldNumberFiles
>>
>> Error Message:
>> background merge hit exception: _3(4.0):C2 _0(4.0):c1 into _4 [optimize]
>>
>> Stack Trace:
>> java.io.IOException: background merge hit exception: _3(4.0):C2 _0(4.0):c1 into _4 [optimize]
>>        at org.apache.lucene.index.IndexWriter.optimize(IndexWriter.java:1693)
>>        at org.apache.lucene.index.IndexWriter.optimize(IndexWriter.java:1631)
>>        at org.apache.lucene.index.IndexWriter.optimize(IndexWriter.java:1601)
>>        at org.apache.lucene.index.TestGlobalFieldNumbers.testGlobalFieldNumberFiles(TestGlobalFieldNumbers.java:106)
>>        at org.apache.lucene.util.LuceneTestCase$LuceneTestCaseRunner.runChild(LuceneTestCase.java:1333)
>>        at org.apache.lucene.util.LuceneTestCase$LuceneTestCaseRunner.runChild(LuceneTestCase.java:1251)
>>        at org.apache.lucene.index.SegmentMerger.createCompoundFile(SegmentMerger.java:139)
>>        at org.apache.lucene.index.IndexWriter.mergeMiddle(IndexWriter.java:3420)
>>        at org.apache.lucene.index.IndexWriter.merge(IndexWriter.java:3035)
>>        at org.apache.lucene.index.ConcurrentMergeScheduler.doMerge(ConcurrentMergeScheduler.java:379)
>>        at org.apache.lucene.index.ConcurrentMergeScheduler$MergeThread.run(ConcurrentMergeScheduler.java:447)
>>
>>
>> REGRESSION:  org.apache.lucene.index.TestGlobalFieldNumbers.testIndexReaderCommit
>>
>> Error Message:
>> separate norms file (.s*) is not allowed in .cfs: _3_1.skp
>>
>> Stack Trace:
>> junit.framework.AssertionFailedError: separate norms file (.s*) is not allowed in .cfs: _3_1.skp
>>        at org.apache.lucene.util.LuceneTestCase$LuceneTestCaseRunner.runChild(LuceneTestCase.java:1333)
>>        at org.apache.lucene.util.LuceneTestCase$LuceneTestCaseRunner.runChild(LuceneTestCase.java:1251)
>>        at org.apache.lucene.index.SegmentMerger.createCompoundFile(SegmentMerger.java:139)
>>        at org.apache.lucene.index.IndexWriter.mergeMiddle(IndexWriter.java:3420)
>>        at org.apache.lucene.index.IndexWriter.merge(IndexWriter.java:3035)
>>        at org.apache.lucene.index.SerialMergeScheduler.merge(SerialMergeScheduler.java:37)
>>        at org.apache.lucene.index.IndexWriter.maybeMerge(IndexWriter.java:1866)
>>        at org.apache.lucene.index.IndexWriter.optimize(IndexWriter.java:1676)
>>        at org.apache.lucene.index.IndexWriter.optimize(IndexWriter.java:1631)
>>        at org.apache.lucene.index.IndexWriter.optimize(IndexWriter.java:1601)
>>        at org.apache.lucene.index.TestGlobalFieldNumbers.testIndexReaderCommit(TestGlobalFieldNumbers.java:149)
>>
>>
>> REGRESSION:  org.apache.lucene.index.TestGlobalFieldNumbers.testGlobalFieldNumberFilesAcrossCommits
>>
>> Error Message:
>> separate norms file (.s*) is not allowed in .cfs: _4_1.skp
>>
>> Stack Trace:
>> junit.framework.AssertionFailedError: separate norms file (.s*) is not allowed in .cfs: _4_1.skp
>>        at org.apache.lucene.util.LuceneTestCase$LuceneTestCaseRunner.runChild(LuceneTestCase.java:1333)
>>        at org.apache.lucene.util.LuceneTestCase$LuceneTestCaseRunner.runChild(LuceneTestCase.java:1251)
>>        at org.apache.lucene.index.SegmentMerger.createCompoundFile(SegmentMerger.java:139)
>>        at org.apache.lucene.index.IndexWriter.mergeMiddle(IndexWriter.java:3420)
>>        at org.apache.lucene.index.IndexWriter.merge(IndexWriter.java:3035)
>>        at org.apache.lucene.index.SerialMergeScheduler.merge(SerialMergeScheduler.java:37)
>>        at org.apache.lucene.index.IndexWriter.maybeMerge(IndexWriter.java:1866)
>>        at org.apache.lucene.index.IndexWriter.maybeMerge(IndexWriter.java:1861)
>>        at org.apache.lucene.index.IndexWriter.maybeMerge(IndexWriter.java:1857)
>>        at org.apache.lucene.index.IndexWriter.flush(IndexWriter.java:2701)
>>        at org.apache.lucene.index.IndexWriter.closeInternal(IndexWriter.java:1048)
>>        at org.apache.lucene.index.IndexWriter.close(IndexWriter.java:1012)
>>        at org.apache.lucene.index.IndexWriter.close(IndexWriter.java:976)
>>        at org.apache.lucene.index.TestGlobalFieldNumbers.testGlobalFieldNumberFilesAcrossCommits(TestGlobalFieldNumbers.java:196)
>>
>>
>> REGRESSION:  org.apache.lucene.index.TestGlobalFieldNumbers.testOptimize
>>
>> Error Message:
>> separate norms file (.s*) is not allowed in .cfs: _3_4.skp
>>
>> Stack Trace:
>> junit.framework.AssertionFailedError: separate norms file (.s*) is not allowed in .cfs: _3_4.skp
>>        at org.apache.lucene.util.LuceneTestCase$LuceneTestCaseRunner.runChild(LuceneTestCase.java:1333)
>>        at org.apache.lucene.util.LuceneTestCase$LuceneTestCaseRunner.runChild(LuceneTestCase.java:1251)
>>        at org.apache.lucene.index.SegmentMerger.createCompoundFile(SegmentMerger.java:139)
>>        at org.apache.lucene.index.IndexWriter.mergeMiddle(IndexWriter.java:3420)
>>        at org.apache.lucene.index.IndexWriter.merge(IndexWriter.java:3035)
>>        at org.apache.lucene.index.SerialMergeScheduler.merge(SerialMergeScheduler.java:37)
>>        at org.apache.lucene.index.IndexWriter.maybeMerge(IndexWriter.java:1866)
>>        at org.apache.lucene.index.IndexWriter.optimize(IndexWriter.java:1676)
>>        at org.apache.lucene.index.IndexWriter.optimize(IndexWriter.java:1631)
>>        at org.apache.lucene.index.IndexWriter.optimize(IndexWriter.java:1601)
>>        at org.apache.lucene.index.TestGlobalFieldNumbers.testOptimize(TestGlobalFieldNumbers.java:299)
>>
>>
>> REGRESSION:  org.apache.lucene.index.TestIndexReader.testDocsOutOfOrderJIRA140
>>
>> Error Message:
>> separate norms file (.s*) is not allowed in .cfs: _2_0.skp
>>
>> Stack Trace:
>> junit.framework.AssertionFailedError: separate norms file (.s*) is not allowed in .cfs: _2_0.skp
>>        at org.apache.lucene.util.LuceneTestCase$LuceneTestCaseRunner.runChild(LuceneTestCase.java:1333)
>>        at org.apache.lucene.util.LuceneTestCase$LuceneTestCaseRunner.runChild(LuceneTestCase.java:1251)
>>        at org.apache.lucene.index.SegmentMerger.createCompoundFile(SegmentMerger.java:139)
>>        at org.apache.lucene.index.IndexWriter.mergeMiddle(IndexWriter.java:3420)
>>        at org.apache.lucene.index.IndexWriter.merge(IndexWriter.java:3035)
>>        at org.apache.lucene.index.SerialMergeScheduler.merge(SerialMergeScheduler.java:37)
>>        at org.apache.lucene.index.IndexWriter.maybeMerge(IndexWriter.java:1866)
>>        at org.apache.lucene.index.IndexWriter.optimize(IndexWriter.java:1676)
>>        at org.apache.lucene.index.IndexWriter.optimize(IndexWriter.java:1631)
>>        at org.apache.lucene.index.IndexWriter.optimize(IndexWriter.java:1601)
>>        at org.apache.lucene.index.TestIndexReader.testDocsOutOfOrderJIRA140(TestIndexReader.java:1099)
>>
>>
>> REGRESSION:  org.apache.lucene.index.TestIndexReaderClone.testReadOnlyCloneAfterOptimize
>>
>> Error Message:
>> separate norms file (.s*) is not allowed in .cfs: _c_3.skp
>>
>> Stack Trace:
>> junit.framework.AssertionFailedError: separate norms file (.s*) is not allowed in .cfs: _c_3.skp
>>        at org.apache.lucene.util.LuceneTestCase$LuceneTestCaseRunner.runChild(LuceneTestCase.java:1333)
>>        at org.apache.lucene.util.LuceneTestCase$LuceneTestCaseRunner.runChild(LuceneTestCase.java:1251)
>>        at org.apache.lucene.index.SegmentMerger.createCompoundFile(SegmentMerger.java:139)
>>        at org.apache.lucene.index.IndexWriter.mergeMiddle(IndexWriter.java:3420)
>>        at org.apache.lucene.index.IndexWriter.merge(IndexWriter.java:3035)
>>        at org.apache.lucene.index.SerialMergeScheduler.merge(SerialMergeScheduler.java:37)
>>        at org.apache.lucene.index.IndexWriter.maybeMerge(IndexWriter.java:1866)
>>        at org.apache.lucene.index.IndexWriter.optimize(IndexWriter.java:1676)
>>        at org.apache.lucene.index.IndexWriter.optimize(IndexWriter.java:1631)
>>        at org.apache.lucene.index.IndexWriter.optimize(IndexWriter.java:1601)
>>        at org.apache.lucene.index.TestIndexReaderClone.testReadOnlyCloneAfterOptimize(TestIndexReaderClone.java:203)
>>
>>
>> REGRESSION:  org.apache.lucene.index.TestIndexWriter.testOptimizeMaxNumSegments
>>
>> Error Message:
>> background merge hit exception: _3g(4.0):cv2 _3h(4.0):cv2 _3k(4.0):cv2 _3o(4.0):cv2 _3s(4.0):cv2 into _3w [optimize]
>>
>> Stack Trace:
>> java.io.IOException: background merge hit exception: _3g(4.0):cv2 _3h(4.0):cv2 _3k(4.0):cv2 _3o(4.0):cv2 _3s(4.0):cv2 into _3w [optimize]
>>        at org.apache.lucene.index.IndexWriter.optimize(IndexWriter.java:1693)
>>        at org.apache.lucene.index.IndexWriter.optimize(IndexWriter.java:1617)
>>        at org.apache.lucene.index.TestIndexWriter.testOptimizeMaxNumSegments(TestIndexWriter.java:195)
>>        at org.apache.lucene.util.LuceneTestCase$LuceneTestCaseRunner.runChild(LuceneTestCase.java:1333)
>>        at org.apache.lucene.util.LuceneTestCase$LuceneTestCaseRunner.runChild(LuceneTestCase.java:1251)
>>        at org.apache.lucene.index.SegmentMerger.createCompoundFile(SegmentMerger.java:139)
>>        at org.apache.lucene.index.IndexWriter.mergeMiddle(IndexWriter.java:3420)
>>        at org.apache.lucene.index.IndexWriter.merge(IndexWriter.java:3035)
>>        at org.apache.lucene.index.ConcurrentMergeScheduler.doMerge(ConcurrentMergeScheduler.java:379)
>>        at org.apache.lucene.index.ConcurrentMergeScheduler$MergeThread.run(ConcurrentMergeScheduler.java:447)
>>
>>
>> REGRESSION:  org.apache.lucene.index.TestIndexWriter.testOptimizeMaxNumSegments2
>>
>> Error Message:
>> background merge hit exception: _1j(4.0):cv2 _1k(4.0):cv2 _1n(4.0):cv2 _1p(4.0):cv2 into _21 [optimize]
>>
>> Stack Trace:
>> java.io.IOException: background merge hit exception: _1j(4.0):cv2 _1k(4.0):cv2 _1n(4.0):cv2 _1p(4.0):cv2 into _21 [optimize]
>>        at org.apache.lucene.index.IndexWriter.optimize(IndexWriter.java:1693)
>>        at org.apache.lucene.index.IndexWriter.optimize(IndexWriter.java:1617)
>>        at org.apache.lucene.index.TestIndexWriter.testOptimizeMaxNumSegments2(TestIndexWriter.java:236)
>>        at org.apache.lucene.util.LuceneTestCase$LuceneTestCaseRunner.runChild(LuceneTestCase.java:1333)
>>        at org.apache.lucene.util.LuceneTestCase$LuceneTestCaseRunner.runChild(LuceneTestCase.java:1251)
>>        at org.apache.lucene.index.SegmentMerger.createCompoundFile(SegmentMerger.java:139)
>>        at org.apache.lucene.index.IndexWriter.mergeMiddle(IndexWriter.java:3420)
>>        at org.apache.lucene.index.IndexWriter.merge(IndexWriter.java:3035)
>>        at org.apache.lucene.index.ConcurrentMergeScheduler.doMerge(ConcurrentMergeScheduler.java:379)
>>        at org.apache.lucene.index.ConcurrentMergeScheduler$MergeThread.run(ConcurrentMergeScheduler.java:447)
>>
>>
>> REGRESSION:  org.apache.lucene.index.TestIndexWriter.testCommitOnCloseAbort
>>
>> Error Message:
>> Some threads threw uncaught exceptions!
>>
>> Stack Trace:
>> junit.framework.AssertionFailedError: Some threads threw uncaught exceptions!
>>        at org.apache.lucene.util.LuceneTestCase$LuceneTestCaseRunner.runChild(LuceneTestCase.java:1333)
>>        at org.apache.lucene.util.LuceneTestCase$LuceneTestCaseRunner.runChild(LuceneTestCase.java:1251)
>>        at org.apache.lucene.util.LuceneTestCase.tearDown(LuceneTestCase.java:591)
>>
>>
>> REGRESSION:  org.apache.lucene.index.TestIndexWriter.testSetMaxMergeDocs
>>
>> Error Message:
>> separate norms file (.s*) is not allowed in .cfs: _16_0.skp
>>
>> Stack Trace:
>> junit.framework.AssertionFailedError: separate norms file (.s*) is not allowed in .cfs: _16_0.skp
>>        at org.apache.lucene.util.LuceneTestCase$LuceneTestCaseRunner.runChild(LuceneTestCase.java:1333)
>>        at org.apache.lucene.util.LuceneTestCase$LuceneTestCaseRunner.runChild(LuceneTestCase.java:1251)
>>        at org.apache.lucene.index.SegmentMerger.createCompoundFile(SegmentMerger.java:139)
>>        at org.apache.lucene.index.IndexWriter.mergeMiddle(IndexWriter.java:3420)
>>        at org.apache.lucene.index.IndexWriter.merge(IndexWriter.java:3035)
>>        at org.apache.lucene.index.TestIndexWriter$MyMergeScheduler.merge(TestIndexWriter.java:1139)
>>        at org.apache.lucene.index.IndexWriter.maybeMerge(IndexWriter.java:1866)
>>        at org.apache.lucene.index.IndexWriter.maybeMerge(IndexWriter.java:1861)
>>        at org.apache.lucene.index.IndexWriter.maybeMerge(IndexWriter.java:1857)
>>        at org.apache.lucene.index.IndexWriter.updateDocument(IndexWriter.java:1475)
>>        at org.apache.lucene.index.IndexWriter.addDocument(IndexWriter.java:1227)
>>        at org.apache.lucene.index.IndexWriter.addDocument(IndexWriter.java:1208)
>>        at org.apache.lucene.index.TestIndexWriter.testSetMaxMergeDocs(TestIndexWriter.java:1162)
>>
>>
>> REGRESSION:  org.apache.lucene.index.TestIndexWriter.testVariableSchema
>>
>> Error Message:
>> separate norms file (.s*) is not allowed in .cfs: _2_3.skp
>>
>> Stack Trace:
>> junit.framework.AssertionFailedError: separate norms file (.s*) is not allowed in .cfs: _2_3.skp
>>        at org.apache.lucene.util.LuceneTestCase$LuceneTestCaseRunner.runChild(LuceneTestCase.java:1333)
>>        at org.apache.lucene.util.LuceneTestCase$LuceneTestCaseRunner.runChild(LuceneTestCase.java:1251)
>>        at org.apache.lucene.index.SegmentMerger.createCompoundFile(SegmentMerger.java:139)
>>        at org.apache.lucene.index.IndexWriter.mergeMiddle(IndexWriter.java:3420)
>>        at org.apache.lucene.index.IndexWriter.merge(IndexWriter.java:3035)
>>        at org.apache.lucene.index.SerialMergeScheduler.merge(SerialMergeScheduler.java:37)
>>        at org.apache.lucene.index.IndexWriter.maybeMerge(IndexWriter.java:1866)
>>        at org.apache.lucene.index.IndexWriter.optimize(IndexWriter.java:1676)
>>        at org.apache.lucene.index.IndexWriter.optimize(IndexWriter.java:1631)
>>        at org.apache.lucene.index.IndexWriter.optimize(IndexWriter.java:1601)
>>        at org.apache.lucene.index.TestIndexWriter.testVariableSchema(TestIndexWriter.java:1216)
>>
>>
>> REGRESSION:  org.apache.lucene.index.TestIndexWriter.testExpungeDeletes2
>>
>> Error Message:
>> background merge hit exception: _0(4.0):Cv2/1 _1(4.0):Cv2/1 _2(4.0):Cv2/1 into _1d
>>
>> Stack Trace:
>> java.io.IOException: background merge hit exception: _0(4.0):Cv2/1 _1(4.0):Cv2/1 _2(4.0):Cv2/1 into _1d
>>        at org.apache.lucene.index.IndexWriter.expungeDeletes(IndexWriter.java:1794)
>>        at org.apache.lucene.index.IndexWriter.expungeDeletes(IndexWriter.java:1839)
>>        at org.apache.lucene.index.TestIndexWriter.testExpungeDeletes2(TestIndexWriter.java:1464)
>>        at org.apache.lucene.util.LuceneTestCase$LuceneTestCaseRunner.runChild(LuceneTestCase.java:1333)
>>        at org.apache.lucene.util.LuceneTestCase$LuceneTestCaseRunner.runChild(LuceneTestCase.java:1251)
>>        at org.apache.lucene.index.SegmentMerger.createCompoundFile(SegmentMerger.java:139)
>>        at org.apache.lucene.index.IndexWriter.mergeMiddle(IndexWriter.java:3420)
>>        at org.apache.lucene.index.IndexWriter.merge(IndexWriter.java:3035)
>>        at org.apache.lucene.index.ConcurrentMergeScheduler.doMerge(ConcurrentMergeScheduler.java:379)
>>        at org.apache.lucene.index.ConcurrentMergeScheduler$MergeThread.run(ConcurrentMergeScheduler.java:447)
>>
>>
>> REGRESSION:  org.apache.lucene.index.TestIndexWriter.testExpungeDeletes3
>>
>> Error Message:
>> separate norms file (.s*) is not allowed in .cfs: _1d_0.skp
>>
>> Stack Trace:
>> junit.framework.AssertionFailedError: separate norms file (.s*) is not allowed in .cfs: _1d_0.skp
>>        at org.apache.lucene.util.LuceneTestCase$LuceneTestCaseRunner.runChild(LuceneTestCase.java:1333)
>>        at org.apache.lucene.util.LuceneTestCase$LuceneTestCaseRunner.runChild(LuceneTestCase.java:1251)
>>        at org.apache.lucene.index.SegmentMerger.createCompoundFile(SegmentMerger.java:139)
>>        at org.apache.lucene.index.IndexWriter.mergeMiddle(IndexWriter.java:3420)
>>        at org.apache.lucene.index.IndexWriter.merge(IndexWriter.java:3035)
>>        at org.apache.lucene.index.SerialMergeScheduler.merge(SerialMergeScheduler.java:37)
>>        at org.apache.lucene.index.IndexWriter.expungeDeletes(IndexWriter.java:1772)
>>        at org.apache.lucene.index.TestIndexWriter.testExpungeDeletes3(TestIndexWriter.java:1512)
>>
>>
>> REGRESSION:  org.apache.lucene.index.TestIndexWriter.testCommitUserData
>>
>> Error Message:
>> Some threads threw uncaught exceptions!
>>
>> Stack Trace:
>> junit.framework.AssertionFailedError: Some threads threw uncaught exceptions!
>>        at org.apache.lucene.util.LuceneTestCase$LuceneTestCaseRunner.runChild(LuceneTestCase.java:1333)
>>        at org.apache.lucene.util.LuceneTestCase$LuceneTestCaseRunner.runChild(LuceneTestCase.java:1251)
>>        at org.apache.lucene.util.LuceneTestCase.tearDown(LuceneTestCase.java:591)
>>
>>
>> REGRESSION:  org.apache.lucene.index.TestIndexWriter.testIndexStoreCombos
>>
>> Error Message:
>> Some threads threw uncaught exceptions!
>>
>> Stack Trace:
>> junit.framework.AssertionFailedError: Some threads threw uncaught exceptions!
>>        at org.apache.lucene.util.LuceneTestCase$LuceneTestCaseRunner.runChild(LuceneTestCase.java:1333)
>>        at org.apache.lucene.util.LuceneTestCase$LuceneTestCaseRunner.runChild(LuceneTestCase.java:1251)
>>        at org.apache.lucene.util.LuceneTestCase.tearDown(LuceneTestCase.java:591)
>>
>>
>> REGRESSION:  org.apache.lucene.index.TestIndexWriter.testTermUTF16SortOrder
>>
>> Error Message:
>> background merge hit exception: _e(4.0):cv22 _f(4.0):cv20 into _j [optimize]
>>
>> Stack Trace:
>> java.io.IOException: background merge hit exception: _e(4.0):cv22 _f(4.0):cv20 into _j [optimize]
>>        at org.apache.lucene.index.IndexWriter.optimize(IndexWriter.java:1693)
>>        at org.apache.lucene.index.IndexWriter.optimize(IndexWriter.java:1631)
>>        at org.apache.lucene.index.IndexWriter.optimize(IndexWriter.java:1601)
>>        at org.apache.lucene.index.RandomIndexWriter.optimize(RandomIndexWriter.java:289)
>>        at org.apache.lucene.index.TestIndexWriter.testTermUTF16SortOrder(TestIndexWriter.java:2496)
>>        at org.apache.lucene.util.LuceneTestCase$LuceneTestCaseRunner.runChild(LuceneTestCase.java:1333)
>>        at org.apache.lucene.util.LuceneTestCase$LuceneTestCaseRunner.runChild(LuceneTestCase.java:1251)
>>        at org.apache.lucene.index.SegmentMerger.createCompoundFile(SegmentMerger.java:139)
>>        at org.apache.lucene.index.IndexWriter.mergeMiddle(IndexWriter.java:3420)
>>        at org.apache.lucene.index.IndexWriter.merge(IndexWriter.java:3035)
>>        at org.apache.lucene.index.ConcurrentMergeScheduler.doMerge(ConcurrentMergeScheduler.java:379)
>>        at org.apache.lucene.index.ConcurrentMergeScheduler$MergeThread.run(ConcurrentMergeScheduler.java:447)
>>
>>
>> REGRESSION:  org.apache.lucene.index.TestIndexWriterMergePolicy.testMaxBufferedDocsChange
>>
>> Error Message:
>> separate norms file (.s*) is not allowed in .cfs: _3g_0.skp
>>
>> Stack Trace:
>> junit.framework.AssertionFailedError: separate norms file (.s*) is not allowed in .cfs: _3g_0.skp
>>        at org.apache.lucene.util.LuceneTestCase$LuceneTestCaseRunner.runChild(LuceneTestCase.java:1333)
>>        at org.apache.lucene.util.LuceneTestCase$LuceneTestCaseRunner.runChild(LuceneTestCase.java:1251)
>>        at org.apache.lucene.index.SegmentMerger.createCompoundFile(SegmentMerger.java:139)
>>        at org.apache.lucene.index.IndexWriter.mergeMiddle(IndexWriter.java:3420)
>>        at org.apache.lucene.index.IndexWriter.merge(IndexWriter.java:3035)
>>        at org.apache.lucene.index.SerialMergeScheduler.merge(SerialMergeScheduler.java:37)
>>        at org.apache.lucene.index.IndexWriter.maybeMerge(IndexWriter.java:1866)
>>        at org.apache.lucene.index.IndexWriter.maybeMerge(IndexWriter.java:1861)
>>        at org.apache.lucene.index.IndexWriter.maybeMerge(IndexWriter.java:1857)
>>        at org.apache.lucene.index.IndexWriter.updateDocument(IndexWriter.java:1475)
>>        at org.apache.lucene.index.IndexWriter.addDocument(IndexWriter.java:1227)
>>        at org.apache.lucene.index.IndexWriter.addDocument(IndexWriter.java:1208)
>>        at org.apache.lucene.index.TestIndexWriterMergePolicy.addDoc(TestIndexWriterMergePolicy.java:221)
>>        at org.apache.lucene.index.TestIndexWriterMergePolicy.testMaxBufferedDocsChange(TestIndexWriterMergePolicy.java:167)
>>
>>
>> REGRESSION:  org.apache.lucene.index.TestIndexWriterReader.testAfterClose
>>
>> Error Message:
>> Some threads threw uncaught exceptions!
>>
>> Stack Trace:
>> junit.framework.AssertionFailedError: Some threads threw uncaught exceptions!
>>        at org.apache.lucene.util.LuceneTestCase$LuceneTestCaseRunner.runChild(LuceneTestCase.java:1333)
>>        at org.apache.lucene.util.LuceneTestCase$LuceneTestCaseRunner.runChild(LuceneTestCase.java:1251)
>>        at org.apache.lucene.util.LuceneTestCase.tearDown(LuceneTestCase.java:591)
>>
>>
>> REGRESSION:  org.apache.lucene.index.TestIndexWriterReader.testDuringAddIndexes
>>
>> Error Message:
>> expected:<0> but was:<5>
>>
>> Stack Trace:
>> junit.framework.AssertionFailedError: expected:<0> but was:<5>
>>        at org.apache.lucene.util.LuceneTestCase$LuceneTestCaseRunner.runChild(LuceneTestCase.java:1333)
>>        at org.apache.lucene.util.LuceneTestCase$LuceneTestCaseRunner.runChild(LuceneTestCase.java:1251)
>>        at org.apache.lucene.index.TestIndexWriterReader.testDuringAddIndexes(TestIndexWriterReader.java:818)
>>
>>
>> REGRESSION:  org.apache.lucene.index.TestLongPostings.testLongPostings
>>
>> Error Message:
>> separate norms file (.s*) is not allowed in .cfs: _m_0.skp
>>
>> Stack Trace:
>> junit.framework.AssertionFailedError: separate norms file (.s*) is not allowed in .cfs: _m_0.skp
>>        at org.apache.lucene.util.LuceneTestCase$LuceneTestCaseRunner.runChild(LuceneTestCase.java:1333)
>>        at org.apache.lucene.util.LuceneTestCase$LuceneTestCaseRunner.runChild(LuceneTestCase.java:1251)
>>        at org.apache.lucene.index.SegmentMerger.createCompoundFile(SegmentMerger.java:139)
>>        at org.apache.lucene.index.IndexWriter.mergeMiddle(IndexWriter.java:3420)
>>        at org.apache.lucene.index.IndexWriter.merge(IndexWriter.java:3035)
>>        at org.apache.lucene.index.SerialMergeScheduler.merge(SerialMergeScheduler.java:37)
>>        at org.apache.lucene.index.IndexWriter.maybeMerge(IndexWriter.java:1866)
>>        at org.apache.lucene.index.IndexWriter.maybeMerge(IndexWriter.java:1861)
>>        at org.apache.lucene.index.IndexWriter.maybeMerge(IndexWriter.java:1857)
>>        at org.apache.lucene.index.IndexWriter.flush(IndexWriter.java:2701)
>>        at org.apache.lucene.index.IndexWriter.prepareCommit(IndexWriter.java:2566)
>>        at org.apache.lucene.index.IndexWriter.commitInternal(IndexWriter.java:2639)
>>        at org.apache.lucene.index.IndexWriter.commit(IndexWriter.java:2621)
>>        at org.apache.lucene.index.IndexWriter.commit(IndexWriter.java:2605)
>>        at org.apache.lucene.index.RandomIndexWriter.maybeCommit(RandomIndexWriter.java:146)
>>        at org.apache.lucene.index.RandomIndexWriter.addDocument(RandomIndexWriter.java:138)
>>        at org.apache.lucene.index.TestLongPostings.testLongPostings(TestLongPostings.java:118)
>>
>>
>> REGRESSION:  org.apache.lucene.index.TestMultiFields.testSeparateEnums
>>
>> Error Message:
>> Some threads threw uncaught exceptions!
>>
>> Stack Trace:
>> junit.framework.AssertionFailedError: Some threads threw uncaught exceptions!
>>        at org.apache.lucene.util.LuceneTestCase$LuceneTestCaseRunner.runChild(LuceneTestCase.java:1333)
>>        at org.apache.lucene.util.LuceneTestCase$LuceneTestCaseRunner.runChild(LuceneTestCase.java:1251)
>>        at org.apache.lucene.util.LuceneTestCase.tearDown(LuceneTestCase.java:591)
>>
>>
>> REGRESSION:  org.apache.lucene.index.TestNRTThreads.testNRTThreads
>>
>> Error Message:
>> index=_z(4.0):Cv54 addCount=54 delCount=1 expected:<53> but was:<54>
>>
>> Stack Trace:
>> junit.framework.AssertionFailedError: index=_z(4.0):Cv54 addCount=54 delCount=1 expected:<53> but was:<54>
>>        at org.apache.lucene.util.LuceneTestCase$LuceneTestCaseRunner.runChild(LuceneTestCase.java:1333)
>>        at org.apache.lucene.util.LuceneTestCase$LuceneTestCaseRunner.runChild(LuceneTestCase.java:1251)
>>        at org.apache.lucene.index.TestNRTThreads.testNRTThreads(TestNRTThreads.java:560)
>>
>>
>> REGRESSION:  org.apache.lucene.index.TestRollback.testRollbackIntegrityWithBufferFlush
>>
>> Error Message:
>> separate norms file (.s*) is not allowed in .cfs: _4_1.skp
>>
>> Stack Trace:
>> junit.framework.AssertionFailedError: separate norms file (.s*) is not allowed in .cfs: _4_1.skp
>>        at org.apache.lucene.util.LuceneTestCase$LuceneTestCaseRunner.runChild(LuceneTestCase.java:1333)
>>        at org.apache.lucene.util.LuceneTestCase$LuceneTestCaseRunner.runChild(LuceneTestCase.java:1251)
>>        at org.apache.lucene.index.SegmentMerger.createCompoundFile(SegmentMerger.java:139)
>>        at org.apache.lucene.index.IndexWriter.mergeMiddle(IndexWriter.java:3420)
>>        at org.apache.lucene.index.IndexWriter.merge(IndexWriter.java:3035)
>>        at org.apache.lucene.index.SerialMergeScheduler.merge(SerialMergeScheduler.java:37)
>>        at org.apache.lucene.index.IndexWriter.maybeMerge(IndexWriter.java:1866)
>>        at org.apache.lucene.index.IndexWriter.maybeMerge(IndexWriter.java:1861)
>>        at org.apache.lucene.index.IndexWriter.maybeMerge(IndexWriter.java:1857)
>>        at org.apache.lucene.index.IndexWriter.updateDocument(IndexWriter.java:1475)
>>        at org.apache.lucene.index.IndexWriter.updateDocument(IndexWriter.java:1439)
>>        at org.apache.lucene.index.TestRollback.testRollbackIntegrityWithBufferFlush(TestRollback.java:49)
>>
>>
>> REGRESSION:  org.apache.lucene.index.TestSnapshotDeletionPolicy.testSnapshotDeletionPolicy
>>
>> Error Message:
>> Some threads threw uncaught exceptions!
>>
>> Stack Trace:
>> junit.framework.AssertionFailedError: Some threads threw uncaught exceptions!
>>        at org.apache.lucene.util.LuceneTestCase$LuceneTestCaseRunner.runChild(LuceneTestCase.java:1333)
>>        at org.apache.lucene.util.LuceneTestCase$LuceneTestCaseRunner.runChild(LuceneTestCase.java:1251)
>>        at org.apache.lucene.util.LuceneTestCase.tearDown(LuceneTestCase.java:591)
>>
>>
>> FAILED:  junit.framework.TestSuite.org.apache.lucene.search.TestBoolean2
>>
>> Error Message:
>> separate norms file (.s*) is not allowed in .cfs: _13_0.skp
>>
>> Stack Trace:
>> junit.framework.AssertionFailedError: separate norms file (.s*) is not allowed in .cfs: _13_0.skp
>>        at org.apache.lucene.index.SegmentMerger.createCompoundFile(SegmentMerger.java:139)
>>        at org.apache.lucene.index.IndexWriter.mergeMiddle(IndexWriter.java:3420)
>>        at org.apache.lucene.index.IndexWriter.merge(IndexWriter.java:3035)
>>        at org.apache.lucene.index.SerialMergeScheduler.merge(SerialMergeScheduler.java:37)
>>        at org.apache.lucene.index.IndexWriter.maybeMerge(IndexWriter.java:1866)
>>        at org.apache.lucene.index.IndexWriter.optimize(IndexWriter.java:1676)
>>        at org.apache.lucene.index.IndexWriter.optimize(IndexWriter.java:1631)
>>        at org.apache.lucene.index.IndexWriter.optimize(IndexWriter.java:1601)
>>        at org.apache.lucene.index.RandomIndexWriter.doRandomOptimize(RandomIndexWriter.java:237)
>>        at org.apache.lucene.index.RandomIndexWriter.close(RandomIndexWriter.java:276)
>>        at org.apache.lucene.search.TestBoolean2.beforeClass(TestBoolean2.java:77)
>>
>>
>> FAILED:  junit.framework.TestSuite.org.apache.lucene.search.TestBoolean2
>>
>> Error Message:
>> null
>>
>> Stack Trace:
>> java.lang.NullPointerException
>>        at org.apache.lucene.search.TestBoolean2.afterClass(TestBoolean2.java:102)
>>
>>
>> FAILED:  junit.framework.TestSuite.org.apache.lucene.search.TestBoolean2
>>
>> Error Message:
>> directory of test was not closed, opened from: org.apache.lucene.search.TestBoolean2.beforeClass(TestBoolean2.java:56)
>>
>> Stack Trace:
>> junit.framework.AssertionFailedError: directory of test was not closed, opened from: org.apache.lucene.search.TestBoolean2.beforeClass(TestBoolean2.java:56)
>>        at org.apache.lucene.util.LuceneTestCase.afterClassLuceneTestCaseJ4(LuceneTestCase.java:433)
>>
>>
>> FAILED:  junit.framework.TestSuite.org.apache.lucene.search.TestFieldCacheRangeFilter
>>
>> Error Message:
>> this writer hit an OutOfMemoryError; cannot commit
>>
>> Stack Trace:
>> java.lang.IllegalStateException: this writer hit an OutOfMemoryError; cannot commit
>>        at org.apache.lucene.index.IndexWriter.startCommit(IndexWriter.java:3637)
>>        at org.apache.lucene.index.IndexWriter.prepareCommit(IndexWriter.java:2568)
>>        at org.apache.lucene.index.IndexWriter.commitInternal(IndexWriter.java:2639)
>>        at org.apache.lucene.index.IndexWriter.commit(IndexWriter.java:2621)
>>        at org.apache.lucene.index.IndexWriter.commit(IndexWriter.java:2605)
>>        at org.apache.lucene.index.RandomIndexWriter.maybeCommit(RandomIndexWriter.java:146)
>>        at org.apache.lucene.index.RandomIndexWriter.addDocument(RandomIndexWriter.java:138)
>>        at org.apache.lucene.search.BaseTestRangeFilter.build(BaseTestRangeFilter.java:154)
>>        at org.apache.lucene.search.BaseTestRangeFilter.beforeClassBaseTestRangeFilter(BaseTestRangeFilter.java:98)
>>
>>
>> FAILED:  junit.framework.TestSuite.org.apache.lucene.search.TestFieldCacheRangeFilter
>>
>> Error Message:
>> null
>>
>> Stack Trace:
>> java.lang.NullPointerException
>>        at org.apache.lucene.search.BaseTestRangeFilter.afterClassBaseTestRangeFilter(BaseTestRangeFilter.java:104)
>>
>>
>> FAILED:  org.apache.lucene.search.TestFieldCacheTermsFilter.testMissingTerms
>>
>> Error Message:
>> Java heap space
>>
>> Stack Trace:
>> java.lang.OutOfMemoryError: Java heap space
>>
>>
>> FAILED:  TEST-org.apache.lucene.search.TestNumericRangeQuery64.xml.<init>
>>
>> Error Message:
>>
>>
>> Stack Trace:
>> Test report file /home/hudson/hudson-slave/workspace/Lucene-Solr-tests-only-trunk/checkout/lucene/build/test/TEST-org.apache.lucene.search.TestNumericRangeQuery64.xml was length 0
>>
>> FAILED:  org.apache.lucene.index.TestAtomicUpdate.testAtomicUpdates
>>
>> Error Message:
>> Some threads threw uncaught exceptions!
>>
>> Stack Trace:
>> junit.framework.AssertionFailedError: Some threads threw uncaught exceptions!
>>        at org.apache.lucene.util.LuceneTestCase$LuceneTestCaseRunner.runChild(LuceneTestCase.java:1333)
>>        at org.apache.lucene.util.LuceneTestCase$LuceneTestCaseRunner.runChild(LuceneTestCase.java:1251)
>>        at org.apache.lucene.util.LuceneTestCase.tearDown(LuceneTestCase.java:591)
>>
>>
>> FAILED:  org.apache.lucene.index.TestBackwardsCompatibility.testAddOldIndexesReader
>>
>> Error Message:
>> separate norms file (.s*) is not allowed in .cfs: _0_1.sd
>>
>> Stack Trace:
>> junit.framework.AssertionFailedError: separate norms file (.s*) is not allowed in .cfs: _0_1.sd
>>        at org.apache.lucene.util.LuceneTestCase$LuceneTestCaseRunner.runChild(LuceneTestCase.java:1333)
>>        at org.apache.lucene.util.LuceneTestCase$LuceneTestCaseRunner.runChild(LuceneTestCase.java:1251)
>>        at org.apache.lucene.index.SegmentMerger.createCompoundFile(SegmentMerger.java:139)
>>        at org.apache.lucene.index.IndexWriter.addIndexes(IndexWriter.java:2481)
>>        at org.apache.lucene.index.TestBackwardsCompatibility.testAddOldIndexesReader(TestBackwardsCompatibility.java:229)
>>
>>
>> FAILED:  org.apache.lucene.index.TestBackwardsCompatibility.testIndexOldIndexNoAdds
>>
>> Error Message:
>> background merge hit exception: _4(3.0):c1 _2(3.0):cv10->_0c+20 into _6 [optimize]
>>
>> Stack Trace:
>> java.io.IOException: background merge hit exception: _4(3.0):c1 _2(3.0):cv10->_0c+20 into _6 [optimize]
>>        at org.apache.lucene.index.IndexWriter.optimize(IndexWriter.java:1693)
>>        at org.apache.lucene.index.IndexWriter.optimize(IndexWriter.java:1631)
>>        at org.apache.lucene.index.IndexWriter.optimize(IndexWriter.java:1601)
>>        at org.apache.lucene.index.TestBackwardsCompatibility.changeIndexNoAdds(TestBackwardsCompatibility.java:444)
>>        at org.apache.lucene.index.TestBackwardsCompatibility.testIndexOldIndexNoAdds(TestBackwardsCompatibility.java:254)
>>        at org.apache.lucene.util.LuceneTestCase$LuceneTestCaseRunner.runChild(LuceneTestCase.java:1333)
>>        at org.apache.lucene.util.LuceneTestCase$LuceneTestCaseRunner.runChild(LuceneTestCase.java:1251)
>>        at org.apache.lucene.index.SegmentMerger.createCompoundFile(SegmentMerger.java:139)
>>        at org.apache.lucene.index.IndexWriter.mergeMiddle(IndexWriter.java:3420)
>>        at org.apache.lucene.index.IndexWriter.merge(IndexWriter.java:3035)
>>        at org.apache.lucene.index.ConcurrentMergeScheduler.doMerge(ConcurrentMergeScheduler.java:379)
>>        at org.apache.lucene.index.ConcurrentMergeScheduler$MergeThread.run(ConcurrentMergeScheduler.java:447)
>>
>>
>> FAILED:  org.apache.lucene.index.TestBackwardsCompatibility.testIndexOldIndex
>>
>> Error Message:
>> background merge hit exception: _2(3.0):cv10->_0c+20 _4(3.0):c1 _1(3.0):cv10->_0c+10 _5(4.0):cv10 _3(3.0):cv5->_0c+30 _0(3.0):cv10/2->_0c+0 into _6 [optimize]
>>
>> Stack Trace:
>> java.io.IOException: background merge hit exception: _2(3.0):cv10->_0c+20 _4(3.0):c1 _1(3.0):cv10->_0c+10 _5(4.0):cv10 _3(3.0):cv5->_0c+30 _0(3.0):cv10/2->_0c+0 into _6 [optimize]
>>        at org.apache.lucene.index.IndexWriter.optimize(IndexWriter.java:1693)
>>        at org.apache.lucene.index.IndexWriter.optimize(IndexWriter.java:1631)
>>        at org.apache.lucene.index.IndexWriter.optimize(IndexWriter.java:1601)
>>        at org.apache.lucene.index.TestBackwardsCompatibility.changeIndexWithAdds(TestBackwardsCompatibility.java:399)
>>        at org.apache.lucene.index.TestBackwardsCompatibility.testIndexOldIndex(TestBackwardsCompatibility.java:266)
>>        at org.apache.lucene.util.LuceneTestCase$LuceneTestCaseRunner.runChild(LuceneTestCase.java:1333)
>>        at org.apache.lucene.util.LuceneTestCase$LuceneTestCaseRunner.runChild(LuceneTestCase.java:1251)
>>        at org.apache.lucene.index.SegmentMerger.createCompoundFile(SegmentMerger.java:139)
>>        at org.apache.lucene.index.IndexWriter.mergeMiddle(IndexWriter.java:3420)
>>        at org.apache.lucene.index.IndexWriter.merge(IndexWriter.java:3035)
>>        at org.apache.lucene.index.ConcurrentMergeScheduler.doMerge(ConcurrentMergeScheduler.java:379)
>>        at org.apache.lucene.index.ConcurrentMergeScheduler$MergeThread.run(ConcurrentMergeScheduler.java:447)
>>
>>
>> FAILED:  org.apache.lucene.index.TestBackwardsCompatibility.testUpgradeOldIndex
>>
>> Error Message:
>> separate norms file (.s*) is not allowed in .cfs: _5_1.sd
>>
>> Stack Trace:
>> junit.framework.AssertionFailedError: separate norms file (.s*) is not allowed in .cfs: _5_1.sd
>>        at org.apache.lucene.util.LuceneTestCase$LuceneTestCaseRunner.runChild(LuceneTestCase.java:1333)
>>        at org.apache.lucene.util.LuceneTestCase$LuceneTestCaseRunner.runChild(LuceneTestCase.java:1251)
>>        at org.apache.lucene.index.SegmentMerger.createCompoundFile(SegmentMerger.java:139)
>>        at org.apache.lucene.index.IndexWriter.mergeMiddle(IndexWriter.java:3420)
>>        at org.apache.lucene.index.IndexWriter.merge(IndexWriter.java:3035)
>>        at org.apache.lucene.index.SerialMergeScheduler.merge(SerialMergeScheduler.java:37)
>>        at org.apache.lucene.index.IndexWriter.maybeMerge(IndexWriter.java:1866)
>>        at org.apache.lucene.index.IndexWriter.optimize(IndexWriter.java:1676)
>>        at org.apache.lucene.index.IndexWriter.optimize(IndexWriter.java:1631)
>>        at org.apache.lucene.index.IndexWriter.optimize(IndexWriter.java:1601)
>>        at org.apache.lucene.index.IndexUpgrader.upgrade(IndexUpgrader.java:136)
>>        at org.apache.lucene.index.TestBackwardsCompatibility.testUpgradeOldIndex(TestBackwardsCompatibility.java:742)
>>
>>
>> FAILED:  org.apache.lucene.index.TestBackwardsCompatibility.testUpgradeOldOptimizedIndexWithAdditions
>>
>> Error Message:
>> background merge hit exception: _4(3.1):Cv35 into _8 [optimize]
>>
>> Stack Trace:
>> java.io.IOException: background merge hit exception: _4(3.1):Cv35 into _8 [optimize]
>>        at org.apache.lucene.index.IndexWriter.optimize(IndexWriter.java:1693)
>>        at org.apache.lucene.index.IndexWriter.optimize(IndexWriter.java:1631)
>>        at org.apache.lucene.index.IndexWriter.optimize(IndexWriter.java:1601)
>>        at org.apache.lucene.index.IndexUpgrader.upgrade(IndexUpgrader.java:136)
>>        at org.apache.lucene.index.TestBackwardsCompatibility.testUpgradeOldOptimizedIndexWithAdditions(TestBackwardsCompatibility.java:793)
>>        at org.apache.lucene.util.LuceneTestCase$LuceneTestCaseRunner.runChild(LuceneTestCase.java:1333)
>>        at org.apache.lucene.util.LuceneTestCase$LuceneTestCaseRunner.runChild(LuceneTestCase.java:1251)
>>        at org.apache.lucene.index.SegmentMerger.createCompoundFile(SegmentMerger.java:139)
>>        at org.apache.lucene.index.IndexWriter.mergeMiddle(IndexWriter.java:3420)
>>        at org.apache.lucene.index.IndexWriter.merge(IndexWriter.java:3035)
>>        at org.apache.lucene.index.ConcurrentMergeScheduler.doMerge(ConcurrentMergeScheduler.java:379)
>>        at org.apache.lucene.index.ConcurrentMergeScheduler$MergeThread.run(ConcurrentMergeScheduler.java:447)
>>
>>
>> FAILED:  org.apache.lucene.index.TestFlushByRamOrCountsPolicy.testStallControl
>>
>> Error Message:
>> Some threads threw uncaught exceptions!
>>
>> Stack Trace:
>> junit.framework.AssertionFailedError: Some threads threw uncaught exceptions!
>>        at org.apache.lucene.util.LuceneTestCase$LuceneTestCaseRunner.runChild(LuceneTestCase.java:1333)
>>        at org.apache.lucene.util.LuceneTestCase$LuceneTestCaseRunner.runChild(LuceneTestCase.java:1251)
>>        at org.apache.lucene.util.LuceneTestCase.tearDown(LuceneTestCase.java:591)
>>
>>
>> FAILED:  org.apache.lucene.index.TestIndexReader.testCommitUserData
>>
>> Error Message:
>> Some threads threw uncaught exceptions!
>>
>> Stack Trace:
>> junit.framework.AssertionFailedError: Some threads threw uncaught exceptions!
>>        at org.apache.lucene.util.LuceneTestCase$LuceneTestCaseRunner.runChild(LuceneTestCase.java:1333)
>>        at org.apache.lucene.util.LuceneTestCase$LuceneTestCaseRunner.runChild(LuceneTestCase.java:1251)
>>        at org.apache.lucene.util.LuceneTestCase.tearDown(LuceneTestCase.java:591)
>>
>>
>> FAILED:  org.apache.lucene.index.TestIndexReader.testReadOnly
>>
>> Error Message:
>> background merge hit exception: _1(4.0):cv1 _0(4.0):cv1 _2(4.0):Cv1 into _3 [optimize]
>>
>> Stack Trace:
>> java.io.IOException: background merge hit exception: _1(4.0):cv1 _0(4.0):cv1 _2(4.0):Cv1 into _3 [optimize]
>>        at org.apache.lucene.index.IndexWriter.optimize(IndexWriter.java:1693)
>>        at org.apache.lucene.index.IndexWriter.optimize(IndexWriter.java:1631)
>>        at org.apache.lucene.index.IndexWriter.optimize(IndexWriter.java:1601)
>>        at org.apache.lucene.index.TestIndexReader.testReadOnly(TestIndexReader.java:1514)
>>        at org.apache.lucene.util.LuceneTestCase$LuceneTestCaseRunner.runChild(LuceneTestCase.java:1333)
>>        at org.apache.lucene.util.LuceneTestCase$LuceneTestCaseRunner.runChild(LuceneTestCase.java:1251)
>>        at org.apache.lucene.index.SegmentMerger.createCompoundFile(SegmentMerger.java:139)
>>        at org.apache.lucene.index.IndexWriter.mergeMiddle(IndexWriter.java:3420)
>>        at org.apache.lucene.index.IndexWriter.merge(IndexWriter.java:3035)
>>        at org.apache.lucene.index.ConcurrentMergeScheduler.doMerge(ConcurrentMergeScheduler.java:379)
>>        at org.apache.lucene.index.ConcurrentMergeScheduler$MergeThread.run(ConcurrentMergeScheduler.java:447)
>>
>>
>> FAILED:  org.apache.lucene.index.TestGlobalFieldNumbers.testAddIndexesStableFieldNumbers
>>
>> Error Message:
>> separate norms file (.s*) is not allowed in .cfs: _5_4.sd
>>
>> Stack Trace:
>> junit.framework.AssertionFailedError: separate norms file (.s*) is not allowed in .cfs: _5_4.sd
>>        at org.apache.lucene.util.LuceneTestCase$LuceneTestCaseRunner.runChild(LuceneTestCase.java:1333)
>>        at org.apache.lucene.util.LuceneTestCase$LuceneTestCaseRunner.runChild(LuceneTestCase.java:1251)
>>        at org.apache.lucene.index.SegmentMerger.createCompoundFile(SegmentMerger.java:139)
>>        at org.apache.lucene.index.IndexWriter.addIndexes(IndexWriter.java:2481)
>>        at org.apache.lucene.index.TestGlobalFieldNumbers.testAddIndexesStableFieldNumbers(TestGlobalFieldNumbers.java:347)
>>
>>
>> FAILED:  org.apache.lucene.index.TestConcurrentMergeScheduler.testNoExtraFiles
>>
>> Error Message:
>> Some threads threw uncaught exceptions!
>>
>> Stack Trace:
>> junit.framework.AssertionFailedError: Some threads threw uncaught exceptions!
>>        at org.apache.lucene.util.LuceneTestCase$LuceneTestCaseRunner.runChild(LuceneTestCase.java:1333)
>>        at org.apache.lucene.util.LuceneTestCase$LuceneTestCaseRunner.runChild(LuceneTestCase.java:1251)
>>        at org.apache.lucene.util.LuceneTestCase.tearDown(LuceneTestCase.java:591)
>>
>>
>>
>>
>> Build Log (for compile errors):
>> [...truncated 22447 lines...]
>>
>>
>>
>> ---------------------------------------------------------------------
>> To unsubscribe, e-mail: dev-unsubscribe@lucene.apache.org
>> For additional commands, e-mail: dev-help@lucene.apache.org
>>
>>
>

---------------------------------------------------------------------
To unsubscribe, e-mail: dev-unsubscribe@lucene.apache.org
For additional commands, e-mail: dev-help@lucene.apache.org


Mime
View raw message