lucene-dev mailing list archives

Site index · List index
Message view « Date » · « Thread »
Top « Date » · « Thread »
From Apache Jenkins Server <hud...@hudson.apache.org>
Subject [JENKINS] Lucene-trunk - Build # 1554 - Still Failing
Date Sat, 07 May 2011 02:54:07 GMT
Build: https://builds.apache.org/hudson/job/Lucene-trunk/1554/

27 tests failed.
FAILED:  org.apache.lucene.util.packed.TestPackedInts.testMultiValuedNRQ

Error Message:
Forked Java VM exited abnormally. Please note the time in the report does not reflect the
time until the VM exit.

Stack Trace:
junit.framework.AssertionFailedError: Forked Java VM exited abnormally. Please note the time
in the report does not reflect the time until the VM exit.


REGRESSION:  org.apache.lucene.index.TestNorms.testNorms

Error Message:
/usr/home/hudson/hudson-slave/workspace/Lucene-trunk/checkout/lucene/build/test/1/test2551710192098085700tmp/_1_2.sd
(Too many open files in system)

Stack Trace:
java.io.FileNotFoundException: /usr/home/hudson/hudson-slave/workspace/Lucene-trunk/checkout/lucene/build/test/1/test2551710192098085700tmp/_1_2.sd
(Too many open files in system)
	at java.io.RandomAccessFile.open(Native Method)
	at java.io.RandomAccessFile.<init>(RandomAccessFile.java:233)
	at org.apache.lucene.store.SimpleFSDirectory$SimpleFSIndexInput$Descriptor.<init>(SimpleFSDirectory.java:69)
	at org.apache.lucene.store.SimpleFSDirectory$SimpleFSIndexInput.<init>(SimpleFSDirectory.java:90)
	at org.apache.lucene.store.NIOFSDirectory$NIOFSIndexInput.<init>(NIOFSDirectory.java:91)
	at org.apache.lucene.store.NIOFSDirectory.openInput(NIOFSDirectory.java:78)
	at org.apache.lucene.store.FSDirectory.openInput(FSDirectory.java:345)
	at org.apache.lucene.store.MockDirectoryWrapper.openInput(MockDirectoryWrapper.java:380)
	at org.apache.lucene.index.codecs.mockrandom.MockRandomCodec.fieldsProducer(MockRandomCodec.java:233)
	at org.apache.lucene.index.PerFieldCodecWrapper$FieldsReader.<init>(PerFieldCodecWrapper.java:113)
	at org.apache.lucene.index.PerFieldCodecWrapper.fieldsProducer(PerFieldCodecWrapper.java:210)
	at org.apache.lucene.index.SegmentReader$CoreReaders.<init>(SegmentReader.java:130)
	at org.apache.lucene.index.SegmentReader.get(SegmentReader.java:493)
	at org.apache.lucene.index.IndexWriter$ReaderPool.get(IndexWriter.java:634)
	at org.apache.lucene.index.IndexWriter.mergeMiddle(IndexWriter.java:3283)
	at org.apache.lucene.index.IndexWriter.merge(IndexWriter.java:2960)
	at org.apache.lucene.index.SerialMergeScheduler.merge(SerialMergeScheduler.java:37)
	at org.apache.lucene.index.IndexWriter.maybeMerge(IndexWriter.java:1763)
	at org.apache.lucene.index.IndexWriter.optimize(IndexWriter.java:1573)
	at org.apache.lucene.index.IndexWriter.optimize(IndexWriter.java:1529)
	at org.apache.lucene.index.IndexWriter.optimize(IndexWriter.java:1499)
	at org.apache.lucene.index.TestNorms.testNorms(TestNorms.java:115)
	at org.apache.lucene.util.LuceneTestCase$LuceneTestCaseRunner.runChild(LuceneTestCase.java:1282)
	at org.apache.lucene.util.LuceneTestCase$LuceneTestCaseRunner.runChild(LuceneTestCase.java:1211)


REGRESSION:  org.apache.lucene.index.TestParallelReader.testDocument

Error Message:
/usr/home/hudson/hudson-slave/workspace/Lucene-trunk/checkout/lucene/build/test/1/test1544713647653435065tmp/_0.tvf
(Too many open files in system)

Stack Trace:
java.io.FileNotFoundException: /usr/home/hudson/hudson-slave/workspace/Lucene-trunk/checkout/lucene/build/test/1/test1544713647653435065tmp/_0.tvf
(Too many open files in system)
	at java.io.RandomAccessFile.open(Native Method)
	at java.io.RandomAccessFile.<init>(RandomAccessFile.java:233)
	at org.apache.lucene.store.FSDirectory$FSIndexOutput.<init>(FSDirectory.java:448)
	at org.apache.lucene.store.FSDirectory.createOutput(FSDirectory.java:312)
	at org.apache.lucene.store.MockDirectoryWrapper.createOutput(MockDirectoryWrapper.java:354)
	at org.apache.lucene.index.TermVectorsTermsWriter.initTermVectorsWriter(TermVectorsTermsWriter.java:100)
	at org.apache.lucene.index.TermVectorsTermsWriter.finishDocument(TermVectorsTermsWriter.java:119)
	at org.apache.lucene.index.TermsHash.finishDocument(TermsHash.java:141)
	at org.apache.lucene.index.DocInverter.finishDocument(DocInverter.java:94)
	at org.apache.lucene.index.DocFieldProcessor.finishDocument(DocFieldProcessor.java:259)
	at org.apache.lucene.index.DocumentsWriterPerThread.updateDocument(DocumentsWriterPerThread.java:245)
	at org.apache.lucene.index.DocumentsWriter.updateDocument(DocumentsWriter.java:327)
	at org.apache.lucene.index.IndexWriter.updateDocument(IndexWriter.java:1365)
	at org.apache.lucene.index.IndexWriter.addDocument(IndexWriter.java:1230)
	at org.apache.lucene.index.IndexWriter.addDocument(IndexWriter.java:1211)
	at org.apache.lucene.index.TestParallelReader.getDir1(TestParallelReader.java:281)
	at org.apache.lucene.index.TestParallelReader.testDocument(TestParallelReader.java:93)
	at org.apache.lucene.util.LuceneTestCase$LuceneTestCaseRunner.runChild(LuceneTestCase.java:1282)
	at org.apache.lucene.util.LuceneTestCase$LuceneTestCaseRunner.runChild(LuceneTestCase.java:1211)


REGRESSION:  org.apache.lucene.index.TestPerFieldCodecSupport.testMergeUnusedPerFieldCodec

Error Message:
/usr/home/hudson/hudson-slave/workspace/Lucene-trunk/checkout/lucene/build/test/1/test5033891002749939047tmp/_0.tvd
(Too many open files in system)

Stack Trace:
java.io.FileNotFoundException: /usr/home/hudson/hudson-slave/workspace/Lucene-trunk/checkout/lucene/build/test/1/test5033891002749939047tmp/_0.tvd
(Too many open files in system)
	at java.io.RandomAccessFile.open(Native Method)
	at java.io.RandomAccessFile.<init>(RandomAccessFile.java:233)
	at org.apache.lucene.store.FSDirectory$FSIndexOutput.<init>(FSDirectory.java:448)
	at org.apache.lucene.store.FSDirectory.createOutput(FSDirectory.java:312)
	at org.apache.lucene.store.MockDirectoryWrapper.createOutput(MockDirectoryWrapper.java:354)
	at org.apache.lucene.index.TermVectorsTermsWriter.initTermVectorsWriter(TermVectorsTermsWriter.java:99)
	at org.apache.lucene.index.TermVectorsTermsWriter.finishDocument(TermVectorsTermsWriter.java:119)
	at org.apache.lucene.index.TermsHash.finishDocument(TermsHash.java:141)
	at org.apache.lucene.index.DocInverter.finishDocument(DocInverter.java:94)
	at org.apache.lucene.index.DocFieldProcessor.finishDocument(DocFieldProcessor.java:259)
	at org.apache.lucene.index.DocumentsWriterPerThread.updateDocument(DocumentsWriterPerThread.java:245)
	at org.apache.lucene.index.DocumentsWriter.updateDocument(DocumentsWriter.java:327)
	at org.apache.lucene.index.IndexWriter.updateDocument(IndexWriter.java:1365)
	at org.apache.lucene.index.IndexWriter.addDocument(IndexWriter.java:1230)
	at org.apache.lucene.index.IndexWriter.addDocument(IndexWriter.java:1211)
	at org.apache.lucene.index.TestPerFieldCodecSupport.addDocs(TestPerFieldCodecSupport.java:67)
	at org.apache.lucene.index.TestPerFieldCodecSupport.testMergeUnusedPerFieldCodec(TestPerFieldCodecSupport.java:99)
	at org.apache.lucene.util.LuceneTestCase$LuceneTestCaseRunner.runChild(LuceneTestCase.java:1282)
	at org.apache.lucene.util.LuceneTestCase$LuceneTestCaseRunner.runChild(LuceneTestCase.java:1211)


REGRESSION:  org.apache.lucene.index.TestPerFieldCodecSupport.testChangeCodecAndMerge

Error Message:
/usr/home/hudson/hudson-slave/workspace/Lucene-trunk/checkout/lucene/build/test/1/test6811547522314104859tmp/_0.tvx
(Too many open files in system)

Stack Trace:
java.io.FileNotFoundException: /usr/home/hudson/hudson-slave/workspace/Lucene-trunk/checkout/lucene/build/test/1/test6811547522314104859tmp/_0.tvx
(Too many open files in system)
	at java.io.RandomAccessFile.open(Native Method)
	at java.io.RandomAccessFile.<init>(RandomAccessFile.java:233)
	at org.apache.lucene.store.FSDirectory$FSIndexOutput.<init>(FSDirectory.java:448)
	at org.apache.lucene.store.FSDirectory.createOutput(FSDirectory.java:312)
	at org.apache.lucene.store.MockDirectoryWrapper.createOutput(MockDirectoryWrapper.java:354)
	at org.apache.lucene.index.TermVectorsTermsWriter.initTermVectorsWriter(TermVectorsTermsWriter.java:98)
	at org.apache.lucene.index.TermVectorsTermsWriter.finishDocument(TermVectorsTermsWriter.java:119)
	at org.apache.lucene.index.TermsHash.finishDocument(TermsHash.java:141)
	at org.apache.lucene.index.DocInverter.finishDocument(DocInverter.java:94)
	at org.apache.lucene.index.DocFieldProcessor.finishDocument(DocFieldProcessor.java:259)
	at org.apache.lucene.index.DocumentsWriterPerThread.updateDocument(DocumentsWriterPerThread.java:245)
	at org.apache.lucene.index.DocumentsWriter.updateDocument(DocumentsWriter.java:327)
	at org.apache.lucene.index.IndexWriter.updateDocument(IndexWriter.java:1365)
	at org.apache.lucene.index.IndexWriter.addDocument(IndexWriter.java:1230)
	at org.apache.lucene.index.IndexWriter.addDocument(IndexWriter.java:1211)
	at org.apache.lucene.index.TestPerFieldCodecSupport.addDocs(TestPerFieldCodecSupport.java:67)
	at org.apache.lucene.index.TestPerFieldCodecSupport.testChangeCodecAndMerge(TestPerFieldCodecSupport.java:129)
	at org.apache.lucene.util.LuceneTestCase$LuceneTestCaseRunner.runChild(LuceneTestCase.java:1282)
	at org.apache.lucene.util.LuceneTestCase$LuceneTestCaseRunner.runChild(LuceneTestCase.java:1211)


REGRESSION:  org.apache.lucene.index.TestStressIndexing2.testRandomIWReader

Error Message:
/usr/home/hudson/hudson-slave/workspace/Lucene-trunk/checkout/lucene/build/test/1/test6535821180313062710tmp/_5.nrm
(Too many open files in system)

Stack Trace:
java.io.FileNotFoundException: /usr/home/hudson/hudson-slave/workspace/Lucene-trunk/checkout/lucene/build/test/1/test6535821180313062710tmp/_5.nrm
(Too many open files in system)
	at java.io.RandomAccessFile.open(Native Method)
	at java.io.RandomAccessFile.<init>(RandomAccessFile.java:233)
	at org.apache.lucene.store.SimpleFSDirectory$SimpleFSIndexInput$Descriptor.<init>(SimpleFSDirectory.java:69)
	at org.apache.lucene.store.SimpleFSDirectory$SimpleFSIndexInput.<init>(SimpleFSDirectory.java:90)
	at org.apache.lucene.store.NIOFSDirectory$NIOFSIndexInput.<init>(NIOFSDirectory.java:91)
	at org.apache.lucene.store.NIOFSDirectory.openInput(NIOFSDirectory.java:78)
	at org.apache.lucene.store.FSDirectory.openInput(FSDirectory.java:345)
	at org.apache.lucene.store.MockDirectoryWrapper.openInput(MockDirectoryWrapper.java:380)
	at org.apache.lucene.store.Directory.openInput(Directory.java:122)
	at org.apache.lucene.index.SegmentReader.openNorms(SegmentReader.java:979)
	at org.apache.lucene.index.SegmentReader.get(SegmentReader.java:498)
	at org.apache.lucene.index.IndexWriter$ReaderPool.get(IndexWriter.java:634)
	at org.apache.lucene.index.IndexWriter$ReaderPool.get(IndexWriter.java:609)
	at org.apache.lucene.index.BufferedDeletesStream.applyDeletes(BufferedDeletesStream.java:276)
	at org.apache.lucene.index.IndexWriter.applyAllDeletes(IndexWriter.java:2663)
	at org.apache.lucene.index.IndexWriter.maybeApplyDeletes(IndexWriter.java:2654)
	at org.apache.lucene.index.IndexWriter.getReader(IndexWriter.java:381)
	at org.apache.lucene.index.IndexWriter.getReader(IndexWriter.java:283)
	at org.apache.lucene.index.TestStressIndexing2.testRandomIWReader(TestStressIndexing2.java:67)
	at org.apache.lucene.util.LuceneTestCase$LuceneTestCaseRunner.runChild(LuceneTestCase.java:1282)
	at org.apache.lucene.util.LuceneTestCase$LuceneTestCaseRunner.runChild(LuceneTestCase.java:1211)


REGRESSION:  org.apache.lucene.index.TestStressIndexing2.testMultiConfig

Error Message:
/usr/home/hudson/hudson-slave/workspace/Lucene-trunk/checkout/lucene/build/test/1/test2530894527239657267tmp/1.fnx
(Too many open files in system)

Stack Trace:
java.io.FileNotFoundException: /usr/home/hudson/hudson-slave/workspace/Lucene-trunk/checkout/lucene/build/test/1/test2530894527239657267tmp/1.fnx
(Too many open files in system)
	at java.io.RandomAccessFile.open(Native Method)
	at java.io.RandomAccessFile.<init>(RandomAccessFile.java:233)
	at org.apache.lucene.store.FSDirectory$FSIndexOutput.<init>(FSDirectory.java:448)
	at org.apache.lucene.store.FSDirectory.createOutput(FSDirectory.java:312)
	at org.apache.lucene.store.MockDirectoryWrapper.createOutput(MockDirectoryWrapper.java:354)
	at org.apache.lucene.index.SegmentInfos.writeGlobalFieldMap(SegmentInfos.java:816)
	at org.apache.lucene.index.SegmentInfos.write(SegmentInfos.java:296)
	at org.apache.lucene.index.SegmentInfos.prepareCommit(SegmentInfos.java:812)
	at org.apache.lucene.index.IndexWriter.startCommit(IndexWriter.java:3622)
	at org.apache.lucene.index.IndexWriter.prepareCommit(IndexWriter.java:2467)
	at org.apache.lucene.index.IndexWriter.commitInternal(IndexWriter.java:2538)
	at org.apache.lucene.index.IndexWriter.closeInternal(IndexWriter.java:1072)
	at org.apache.lucene.index.IndexWriter.close(IndexWriter.java:1015)
	at org.apache.lucene.index.IndexWriter.close(IndexWriter.java:979)
	at org.apache.lucene.index.TestStressIndexing2.indexRandom(TestStressIndexing2.java:229)
	at org.apache.lucene.index.TestStressIndexing2.testMultiConfig(TestStressIndexing2.java:116)
	at org.apache.lucene.util.LuceneTestCase$LuceneTestCaseRunner.runChild(LuceneTestCase.java:1282)
	at org.apache.lucene.util.LuceneTestCase$LuceneTestCaseRunner.runChild(LuceneTestCase.java:1211)


REGRESSION:  org.apache.lucene.index.TestTieredMergePolicy.testPartialOptimize

Error Message:
/usr/home/hudson/hudson-slave/workspace/Lucene-trunk/checkout/lucene/build/test/1/test6939343383067909862tmp/_1_0.tib
(Too many open files in system)

Stack Trace:
java.io.FileNotFoundException: /usr/home/hudson/hudson-slave/workspace/Lucene-trunk/checkout/lucene/build/test/1/test6939343383067909862tmp/_1_0.tib
(Too many open files in system)
	at java.io.RandomAccessFile.open(Native Method)
	at java.io.RandomAccessFile.<init>(RandomAccessFile.java:233)
	at org.apache.lucene.store.SimpleFSDirectory$SimpleFSIndexInput$Descriptor.<init>(SimpleFSDirectory.java:69)
	at org.apache.lucene.store.SimpleFSDirectory$SimpleFSIndexInput.<init>(SimpleFSDirectory.java:90)
	at org.apache.lucene.store.SimpleFSDirectory.openInput(SimpleFSDirectory.java:56)
	at org.apache.lucene.store.FSDirectory.openInput(FSDirectory.java:345)
	at org.apache.lucene.store.MockDirectoryWrapper.openInput(MockDirectoryWrapper.java:380)
	at org.apache.lucene.store.Directory.openInput(Directory.java:122)
	at org.apache.lucene.index.codecs.BlockTermsReader.<init>(BlockTermsReader.java:118)
	at org.apache.lucene.index.codecs.mocksep.MockSepCodec.fieldsProducer(MockSepCodec.java:111)
	at org.apache.lucene.index.PerFieldCodecWrapper$FieldsReader.<init>(PerFieldCodecWrapper.java:113)
	at org.apache.lucene.index.PerFieldCodecWrapper.fieldsProducer(PerFieldCodecWrapper.java:210)
	at org.apache.lucene.index.SegmentReader$CoreReaders.<init>(SegmentReader.java:130)
	at org.apache.lucene.index.SegmentReader.get(SegmentReader.java:493)
	at org.apache.lucene.index.IndexWriter$ReaderPool.get(IndexWriter.java:634)
	at org.apache.lucene.index.IndexWriter.mergeMiddle(IndexWriter.java:3283)
	at org.apache.lucene.index.IndexWriter.merge(IndexWriter.java:2960)
	at org.apache.lucene.index.SerialMergeScheduler.merge(SerialMergeScheduler.java:37)
	at org.apache.lucene.index.IndexWriter.maybeMerge(IndexWriter.java:1763)
	at org.apache.lucene.index.IndexWriter.maybeMerge(IndexWriter.java:1758)
	at org.apache.lucene.index.IndexWriter.maybeMerge(IndexWriter.java:1754)
	at org.apache.lucene.index.IndexWriter.updateDocument(IndexWriter.java:1373)
	at org.apache.lucene.index.IndexWriter.addDocument(IndexWriter.java:1230)
	at org.apache.lucene.index.IndexWriter.addDocument(IndexWriter.java:1211)
	at org.apache.lucene.index.TestTieredMergePolicy.testPartialOptimize(TestTieredMergePolicy.java:89)
	at org.apache.lucene.util.LuceneTestCase$LuceneTestCaseRunner.runChild(LuceneTestCase.java:1282)
	at org.apache.lucene.util.LuceneTestCase$LuceneTestCaseRunner.runChild(LuceneTestCase.java:1211)


REGRESSION:  org.apache.lucene.index.codecs.preflex.TestSurrogates.testSurrogatesOrder

Error Message:
/usr/home/hudson/hudson-slave/workspace/Lucene-trunk/checkout/lucene/build/test/1/test1741190077465120676tmp/_0.tvd
(Too many open files in system)

Stack Trace:
java.io.FileNotFoundException: /usr/home/hudson/hudson-slave/workspace/Lucene-trunk/checkout/lucene/build/test/1/test1741190077465120676tmp/_0.tvd
(Too many open files in system)
	at java.io.RandomAccessFile.open(Native Method)
	at java.io.RandomAccessFile.<init>(RandomAccessFile.java:233)
	at org.apache.lucene.store.FSDirectory$FSIndexOutput.<init>(FSDirectory.java:448)
	at org.apache.lucene.store.FSDirectory.createOutput(FSDirectory.java:312)
	at org.apache.lucene.store.MockDirectoryWrapper.createOutput(MockDirectoryWrapper.java:354)
	at org.apache.lucene.index.TermVectorsTermsWriter.initTermVectorsWriter(TermVectorsTermsWriter.java:99)
	at org.apache.lucene.index.TermVectorsTermsWriter.finishDocument(TermVectorsTermsWriter.java:119)
	at org.apache.lucene.index.TermsHash.finishDocument(TermsHash.java:141)
	at org.apache.lucene.index.DocInverter.finishDocument(DocInverter.java:94)
	at org.apache.lucene.index.DocFieldProcessor.finishDocument(DocFieldProcessor.java:259)
	at org.apache.lucene.index.DocumentsWriterPerThread.updateDocument(DocumentsWriterPerThread.java:245)
	at org.apache.lucene.index.DocumentsWriter.updateDocument(DocumentsWriter.java:327)
	at org.apache.lucene.index.IndexWriter.updateDocument(IndexWriter.java:1365)
	at org.apache.lucene.index.IndexWriter.addDocument(IndexWriter.java:1230)
	at org.apache.lucene.index.IndexWriter.addDocument(IndexWriter.java:1211)
	at org.apache.lucene.index.RandomIndexWriter.addDocument(RandomIndexWriter.java:101)
	at org.apache.lucene.index.codecs.preflex.TestSurrogates.testSurrogatesOrder(TestSurrogates.java:300)
	at org.apache.lucene.util.LuceneTestCase$LuceneTestCaseRunner.runChild(LuceneTestCase.java:1282)
	at org.apache.lucene.util.LuceneTestCase$LuceneTestCaseRunner.runChild(LuceneTestCase.java:1211)


REGRESSION:  org.apache.lucene.queryParser.TestMultiFieldQueryParser.testSimple

Error Message:
org/apache/lucene/queryParser/MultiFieldQueryParser

Stack Trace:
java.lang.NoClassDefFoundError: org/apache/lucene/queryParser/MultiFieldQueryParser
	at org.apache.lucene.queryParser.TestMultiFieldQueryParser.testSimple(TestMultiFieldQueryParser.java:72)
	at org.apache.lucene.util.LuceneTestCase$LuceneTestCaseRunner.runChild(LuceneTestCase.java:1282)
	at org.apache.lucene.util.LuceneTestCase$LuceneTestCaseRunner.runChild(LuceneTestCase.java:1211)
Caused by: java.lang.ClassNotFoundException: org.apache.lucene.queryParser.MultiFieldQueryParser
	at java.net.URLClassLoader$1.run(URLClassLoader.java:214)
	at java.security.AccessController.doPrivileged(Native Method)
	at java.net.URLClassLoader.findClass(URLClassLoader.java:205)
	at java.lang.ClassLoader.loadClass(ClassLoader.java:321)
	at sun.misc.Launcher$AppClassLoader.loadClass(Launcher.java:294)
	at java.lang.ClassLoader.loadClass(ClassLoader.java:266)
Caused by: java.io.FileNotFoundException: /usr/home/hudson/hudson-slave/workspace/Lucene-trunk/checkout/lucene/build/classes/java/org/apache/lucene/queryParser/MultiFieldQueryParser.class
(Too many open files in system)
	at java.io.FileInputStream.open(Native Method)
	at java.io.FileInputStream.<init>(FileInputStream.java:137)
	at sun.misc.URLClassPath$FileLoader$1.getInputStream(URLClassPath.java:1005)
	at sun.misc.Resource.cachedInputStream(Resource.java:77)
	at sun.misc.Resource.getByteBuffer(Resource.java:160)
	at java.net.URLClassLoader.defineClass(URLClassLoader.java:266)
	at java.net.URLClassLoader.access$000(URLClassLoader.java:73)
	at java.net.URLClassLoader$1.run(URLClassLoader.java:212)


REGRESSION:  org.apache.lucene.queryParser.TestMultiFieldQueryParser.testStopwordsParsing

Error Message:
org/apache/lucene/queryParser/TestQueryParser$QPTestFilter

Stack Trace:
java.lang.NoClassDefFoundError: org/apache/lucene/queryParser/TestQueryParser$QPTestFilter
	at org.apache.lucene.queryParser.TestMultiFieldQueryParser.assertStopQueryEquals(TestMultiFieldQueryParser.java:60)
	at org.apache.lucene.queryParser.TestMultiFieldQueryParser.testStopwordsParsing(TestMultiFieldQueryParser.java:47)
	at org.apache.lucene.util.LuceneTestCase$LuceneTestCaseRunner.runChild(LuceneTestCase.java:1282)
	at org.apache.lucene.util.LuceneTestCase$LuceneTestCaseRunner.runChild(LuceneTestCase.java:1211)
Caused by: java.lang.ClassNotFoundException: org.apache.lucene.queryParser.TestQueryParser$QPTestFilter
	at java.net.URLClassLoader$1.run(URLClassLoader.java:214)
	at java.security.AccessController.doPrivileged(Native Method)
	at java.net.URLClassLoader.findClass(URLClassLoader.java:205)
	at java.lang.ClassLoader.loadClass(ClassLoader.java:321)
	at sun.misc.Launcher$AppClassLoader.loadClass(Launcher.java:294)
	at java.lang.ClassLoader.loadClass(ClassLoader.java:266)
Caused by: java.io.FileNotFoundException: /usr/home/hudson/hudson-slave/workspace/Lucene-trunk/checkout/lucene/build/classes/test/org/apache/lucene/queryParser/TestQueryParser$QPTestFilter.class
(Too many open files in system)
	at java.io.FileInputStream.open(Native Method)
	at java.io.FileInputStream.<init>(FileInputStream.java:137)
	at sun.misc.URLClassPath$FileLoader$1.getInputStream(URLClassPath.java:1005)
	at sun.misc.Resource.cachedInputStream(Resource.java:77)
	at sun.misc.Resource.getByteBuffer(Resource.java:160)
	at java.net.URLClassLoader.defineClass(URLClassLoader.java:266)
	at java.net.URLClassLoader.access$000(URLClassLoader.java:73)
	at java.net.URLClassLoader$1.run(URLClassLoader.java:212)


REGRESSION:  org.apache.lucene.queryParser.TestMultiFieldQueryParser.testBoostsSimple

Error Message:
org/apache/lucene/queryParser/MultiFieldQueryParser

Stack Trace:
java.lang.NoClassDefFoundError: org/apache/lucene/queryParser/MultiFieldQueryParser
	at org.apache.lucene.queryParser.TestMultiFieldQueryParser.testBoostsSimple(TestMultiFieldQueryParser.java:135)
	at org.apache.lucene.util.LuceneTestCase$LuceneTestCaseRunner.runChild(LuceneTestCase.java:1282)
	at org.apache.lucene.util.LuceneTestCase$LuceneTestCaseRunner.runChild(LuceneTestCase.java:1211)


REGRESSION:  org.apache.lucene.queryParser.TestMultiFieldQueryParser.testStaticMethod1

Error Message:
org/apache/lucene/queryParser/MultiFieldQueryParser

Stack Trace:
java.lang.NoClassDefFoundError: org/apache/lucene/queryParser/MultiFieldQueryParser
	at org.apache.lucene.queryParser.TestMultiFieldQueryParser.testStaticMethod1(TestMultiFieldQueryParser.java:161)
	at org.apache.lucene.util.LuceneTestCase$LuceneTestCaseRunner.runChild(LuceneTestCase.java:1282)
	at org.apache.lucene.util.LuceneTestCase$LuceneTestCaseRunner.runChild(LuceneTestCase.java:1211)


REGRESSION:  org.apache.lucene.queryParser.TestMultiFieldQueryParser.testStaticMethod2

Error Message:
org/apache/lucene/queryParser/MultiFieldQueryParser

Stack Trace:
java.lang.NoClassDefFoundError: org/apache/lucene/queryParser/MultiFieldQueryParser
	at org.apache.lucene.queryParser.TestMultiFieldQueryParser.testStaticMethod2(TestMultiFieldQueryParser.java:200)
	at org.apache.lucene.util.LuceneTestCase$LuceneTestCaseRunner.runChild(LuceneTestCase.java:1282)
	at org.apache.lucene.util.LuceneTestCase$LuceneTestCaseRunner.runChild(LuceneTestCase.java:1211)


REGRESSION:  org.apache.lucene.queryParser.TestMultiFieldQueryParser.testStaticMethod2Old

Error Message:
org/apache/lucene/queryParser/MultiFieldQueryParser

Stack Trace:
java.lang.NoClassDefFoundError: org/apache/lucene/queryParser/MultiFieldQueryParser
	at org.apache.lucene.queryParser.TestMultiFieldQueryParser.testStaticMethod2Old(TestMultiFieldQueryParser.java:220)
	at org.apache.lucene.util.LuceneTestCase$LuceneTestCaseRunner.runChild(LuceneTestCase.java:1282)
	at org.apache.lucene.util.LuceneTestCase$LuceneTestCaseRunner.runChild(LuceneTestCase.java:1211)


REGRESSION:  org.apache.lucene.queryParser.TestMultiFieldQueryParser.testStaticMethod3

Error Message:
org/apache/lucene/queryParser/MultiFieldQueryParser

Stack Trace:
java.lang.NoClassDefFoundError: org/apache/lucene/queryParser/MultiFieldQueryParser
	at org.apache.lucene.queryParser.TestMultiFieldQueryParser.testStaticMethod3(TestMultiFieldQueryParser.java:240)
	at org.apache.lucene.util.LuceneTestCase$LuceneTestCaseRunner.runChild(LuceneTestCase.java:1282)
	at org.apache.lucene.util.LuceneTestCase$LuceneTestCaseRunner.runChild(LuceneTestCase.java:1211)


REGRESSION:  org.apache.lucene.queryParser.TestMultiFieldQueryParser.testStaticMethod3Old

Error Message:
org/apache/lucene/queryParser/MultiFieldQueryParser

Stack Trace:
java.lang.NoClassDefFoundError: org/apache/lucene/queryParser/MultiFieldQueryParser
	at org.apache.lucene.queryParser.TestMultiFieldQueryParser.testStaticMethod3Old(TestMultiFieldQueryParser.java:256)
	at org.apache.lucene.util.LuceneTestCase$LuceneTestCaseRunner.runChild(LuceneTestCase.java:1282)
	at org.apache.lucene.util.LuceneTestCase$LuceneTestCaseRunner.runChild(LuceneTestCase.java:1211)


REGRESSION:  org.apache.lucene.queryParser.TestMultiFieldQueryParser.testAnalyzerReturningNull

Error Message:
org/apache/lucene/queryParser/MultiFieldQueryParser

Stack Trace:
java.lang.NoClassDefFoundError: org/apache/lucene/queryParser/MultiFieldQueryParser
	at org.apache.lucene.queryParser.TestMultiFieldQueryParser.testAnalyzerReturningNull(TestMultiFieldQueryParser.java:270)
	at org.apache.lucene.util.LuceneTestCase$LuceneTestCaseRunner.runChild(LuceneTestCase.java:1282)
	at org.apache.lucene.util.LuceneTestCase$LuceneTestCaseRunner.runChild(LuceneTestCase.java:1211)


REGRESSION:  org.apache.lucene.queryParser.TestMultiFieldQueryParser.testStopWordSearching

Error Message:
org/apache/lucene/queryParser/MultiFieldQueryParser

Stack Trace:
java.lang.NoClassDefFoundError: org/apache/lucene/queryParser/MultiFieldQueryParser
	at org.apache.lucene.queryParser.TestMultiFieldQueryParser.testStopWordSearching(TestMultiFieldQueryParser.java:291)
	at org.apache.lucene.util.LuceneTestCase$LuceneTestCaseRunner.runChild(LuceneTestCase.java:1282)
	at org.apache.lucene.util.LuceneTestCase$LuceneTestCaseRunner.runChild(LuceneTestCase.java:1211)


REGRESSION:  org.apache.lucene.search.TestDisjunctionMaxQuery.testSimpleEqualScores1

Error Message:
/usr/home/hudson/hudson-slave/workspace/Lucene-trunk/checkout/lucene/build/test/1/test4475098483435549231tmp/_0.nrm
(Too many open files in system)

Stack Trace:
java.io.FileNotFoundException: /usr/home/hudson/hudson-slave/workspace/Lucene-trunk/checkout/lucene/build/test/1/test4475098483435549231tmp/_0.nrm
(Too many open files in system)
	at java.io.RandomAccessFile.open(Native Method)
	at java.io.RandomAccessFile.<init>(RandomAccessFile.java:233)
	at org.apache.lucene.store.SimpleFSDirectory$SimpleFSIndexInput$Descriptor.<init>(SimpleFSDirectory.java:69)
	at org.apache.lucene.store.SimpleFSDirectory$SimpleFSIndexInput.<init>(SimpleFSDirectory.java:90)
	at org.apache.lucene.store.SimpleFSDirectory.openInput(SimpleFSDirectory.java:56)
	at org.apache.lucene.store.FSDirectory.openInput(FSDirectory.java:345)
	at org.apache.lucene.store.MockDirectoryWrapper.openInput(MockDirectoryWrapper.java:380)
	at org.apache.lucene.store.Directory.openInput(Directory.java:122)
	at org.apache.lucene.index.SegmentReader.openNorms(SegmentReader.java:979)
	at org.apache.lucene.index.SegmentReader.get(SegmentReader.java:498)
	at org.apache.lucene.index.SegmentReader.get(SegmentReader.java:470)
	at org.apache.lucene.index.DirectoryReader.<init>(DirectoryReader.java:123)
	at org.apache.lucene.index.DirectoryReader$1.doBody(DirectoryReader.java:89)
	at org.apache.lucene.index.SegmentInfos$FindSegmentsFile.run(SegmentInfos.java:685)
	at org.apache.lucene.index.DirectoryReader.open(DirectoryReader.java:84)
	at org.apache.lucene.index.IndexReader.open(IndexReader.java:500)
	at org.apache.lucene.index.IndexReader.open(IndexReader.java:459)
	at org.apache.lucene.index.RandomIndexWriter.getReader(RandomIndexWriter.java:187)
	at org.apache.lucene.index.RandomIndexWriter.getReader(RandomIndexWriter.java:153)
	at org.apache.lucene.search.TestDisjunctionMaxQuery.setUp(TestDisjunctionMaxQuery.java:155)
	at org.apache.lucene.util.LuceneTestCase$LuceneTestCaseRunner.runChild(LuceneTestCase.java:1282)
	at org.apache.lucene.util.LuceneTestCase$LuceneTestCaseRunner.runChild(LuceneTestCase.java:1211)


FAILED:  junit.framework.TestSuite.org.apache.lucene.search.TestDisjunctionMaxQuery

Error Message:
directory of test was not closed, opened from: org.apache.lucene.search.TestDisjunctionMaxQuery.setUp(TestDisjunctionMaxQuery.java:90)

Stack Trace:
junit.framework.AssertionFailedError: directory of test was not closed, opened from: org.apache.lucene.search.TestDisjunctionMaxQuery.setUp(TestDisjunctionMaxQuery.java:90)
	at org.apache.lucene.util.LuceneTestCase.afterClassLuceneTestCaseJ4(LuceneTestCase.java:417)


REGRESSION:  org.apache.lucene.search.TestFuzzyQuery.testFuzzinessLong

Error Message:
directory '/usr/home/hudson/hudson-slave/workspace/Lucene-trunk/checkout/lucene/build/test/1/test6311196841673286781tmp'
exists and is a directory, but cannot be listed: list() returned null

Stack Trace:
java.io.IOException: directory '/usr/home/hudson/hudson-slave/workspace/Lucene-trunk/checkout/lucene/build/test/1/test6311196841673286781tmp'
exists and is a directory, but cannot be listed: list() returned null
	at org.apache.lucene.store.FSDirectory.listAll(FSDirectory.java:239)
	at org.apache.lucene.store.FSDirectory.listAll(FSDirectory.java:250)
	at org.apache.lucene.store.MockDirectoryWrapper.listAll(MockDirectoryWrapper.java:525)
	at org.apache.lucene.index.IndexFileDeleter.<init>(IndexFileDeleter.java:152)
	at org.apache.lucene.index.IndexWriter.<init>(IndexWriter.java:830)
	at org.apache.lucene.index.RandomIndexWriter$MockIndexWriter.<init>(RandomIndexWriter.java:54)
	at org.apache.lucene.index.RandomIndexWriter.<init>(RandomIndexWriter.java:87)
	at org.apache.lucene.index.RandomIndexWriter.<init>(RandomIndexWriter.java:71)
	at org.apache.lucene.search.TestFuzzyQuery.testFuzzinessLong(TestFuzzyQuery.java:196)
	at org.apache.lucene.util.LuceneTestCase$LuceneTestCaseRunner.runChild(LuceneTestCase.java:1282)
	at org.apache.lucene.util.LuceneTestCase$LuceneTestCaseRunner.runChild(LuceneTestCase.java:1211)


REGRESSION:  org.apache.lucene.search.TestFuzzyQuery2.testFromTestData

Error Message:
null

Stack Trace:
java.lang.NullPointerException
	at java.io.Reader.<init>(Reader.java:78)
	at java.io.InputStreamReader.<init>(InputStreamReader.java:97)
	at org.apache.lucene.search.TestFuzzyQuery2.assertFromTestData(TestFuzzyQuery2.java:76)
	at org.apache.lucene.search.TestFuzzyQuery2.testFromTestData(TestFuzzyQuery2.java:63)
	at org.apache.lucene.util.LuceneTestCase$LuceneTestCaseRunner.runChild(LuceneTestCase.java:1282)
	at org.apache.lucene.util.LuceneTestCase$LuceneTestCaseRunner.runChild(LuceneTestCase.java:1211)


FAILED:  junit.framework.TestSuite.org.apache.lucene.search.TestMultiTermQueryRewrites

Error Message:
/usr/home/hudson/hudson-slave/workspace/Lucene-trunk/checkout/lucene/build/test/1/test7004477368734637911tmp/_0.tvd
(Too many open files in system)

Stack Trace:
java.io.FileNotFoundException: /usr/home/hudson/hudson-slave/workspace/Lucene-trunk/checkout/lucene/build/test/1/test7004477368734637911tmp/_0.tvd
(Too many open files in system)
	at java.io.RandomAccessFile.open(Native Method)
	at java.io.RandomAccessFile.<init>(RandomAccessFile.java:233)
	at org.apache.lucene.store.FSDirectory$FSIndexOutput.<init>(FSDirectory.java:448)
	at org.apache.lucene.store.FSDirectory.createOutput(FSDirectory.java:312)
	at org.apache.lucene.store.MockDirectoryWrapper.createOutput(MockDirectoryWrapper.java:354)
	at org.apache.lucene.index.TermVectorsTermsWriter.initTermVectorsWriter(TermVectorsTermsWriter.java:99)
	at org.apache.lucene.index.TermVectorsTermsWriter.finishDocument(TermVectorsTermsWriter.java:119)
	at org.apache.lucene.index.TermsHash.finishDocument(TermsHash.java:141)
	at org.apache.lucene.index.DocInverter.finishDocument(DocInverter.java:94)
	at org.apache.lucene.index.DocFieldProcessor.finishDocument(DocFieldProcessor.java:259)
	at org.apache.lucene.index.DocumentsWriterPerThread.updateDocument(DocumentsWriterPerThread.java:245)
	at org.apache.lucene.index.DocumentsWriter.updateDocument(DocumentsWriter.java:327)
	at org.apache.lucene.index.IndexWriter.updateDocument(IndexWriter.java:1365)
	at org.apache.lucene.index.IndexWriter.addDocument(IndexWriter.java:1230)
	at org.apache.lucene.index.IndexWriter.addDocument(IndexWriter.java:1211)
	at org.apache.lucene.index.RandomIndexWriter.addDocument(RandomIndexWriter.java:101)
	at org.apache.lucene.search.TestMultiTermQueryRewrites.beforeClass(TestMultiTermQueryRewrites.java:58)


FAILED:  junit.framework.TestSuite.org.apache.lucene.search.TestMultiTermQueryRewrites

Error Message:
null

Stack Trace:
java.lang.NullPointerException
	at org.apache.lucene.search.TestMultiTermQueryRewrites.afterClass(TestMultiTermQueryRewrites.java:79)


FAILED:  junit.framework.TestSuite.org.apache.lucene.search.TestMultiTermQueryRewrites

Error Message:
directory of test was not closed, opened from: org.apache.lucene.search.TestMultiTermQueryRewrites.beforeClass(TestMultiTermQueryRewrites.java:49)

Stack Trace:
junit.framework.AssertionFailedError: directory of test was not closed, opened from: org.apache.lucene.search.TestMultiTermQueryRewrites.beforeClass(TestMultiTermQueryRewrites.java:49)
	at org.apache.lucene.util.LuceneTestCase.afterClassLuceneTestCaseJ4(LuceneTestCase.java:417)


FAILED:  org.apache.lucene.index.TestNRTThreads.testNRTThreads

Error Message:
/usr/home/hudson/hudson-slave/workspace/Lucene-trunk/checkout/lucene/build/test/1/nrtopenfiles.2428840427209539239/_8t.tvd
(Too many open files in system)

Stack Trace:
java.io.FileNotFoundException: /usr/home/hudson/hudson-slave/workspace/Lucene-trunk/checkout/lucene/build/test/1/nrtopenfiles.2428840427209539239/_8t.tvd
(Too many open files in system)
	at java.io.RandomAccessFile.open(Native Method)
	at java.io.RandomAccessFile.<init>(RandomAccessFile.java:233)
	at org.apache.lucene.store.SimpleFSDirectory$SimpleFSIndexInput$Descriptor.<init>(SimpleFSDirectory.java:69)
	at org.apache.lucene.store.SimpleFSDirectory$SimpleFSIndexInput.<init>(SimpleFSDirectory.java:90)
	at org.apache.lucene.store.NIOFSDirectory$NIOFSIndexInput.<init>(NIOFSDirectory.java:91)
	at org.apache.lucene.store.NIOFSDirectory.openInput(NIOFSDirectory.java:78)
	at org.apache.lucene.store.FSDirectory.openInput(FSDirectory.java:345)
	at org.apache.lucene.store.MockDirectoryWrapper.openInput(MockDirectoryWrapper.java:380)
	at org.apache.lucene.store.Directory.openInput(Directory.java:122)
	at org.apache.lucene.index.TermVectorsReader.<init>(TermVectorsReader.java:83)
	at org.apache.lucene.index.SegmentReader$CoreReaders.openDocStores(SegmentReader.java:236)
	at org.apache.lucene.index.SegmentReader.get(SegmentReader.java:495)
	at org.apache.lucene.index.IndexWriter$ReaderPool.get(IndexWriter.java:634)
	at org.apache.lucene.index.IndexWriter$ReaderPool.getReadOnlyClone(IndexWriter.java:592)
	at org.apache.lucene.index.DirectoryReader.<init>(DirectoryReader.java:172)
	at org.apache.lucene.index.IndexWriter.getReader(IndexWriter.java:382)
	at org.apache.lucene.index.DirectoryReader.doReopenFromWriter(DirectoryReader.java:419)
	at org.apache.lucene.index.DirectoryReader.doReopen(DirectoryReader.java:432)
	at org.apache.lucene.index.DirectoryReader.reopen(DirectoryReader.java:392)
	at org.apache.lucene.index.TestNRTThreads.testNRTThreads(TestNRTThreads.java:213)
	at org.apache.lucene.util.LuceneTestCase$LuceneTestCaseRunner.runChild(LuceneTestCase.java:1282)
	at org.apache.lucene.util.LuceneTestCase$LuceneTestCaseRunner.runChild(LuceneTestCase.java:1211)




Build Log (for compile errors):
[...truncated 13057 lines...]



---------------------------------------------------------------------
To unsubscribe, e-mail: dev-unsubscribe@lucene.apache.org
For additional commands, e-mail: dev-help@lucene.apache.org


Mime
View raw message