lucene-dev mailing list archives

Site index · List index
Message view « Date » · « Thread »
Top « Date » · « Thread »
From Apache Jenkins Server <hud...@hudson.apache.org>
Subject [JENKINS] Lucene-Solr-tests-only-trunk - Build # 8376 - Still Failing
Date Wed, 25 May 2011 20:03:23 GMT
Build: https://builds.apache.org/hudson/job/Lucene-Solr-tests-only-trunk/8376/

44 tests failed.
REGRESSION:  org.apache.lucene.index.TestAtomicUpdate.testAtomicUpdates

Error Message:
Some threads threw uncaught exceptions!

Stack Trace:
junit.framework.AssertionFailedError: Some threads threw uncaught exceptions!
	at org.apache.lucene.util.LuceneTestCase$LuceneTestCaseRunner.runChild(LuceneTestCase.java:1333)
	at org.apache.lucene.util.LuceneTestCase$LuceneTestCaseRunner.runChild(LuceneTestCase.java:1251)
	at org.apache.lucene.util.LuceneTestCase.tearDown(LuceneTestCase.java:591)


REGRESSION:  org.apache.lucene.index.TestBackwardsCompatibility.testAddOldIndexesReader

Error Message:
separate norms file (.s*) is not allowed in .cfs: _0_5.skp

Stack Trace:
junit.framework.AssertionFailedError: separate norms file (.s*) is not allowed in .cfs: _0_5.skp
	at org.apache.lucene.util.LuceneTestCase$LuceneTestCaseRunner.runChild(LuceneTestCase.java:1333)
	at org.apache.lucene.util.LuceneTestCase$LuceneTestCaseRunner.runChild(LuceneTestCase.java:1251)
	at org.apache.lucene.index.SegmentMerger.createCompoundFile(SegmentMerger.java:139)
	at org.apache.lucene.index.IndexWriter.addIndexes(IndexWriter.java:2481)
	at org.apache.lucene.index.TestBackwardsCompatibility.testAddOldIndexesReader(TestBackwardsCompatibility.java:229)


REGRESSION:  org.apache.lucene.index.TestBackwardsCompatibility.testIndexOldIndexNoAdds

Error Message:
background merge hit exception: _5(4.0):Cv6 _1(3.0):Cv10->_0C+10 into _7 [optimize]

Stack Trace:
java.io.IOException: background merge hit exception: _5(4.0):Cv6 _1(3.0):Cv10->_0C+10 into
_7 [optimize]
	at org.apache.lucene.index.IndexWriter.optimize(IndexWriter.java:1693)
	at org.apache.lucene.index.IndexWriter.optimize(IndexWriter.java:1631)
	at org.apache.lucene.index.IndexWriter.optimize(IndexWriter.java:1601)
	at org.apache.lucene.index.TestBackwardsCompatibility.changeIndexNoAdds(TestBackwardsCompatibility.java:444)
	at org.apache.lucene.index.TestBackwardsCompatibility.testIndexOldIndexNoAdds(TestBackwardsCompatibility.java:254)
	at org.apache.lucene.util.LuceneTestCase$LuceneTestCaseRunner.runChild(LuceneTestCase.java:1333)
	at org.apache.lucene.util.LuceneTestCase$LuceneTestCaseRunner.runChild(LuceneTestCase.java:1251)
	at org.apache.lucene.index.SegmentMerger.createCompoundFile(SegmentMerger.java:139)
	at org.apache.lucene.index.IndexWriter.mergeMiddle(IndexWriter.java:3420)
	at org.apache.lucene.index.IndexWriter.merge(IndexWriter.java:3035)
	at org.apache.lucene.index.ConcurrentMergeScheduler.doMerge(ConcurrentMergeScheduler.java:379)
	at org.apache.lucene.index.ConcurrentMergeScheduler$MergeThread.run(ConcurrentMergeScheduler.java:447)


REGRESSION:  org.apache.lucene.index.TestBackwardsCompatibility.testUpgradeOldIndex

Error Message:
separate norms file (.s*) is not allowed in .cfs: _6_3.skp

Stack Trace:
junit.framework.AssertionFailedError: separate norms file (.s*) is not allowed in .cfs: _6_3.skp
	at org.apache.lucene.util.LuceneTestCase$LuceneTestCaseRunner.runChild(LuceneTestCase.java:1333)
	at org.apache.lucene.util.LuceneTestCase$LuceneTestCaseRunner.runChild(LuceneTestCase.java:1251)
	at org.apache.lucene.index.SegmentMerger.createCompoundFile(SegmentMerger.java:139)
	at org.apache.lucene.index.IndexWriter.mergeMiddle(IndexWriter.java:3420)
	at org.apache.lucene.index.IndexWriter.merge(IndexWriter.java:3035)
	at org.apache.lucene.index.SerialMergeScheduler.merge(SerialMergeScheduler.java:37)
	at org.apache.lucene.index.IndexWriter.closeInternal(IndexWriter.java:1054)
	at org.apache.lucene.index.IndexWriter.close(IndexWriter.java:1012)
	at org.apache.lucene.index.IndexWriter.close(IndexWriter.java:976)
	at org.apache.lucene.index.IndexUpgrader.upgrade(IndexUpgrader.java:139)
	at org.apache.lucene.index.TestBackwardsCompatibility.testUpgradeOldIndex(TestBackwardsCompatibility.java:742)


REGRESSION:  org.apache.lucene.index.TestBackwardsCompatibility.testUpgradeOldOptimizedIndexWithAdditions

Error Message:
separate norms file (.s*) is not allowed in .cfs: _8_5.sd

Stack Trace:
junit.framework.AssertionFailedError: separate norms file (.s*) is not allowed in .cfs: _8_5.sd
	at org.apache.lucene.util.LuceneTestCase$LuceneTestCaseRunner.runChild(LuceneTestCase.java:1333)
	at org.apache.lucene.util.LuceneTestCase$LuceneTestCaseRunner.runChild(LuceneTestCase.java:1251)
	at org.apache.lucene.index.SegmentMerger.createCompoundFile(SegmentMerger.java:139)
	at org.apache.lucene.index.IndexWriter.mergeMiddle(IndexWriter.java:3420)
	at org.apache.lucene.index.IndexWriter.merge(IndexWriter.java:3035)
	at org.apache.lucene.index.SerialMergeScheduler.merge(SerialMergeScheduler.java:37)
	at org.apache.lucene.index.IndexWriter.maybeMerge(IndexWriter.java:1866)
	at org.apache.lucene.index.IndexWriter.optimize(IndexWriter.java:1676)
	at org.apache.lucene.index.IndexWriter.optimize(IndexWriter.java:1631)
	at org.apache.lucene.index.IndexWriter.optimize(IndexWriter.java:1601)
	at org.apache.lucene.index.IndexUpgrader.upgrade(IndexUpgrader.java:136)
	at org.apache.lucene.index.TestBackwardsCompatibility.testUpgradeOldOptimizedIndexWithAdditions(TestBackwardsCompatibility.java:793)


REGRESSION:  org.apache.lucene.index.TestCheckIndex.testDeletedDocs

Error Message:
background merge hit exception: _2(4.0):cv2 into _d [optimize]

Stack Trace:
java.io.IOException: background merge hit exception: _2(4.0):cv2 into _d [optimize]
	at org.apache.lucene.index.IndexWriter.optimize(IndexWriter.java:1693)
	at org.apache.lucene.index.IndexWriter.optimize(IndexWriter.java:1631)
	at org.apache.lucene.index.IndexWriter.optimize(IndexWriter.java:1601)
	at org.apache.lucene.index.TestCheckIndex.testDeletedDocs(TestCheckIndex.java:43)
	at org.apache.lucene.util.LuceneTestCase$LuceneTestCaseRunner.runChild(LuceneTestCase.java:1333)
	at org.apache.lucene.util.LuceneTestCase$LuceneTestCaseRunner.runChild(LuceneTestCase.java:1251)
	at org.apache.lucene.index.SegmentMerger.createCompoundFile(SegmentMerger.java:139)
	at org.apache.lucene.index.IndexWriter.mergeMiddle(IndexWriter.java:3420)
	at org.apache.lucene.index.IndexWriter.merge(IndexWriter.java:3035)
	at org.apache.lucene.index.ConcurrentMergeScheduler.doMerge(ConcurrentMergeScheduler.java:379)
	at org.apache.lucene.index.ConcurrentMergeScheduler$MergeThread.run(ConcurrentMergeScheduler.java:447)


REGRESSION:  org.apache.lucene.index.TestCodecs.testSepPositionAfterMerge

Error Message:
separate norms file (.s*) is not allowed in .cfs: _2_0.skp

Stack Trace:
junit.framework.AssertionFailedError: separate norms file (.s*) is not allowed in .cfs: _2_0.skp
	at org.apache.lucene.util.LuceneTestCase$LuceneTestCaseRunner.runChild(LuceneTestCase.java:1333)
	at org.apache.lucene.util.LuceneTestCase$LuceneTestCaseRunner.runChild(LuceneTestCase.java:1251)
	at org.apache.lucene.index.SegmentMerger.createCompoundFile(SegmentMerger.java:139)
	at org.apache.lucene.index.IndexWriter.mergeMiddle(IndexWriter.java:3420)
	at org.apache.lucene.index.IndexWriter.merge(IndexWriter.java:3035)
	at org.apache.lucene.index.SerialMergeScheduler.merge(SerialMergeScheduler.java:37)
	at org.apache.lucene.index.IndexWriter.maybeMerge(IndexWriter.java:1866)
	at org.apache.lucene.index.IndexWriter.optimize(IndexWriter.java:1676)
	at org.apache.lucene.index.IndexWriter.optimize(IndexWriter.java:1631)
	at org.apache.lucene.index.IndexWriter.optimize(IndexWriter.java:1601)
	at org.apache.lucene.index.TestCodecs.testSepPositionAfterMerge(TestCodecs.java:352)


REGRESSION:  org.apache.lucene.index.TestConcurrentMergeScheduler.testNoExtraFiles

Error Message:
separate norms file (.s*) is not allowed in .cfs: _2_0.skp

Stack Trace:
junit.framework.AssertionFailedError: separate norms file (.s*) is not allowed in .cfs: _2_0.skp
	at org.apache.lucene.util.LuceneTestCase$LuceneTestCaseRunner.runChild(LuceneTestCase.java:1333)
	at org.apache.lucene.util.LuceneTestCase$LuceneTestCaseRunner.runChild(LuceneTestCase.java:1251)
	at org.apache.lucene.index.SegmentMerger.createCompoundFile(SegmentMerger.java:139)
	at org.apache.lucene.index.IndexWriter.mergeMiddle(IndexWriter.java:3420)
	at org.apache.lucene.index.IndexWriter.merge(IndexWriter.java:3035)
	at org.apache.lucene.index.SerialMergeScheduler.merge(SerialMergeScheduler.java:37)
	at org.apache.lucene.index.IndexWriter.maybeMerge(IndexWriter.java:1866)
	at org.apache.lucene.index.IndexWriter.maybeMerge(IndexWriter.java:1861)
	at org.apache.lucene.index.IndexWriter.maybeMerge(IndexWriter.java:1857)
	at org.apache.lucene.index.IndexWriter.updateDocument(IndexWriter.java:1475)
	at org.apache.lucene.index.IndexWriter.addDocument(IndexWriter.java:1227)
	at org.apache.lucene.index.IndexWriter.addDocument(IndexWriter.java:1208)
	at org.apache.lucene.index.TestConcurrentMergeScheduler.testNoExtraFiles(TestConcurrentMergeScheduler.java:184)


REGRESSION:  org.apache.lucene.index.TestDeletionPolicy.testKeepAllDeletionPolicy

Error Message:
separate norms file (.s*) is not allowed in .cfs: _a_0.skp

Stack Trace:
junit.framework.AssertionFailedError: separate norms file (.s*) is not allowed in .cfs: _a_0.skp
	at org.apache.lucene.util.LuceneTestCase$LuceneTestCaseRunner.runChild(LuceneTestCase.java:1333)
	at org.apache.lucene.util.LuceneTestCase$LuceneTestCaseRunner.runChild(LuceneTestCase.java:1251)
	at org.apache.lucene.index.SegmentMerger.createCompoundFile(SegmentMerger.java:139)
	at org.apache.lucene.index.IndexWriter.mergeMiddle(IndexWriter.java:3420)
	at org.apache.lucene.index.IndexWriter.merge(IndexWriter.java:3035)
	at org.apache.lucene.index.SerialMergeScheduler.merge(SerialMergeScheduler.java:37)
	at org.apache.lucene.index.IndexWriter.maybeMerge(IndexWriter.java:1866)
	at org.apache.lucene.index.IndexWriter.maybeMerge(IndexWriter.java:1861)
	at org.apache.lucene.index.IndexWriter.maybeMerge(IndexWriter.java:1857)
	at org.apache.lucene.index.IndexWriter.updateDocument(IndexWriter.java:1475)
	at org.apache.lucene.index.IndexWriter.addDocument(IndexWriter.java:1227)
	at org.apache.lucene.index.IndexWriter.addDocument(IndexWriter.java:1208)
	at org.apache.lucene.index.TestDeletionPolicy.addDoc(TestDeletionPolicy.java:845)
	at org.apache.lucene.index.TestDeletionPolicy.testKeepAllDeletionPolicy(TestDeletionPolicy.java:315)


REGRESSION:  org.apache.lucene.index.TestDeletionPolicy.testOpenPriorSnapshot

Error Message:
background merge hit exception: _3(4.0):Cv2 _2(4.0):Cv2 into _8 [optimize]

Stack Trace:
java.io.IOException: background merge hit exception: _3(4.0):Cv2 _2(4.0):Cv2 into _8 [optimize]
	at org.apache.lucene.index.IndexWriter.optimize(IndexWriter.java:1693)
	at org.apache.lucene.index.IndexWriter.optimize(IndexWriter.java:1631)
	at org.apache.lucene.index.IndexWriter.optimize(IndexWriter.java:1601)
	at org.apache.lucene.index.TestDeletionPolicy.testOpenPriorSnapshot(TestDeletionPolicy.java:462)
	at org.apache.lucene.util.LuceneTestCase$LuceneTestCaseRunner.runChild(LuceneTestCase.java:1333)
	at org.apache.lucene.util.LuceneTestCase$LuceneTestCaseRunner.runChild(LuceneTestCase.java:1251)
	at org.apache.lucene.index.SegmentMerger.createCompoundFile(SegmentMerger.java:139)
	at org.apache.lucene.index.IndexWriter.mergeMiddle(IndexWriter.java:3420)
	at org.apache.lucene.index.IndexWriter.merge(IndexWriter.java:3035)
	at org.apache.lucene.index.ConcurrentMergeScheduler.doMerge(ConcurrentMergeScheduler.java:379)
	at org.apache.lucene.index.ConcurrentMergeScheduler$MergeThread.run(ConcurrentMergeScheduler.java:447)


REGRESSION:  org.apache.lucene.index.TestDeletionPolicy.testKeepNoneOnInitDeletionPolicy

Error Message:
separate norms file (.s*) is not allowed in .cfs: _3_0.skp

Stack Trace:
junit.framework.AssertionFailedError: separate norms file (.s*) is not allowed in .cfs: _3_0.skp
	at org.apache.lucene.util.LuceneTestCase$LuceneTestCaseRunner.runChild(LuceneTestCase.java:1333)
	at org.apache.lucene.util.LuceneTestCase$LuceneTestCaseRunner.runChild(LuceneTestCase.java:1251)
	at org.apache.lucene.index.SegmentMerger.createCompoundFile(SegmentMerger.java:139)
	at org.apache.lucene.index.IndexWriter.mergeMiddle(IndexWriter.java:3420)
	at org.apache.lucene.index.IndexWriter.merge(IndexWriter.java:3035)
	at org.apache.lucene.index.SerialMergeScheduler.merge(SerialMergeScheduler.java:37)
	at org.apache.lucene.index.IndexWriter.maybeMerge(IndexWriter.java:1866)
	at org.apache.lucene.index.IndexWriter.maybeMerge(IndexWriter.java:1861)
	at org.apache.lucene.index.IndexWriter.maybeMerge(IndexWriter.java:1857)
	at org.apache.lucene.index.IndexWriter.updateDocument(IndexWriter.java:1475)
	at org.apache.lucene.index.IndexWriter.addDocument(IndexWriter.java:1227)
	at org.apache.lucene.index.IndexWriter.addDocument(IndexWriter.java:1208)
	at org.apache.lucene.index.TestDeletionPolicy.addDoc(TestDeletionPolicy.java:845)
	at org.apache.lucene.index.TestDeletionPolicy.testKeepNoneOnInitDeletionPolicy(TestDeletionPolicy.java:517)


REGRESSION:  org.apache.lucene.index.TestDeletionPolicy.testKeepLastNDeletionPolicy

Error Message:
background merge hit exception: _6(4.0):cv10 _7(4.0):cv7 into _8 [optimize]

Stack Trace:
java.io.IOException: background merge hit exception: _6(4.0):cv10 _7(4.0):cv7 into _8 [optimize]
	at org.apache.lucene.index.IndexWriter.optimize(IndexWriter.java:1693)
	at org.apache.lucene.index.IndexWriter.optimize(IndexWriter.java:1631)
	at org.apache.lucene.index.IndexWriter.optimize(IndexWriter.java:1601)
	at org.apache.lucene.index.TestDeletionPolicy.testKeepLastNDeletionPolicy(TestDeletionPolicy.java:572)
	at org.apache.lucene.util.LuceneTestCase$LuceneTestCaseRunner.runChild(LuceneTestCase.java:1333)
	at org.apache.lucene.util.LuceneTestCase$LuceneTestCaseRunner.runChild(LuceneTestCase.java:1251)
	at org.apache.lucene.index.SegmentMerger.createCompoundFile(SegmentMerger.java:139)
	at org.apache.lucene.index.IndexWriter.mergeMiddle(IndexWriter.java:3420)
	at org.apache.lucene.index.IndexWriter.merge(IndexWriter.java:3035)
	at org.apache.lucene.index.ConcurrentMergeScheduler.doMerge(ConcurrentMergeScheduler.java:379)
	at org.apache.lucene.index.ConcurrentMergeScheduler$MergeThread.run(ConcurrentMergeScheduler.java:447)


REGRESSION:  org.apache.lucene.index.TestIndexReader.testCommitUserData

Error Message:
separate norms file (.s*) is not allowed in .cfs: _9_1.skp

Stack Trace:
junit.framework.AssertionFailedError: separate norms file (.s*) is not allowed in .cfs: _9_1.skp
	at org.apache.lucene.util.LuceneTestCase$LuceneTestCaseRunner.runChild(LuceneTestCase.java:1333)
	at org.apache.lucene.util.LuceneTestCase$LuceneTestCaseRunner.runChild(LuceneTestCase.java:1251)
	at org.apache.lucene.index.SegmentMerger.createCompoundFile(SegmentMerger.java:139)
	at org.apache.lucene.index.IndexWriter.mergeMiddle(IndexWriter.java:3420)
	at org.apache.lucene.index.IndexWriter.merge(IndexWriter.java:3035)
	at org.apache.lucene.index.SerialMergeScheduler.merge(SerialMergeScheduler.java:37)
	at org.apache.lucene.index.IndexWriter.maybeMerge(IndexWriter.java:1866)
	at org.apache.lucene.index.IndexWriter.maybeMerge(IndexWriter.java:1861)
	at org.apache.lucene.index.IndexWriter.maybeMerge(IndexWriter.java:1857)
	at org.apache.lucene.index.IndexWriter.updateDocument(IndexWriter.java:1475)
	at org.apache.lucene.index.IndexWriter.addDocument(IndexWriter.java:1227)
	at org.apache.lucene.index.IndexWriter.addDocument(IndexWriter.java:1208)
	at org.apache.lucene.index.TestIndexReader.addDocumentWithFields(TestIndexReader.java:1297)
	at org.apache.lucene.index.TestIndexReader.testCommitUserData(TestIndexReader.java:75)


REGRESSION:  org.apache.lucene.index.TestIndexReader.testIsCurrent

Error Message:
Some threads threw uncaught exceptions!

Stack Trace:
junit.framework.AssertionFailedError: Some threads threw uncaught exceptions!
	at org.apache.lucene.util.LuceneTestCase$LuceneTestCaseRunner.runChild(LuceneTestCase.java:1333)
	at org.apache.lucene.util.LuceneTestCase$LuceneTestCaseRunner.runChild(LuceneTestCase.java:1251)
	at org.apache.lucene.util.LuceneTestCase.tearDown(LuceneTestCase.java:591)


REGRESSION:  org.apache.lucene.index.TestIndexWriter.testOptimizeTempSpaceUsage

Error Message:
separate norms file (.s*) is not allowed in .cfs: _1l_1.skp

Stack Trace:
junit.framework.AssertionFailedError: separate norms file (.s*) is not allowed in .cfs: _1l_1.skp
	at org.apache.lucene.util.LuceneTestCase$LuceneTestCaseRunner.runChild(LuceneTestCase.java:1333)
	at org.apache.lucene.util.LuceneTestCase$LuceneTestCaseRunner.runChild(LuceneTestCase.java:1251)
	at org.apache.lucene.index.SegmentMerger.createCompoundFile(SegmentMerger.java:139)
	at org.apache.lucene.index.IndexWriter.mergeMiddle(IndexWriter.java:3420)
	at org.apache.lucene.index.IndexWriter.merge(IndexWriter.java:3035)
	at org.apache.lucene.index.SerialMergeScheduler.merge(SerialMergeScheduler.java:37)
	at org.apache.lucene.index.IndexWriter.maybeMerge(IndexWriter.java:1866)
	at org.apache.lucene.index.IndexWriter.optimize(IndexWriter.java:1676)
	at org.apache.lucene.index.IndexWriter.optimize(IndexWriter.java:1631)
	at org.apache.lucene.index.IndexWriter.optimize(IndexWriter.java:1601)
	at org.apache.lucene.index.TestIndexWriter.testOptimizeTempSpaceUsage(TestIndexWriter.java:296)


REGRESSION:  org.apache.lucene.index.TestIndexWriter.testManyFields

Error Message:
Some threads threw uncaught exceptions!

Stack Trace:
junit.framework.AssertionFailedError: Some threads threw uncaught exceptions!
	at org.apache.lucene.util.LuceneTestCase$LuceneTestCaseRunner.runChild(LuceneTestCase.java:1333)
	at org.apache.lucene.util.LuceneTestCase$LuceneTestCaseRunner.runChild(LuceneTestCase.java:1251)
	at org.apache.lucene.util.LuceneTestCase.tearDown(LuceneTestCase.java:591)


REGRESSION:  org.apache.lucene.index.TestIndexWriter.testNoWaitClose

Error Message:
Some threads threw uncaught exceptions!

Stack Trace:
junit.framework.AssertionFailedError: Some threads threw uncaught exceptions!
	at org.apache.lucene.util.LuceneTestCase$LuceneTestCaseRunner.runChild(LuceneTestCase.java:1333)
	at org.apache.lucene.util.LuceneTestCase$LuceneTestCaseRunner.runChild(LuceneTestCase.java:1251)
	at org.apache.lucene.util.LuceneTestCase.tearDown(LuceneTestCase.java:591)


REGRESSION:  org.apache.lucene.index.TestIndexWriter.testExpungeDeletes

Error Message:
separate norms file (.s*) is not allowed in .cfs: _5_0.skp

Stack Trace:
junit.framework.AssertionFailedError: separate norms file (.s*) is not allowed in .cfs: _5_0.skp
	at org.apache.lucene.util.LuceneTestCase$LuceneTestCaseRunner.runChild(LuceneTestCase.java:1333)
	at org.apache.lucene.util.LuceneTestCase$LuceneTestCaseRunner.runChild(LuceneTestCase.java:1251)
	at org.apache.lucene.index.SegmentMerger.createCompoundFile(SegmentMerger.java:139)
	at org.apache.lucene.index.IndexWriter.mergeMiddle(IndexWriter.java:3420)
	at org.apache.lucene.index.IndexWriter.merge(IndexWriter.java:3035)
	at org.apache.lucene.index.SerialMergeScheduler.merge(SerialMergeScheduler.java:37)
	at org.apache.lucene.index.IndexWriter.maybeMerge(IndexWriter.java:1866)
	at org.apache.lucene.index.IndexWriter.maybeMerge(IndexWriter.java:1861)
	at org.apache.lucene.index.IndexWriter.maybeMerge(IndexWriter.java:1857)
	at org.apache.lucene.index.IndexWriter.updateDocument(IndexWriter.java:1475)
	at org.apache.lucene.index.IndexWriter.addDocument(IndexWriter.java:1227)
	at org.apache.lucene.index.IndexWriter.addDocument(IndexWriter.java:1208)
	at org.apache.lucene.index.TestIndexWriter.testExpungeDeletes(TestIndexWriter.java:1401)


REGRESSION:  org.apache.lucene.index.TestIndexWriter.testExpungeDeletes2

Error Message:
background merge hit exception: _0(4.0):Cv2/1 _1(4.0):Cv2/1 _2(4.0):Cv2/1 into _1d

Stack Trace:
java.io.IOException: background merge hit exception: _0(4.0):Cv2/1 _1(4.0):Cv2/1 _2(4.0):Cv2/1
into _1d
	at org.apache.lucene.index.IndexWriter.expungeDeletes(IndexWriter.java:1794)
	at org.apache.lucene.index.IndexWriter.expungeDeletes(IndexWriter.java:1839)
	at org.apache.lucene.index.TestIndexWriter.testExpungeDeletes2(TestIndexWriter.java:1464)
	at org.apache.lucene.util.LuceneTestCase$LuceneTestCaseRunner.runChild(LuceneTestCase.java:1333)
	at org.apache.lucene.util.LuceneTestCase$LuceneTestCaseRunner.runChild(LuceneTestCase.java:1251)
	at org.apache.lucene.index.SegmentMerger.createCompoundFile(SegmentMerger.java:139)
	at org.apache.lucene.index.IndexWriter.mergeMiddle(IndexWriter.java:3420)
	at org.apache.lucene.index.IndexWriter.merge(IndexWriter.java:3035)
	at org.apache.lucene.index.ConcurrentMergeScheduler.doMerge(ConcurrentMergeScheduler.java:379)
	at org.apache.lucene.index.ConcurrentMergeScheduler$MergeThread.run(ConcurrentMergeScheduler.java:447)


REGRESSION:  org.apache.lucene.index.TestIndexWriter.testRandomStoredFields

Error Message:
separate norms file (.s*) is not allowed in .cfs: _t_0.skp

Stack Trace:
junit.framework.AssertionFailedError: separate norms file (.s*) is not allowed in .cfs: _t_0.skp
	at org.apache.lucene.util.LuceneTestCase$LuceneTestCaseRunner.runChild(LuceneTestCase.java:1333)
	at org.apache.lucene.util.LuceneTestCase$LuceneTestCaseRunner.runChild(LuceneTestCase.java:1251)
	at org.apache.lucene.index.SegmentMerger.createCompoundFile(SegmentMerger.java:139)
	at org.apache.lucene.index.IndexWriter.mergeMiddle(IndexWriter.java:3420)
	at org.apache.lucene.index.IndexWriter.merge(IndexWriter.java:3035)
	at org.apache.lucene.index.SerialMergeScheduler.merge(SerialMergeScheduler.java:37)
	at org.apache.lucene.index.IndexWriter.maybeMerge(IndexWriter.java:1866)
	at org.apache.lucene.index.IndexWriter.maybeMerge(IndexWriter.java:1861)
	at org.apache.lucene.index.IndexWriter.maybeMerge(IndexWriter.java:1857)
	at org.apache.lucene.index.IndexWriter.updateDocument(IndexWriter.java:1475)
	at org.apache.lucene.index.IndexWriter.addDocument(IndexWriter.java:1227)
	at org.apache.lucene.index.IndexWriter.addDocument(IndexWriter.java:1208)
	at org.apache.lucene.index.RandomIndexWriter.addDocument(RandomIndexWriter.java:136)
	at org.apache.lucene.index.TestIndexWriter.testRandomStoredFields(TestIndexWriter.java:2895)


REGRESSION:  org.apache.lucene.index.TestIndexWriterExceptions.testDocumentsWriterExceptions

Error Message:
separate norms file (.s*) is not allowed in .cfs: _3_0.skp

Stack Trace:
junit.framework.AssertionFailedError: separate norms file (.s*) is not allowed in .cfs: _3_0.skp
	at org.apache.lucene.util.LuceneTestCase$LuceneTestCaseRunner.runChild(LuceneTestCase.java:1333)
	at org.apache.lucene.util.LuceneTestCase$LuceneTestCaseRunner.runChild(LuceneTestCase.java:1251)
	at org.apache.lucene.index.SegmentMerger.createCompoundFile(SegmentMerger.java:139)
	at org.apache.lucene.index.IndexWriter.mergeMiddle(IndexWriter.java:3420)
	at org.apache.lucene.index.IndexWriter.merge(IndexWriter.java:3035)
	at org.apache.lucene.index.SerialMergeScheduler.merge(SerialMergeScheduler.java:37)
	at org.apache.lucene.index.IndexWriter.maybeMerge(IndexWriter.java:1866)
	at org.apache.lucene.index.IndexWriter.optimize(IndexWriter.java:1676)
	at org.apache.lucene.index.IndexWriter.optimize(IndexWriter.java:1631)
	at org.apache.lucene.index.IndexWriter.optimize(IndexWriter.java:1601)
	at org.apache.lucene.index.TestIndexWriterExceptions.testDocumentsWriterExceptions(TestIndexWriterExceptions.java:651)


REGRESSION:  org.apache.lucene.index.TestIndexWriterExceptions.testDocumentsWriterExceptionThreads

Error Message:
background merge hit exception: _3(4.0):cv7 _1(4.0):Cv598/118 _0(4.0):Cv902/182 into _4 [optimize]

Stack Trace:
java.io.IOException: background merge hit exception: _3(4.0):cv7 _1(4.0):Cv598/118 _0(4.0):Cv902/182
into _4 [optimize]
	at org.apache.lucene.index.IndexWriter.optimize(IndexWriter.java:1693)
	at org.apache.lucene.index.IndexWriter.optimize(IndexWriter.java:1631)
	at org.apache.lucene.index.IndexWriter.optimize(IndexWriter.java:1601)
	at org.apache.lucene.index.TestIndexWriterExceptions.testDocumentsWriterExceptionThreads(TestIndexWriterExceptions.java:770)
	at org.apache.lucene.util.LuceneTestCase$LuceneTestCaseRunner.runChild(LuceneTestCase.java:1333)
	at org.apache.lucene.util.LuceneTestCase$LuceneTestCaseRunner.runChild(LuceneTestCase.java:1251)
	at org.apache.lucene.index.SegmentMerger.createCompoundFile(SegmentMerger.java:139)
	at org.apache.lucene.index.IndexWriter.mergeMiddle(IndexWriter.java:3420)
	at org.apache.lucene.index.IndexWriter.merge(IndexWriter.java:3035)
	at org.apache.lucene.index.ConcurrentMergeScheduler.doMerge(ConcurrentMergeScheduler.java:379)
	at org.apache.lucene.index.ConcurrentMergeScheduler$MergeThread.run(ConcurrentMergeScheduler.java:447)


REGRESSION:  org.apache.lucene.index.TestIndexWriterMergePolicy.testMaxBufferedDocsChange

Error Message:
separate norms file (.s*) is not allowed in .cfs: _3g_0.sd

Stack Trace:
junit.framework.AssertionFailedError: separate norms file (.s*) is not allowed in .cfs: _3g_0.sd
	at org.apache.lucene.util.LuceneTestCase$LuceneTestCaseRunner.runChild(LuceneTestCase.java:1333)
	at org.apache.lucene.util.LuceneTestCase$LuceneTestCaseRunner.runChild(LuceneTestCase.java:1251)
	at org.apache.lucene.index.SegmentMerger.createCompoundFile(SegmentMerger.java:139)
	at org.apache.lucene.index.IndexWriter.mergeMiddle(IndexWriter.java:3420)
	at org.apache.lucene.index.IndexWriter.merge(IndexWriter.java:3035)
	at org.apache.lucene.index.SerialMergeScheduler.merge(SerialMergeScheduler.java:37)
	at org.apache.lucene.index.IndexWriter.maybeMerge(IndexWriter.java:1866)
	at org.apache.lucene.index.IndexWriter.maybeMerge(IndexWriter.java:1861)
	at org.apache.lucene.index.IndexWriter.maybeMerge(IndexWriter.java:1857)
	at org.apache.lucene.index.IndexWriter.updateDocument(IndexWriter.java:1475)
	at org.apache.lucene.index.IndexWriter.addDocument(IndexWriter.java:1227)
	at org.apache.lucene.index.IndexWriter.addDocument(IndexWriter.java:1208)
	at org.apache.lucene.index.TestIndexWriterMergePolicy.addDoc(TestIndexWriterMergePolicy.java:221)
	at org.apache.lucene.index.TestIndexWriterMergePolicy.testMaxBufferedDocsChange(TestIndexWriterMergePolicy.java:167)


REGRESSION:  org.apache.lucene.index.TestIndexWriterOnDiskFull.testAddIndexOnDiskFull

Error Message:
addIndexes(Directory[]) + optimize() hit IOException after disk space was freed up

Stack Trace:
junit.framework.AssertionFailedError: addIndexes(Directory[]) + optimize() hit IOException
after disk space was freed up
	at org.apache.lucene.util.LuceneTestCase$LuceneTestCaseRunner.runChild(LuceneTestCase.java:1333)
	at org.apache.lucene.util.LuceneTestCase$LuceneTestCaseRunner.runChild(LuceneTestCase.java:1251)
	at org.apache.lucene.index.TestIndexWriterOnDiskFull.testAddIndexOnDiskFull(TestIndexWriterOnDiskFull.java:327)


REGRESSION:  org.apache.lucene.index.TestRollingUpdates.testRollingUpdates

Error Message:
Some threads threw uncaught exceptions!

Stack Trace:
junit.framework.AssertionFailedError: Some threads threw uncaught exceptions!
	at org.apache.lucene.util.LuceneTestCase$LuceneTestCaseRunner.runChild(LuceneTestCase.java:1333)
	at org.apache.lucene.util.LuceneTestCase$LuceneTestCaseRunner.runChild(LuceneTestCase.java:1251)
	at org.apache.lucene.util.LuceneTestCase.tearDown(LuceneTestCase.java:591)


REGRESSION:  org.apache.lucene.index.TestRollingUpdates.testUpdateSameDoc

Error Message:
Some threads threw uncaught exceptions!

Stack Trace:
junit.framework.AssertionFailedError: Some threads threw uncaught exceptions!
	at org.apache.lucene.util.LuceneTestCase$LuceneTestCaseRunner.runChild(LuceneTestCase.java:1333)
	at org.apache.lucene.util.LuceneTestCase$LuceneTestCaseRunner.runChild(LuceneTestCase.java:1251)
	at org.apache.lucene.util.LuceneTestCase.tearDown(LuceneTestCase.java:591)


REGRESSION:  org.apache.lucene.index.TestStressAdvance.testStressAdvance

Error Message:
separate norms file (.s*) is not allowed in .cfs: _12_0.skp

Stack Trace:
junit.framework.AssertionFailedError: separate norms file (.s*) is not allowed in .cfs: _12_0.skp
	at org.apache.lucene.util.LuceneTestCase$LuceneTestCaseRunner.runChild(LuceneTestCase.java:1333)
	at org.apache.lucene.util.LuceneTestCase$LuceneTestCaseRunner.runChild(LuceneTestCase.java:1251)
	at org.apache.lucene.index.SegmentMerger.createCompoundFile(SegmentMerger.java:139)
	at org.apache.lucene.index.IndexWriter.mergeMiddle(IndexWriter.java:3420)
	at org.apache.lucene.index.IndexWriter.merge(IndexWriter.java:3035)
	at org.apache.lucene.index.SerialMergeScheduler.merge(SerialMergeScheduler.java:37)
	at org.apache.lucene.index.IndexWriter.maybeMerge(IndexWriter.java:1866)
	at org.apache.lucene.index.IndexWriter.maybeMerge(IndexWriter.java:1861)
	at org.apache.lucene.index.IndexWriter.maybeMerge(IndexWriter.java:1857)
	at org.apache.lucene.index.IndexWriter.updateDocuments(IndexWriter.java:1328)
	at org.apache.lucene.index.IndexWriter.addDocuments(IndexWriter.java:1280)
	at org.apache.lucene.index.IndexWriter.addDocuments(IndexWriter.java:1265)
	at org.apache.lucene.index.RandomIndexWriter.addDocument(RandomIndexWriter.java:107)
	at org.apache.lucene.index.TestStressAdvance.testStressAdvance(TestStressAdvance.java:51)


REGRESSION:  org.apache.lucene.index.TestStressIndexing.testStressIndexAndSearching

Error Message:
Some threads threw uncaught exceptions!

Stack Trace:
junit.framework.AssertionFailedError: Some threads threw uncaught exceptions!
	at org.apache.lucene.util.LuceneTestCase$LuceneTestCaseRunner.runChild(LuceneTestCase.java:1333)
	at org.apache.lucene.util.LuceneTestCase$LuceneTestCaseRunner.runChild(LuceneTestCase.java:1251)
	at org.apache.lucene.util.LuceneTestCase.tearDown(LuceneTestCase.java:591)


REGRESSION:  org.apache.lucene.index.TestTermVectorsWriter.testNoTermVectorAfterTermVector

Error Message:
separate norms file (.s*) is not allowed in .cfs: _2_0.skp

Stack Trace:
junit.framework.AssertionFailedError: separate norms file (.s*) is not allowed in .cfs: _2_0.skp
	at org.apache.lucene.util.LuceneTestCase$LuceneTestCaseRunner.runChild(LuceneTestCase.java:1333)
	at org.apache.lucene.util.LuceneTestCase$LuceneTestCaseRunner.runChild(LuceneTestCase.java:1251)
	at org.apache.lucene.index.SegmentMerger.createCompoundFile(SegmentMerger.java:139)
	at org.apache.lucene.index.IndexWriter.mergeMiddle(IndexWriter.java:3420)
	at org.apache.lucene.index.IndexWriter.merge(IndexWriter.java:3035)
	at org.apache.lucene.index.SerialMergeScheduler.merge(SerialMergeScheduler.java:37)
	at org.apache.lucene.index.IndexWriter.maybeMerge(IndexWriter.java:1866)
	at org.apache.lucene.index.IndexWriter.maybeMerge(IndexWriter.java:1861)
	at org.apache.lucene.index.IndexWriter.maybeMerge(IndexWriter.java:1857)
	at org.apache.lucene.index.IndexWriter.flush(IndexWriter.java:2701)
	at org.apache.lucene.index.IndexWriter.prepareCommit(IndexWriter.java:2566)
	at org.apache.lucene.index.IndexWriter.commitInternal(IndexWriter.java:2639)
	at org.apache.lucene.index.IndexWriter.commit(IndexWriter.java:2621)
	at org.apache.lucene.index.IndexWriter.commit(IndexWriter.java:2605)
	at org.apache.lucene.index.TestTermVectorsWriter.testNoTermVectorAfterTermVector(TestTermVectorsWriter.java:411)


REGRESSION:  org.apache.lucene.index.TestTieredMergePolicy.testPartialOptimize

Error Message:
separate norms file (.s*) is not allowed in .cfs: _3_0.skp

Stack Trace:
junit.framework.AssertionFailedError: separate norms file (.s*) is not allowed in .cfs: _3_0.skp
	at org.apache.lucene.util.LuceneTestCase$LuceneTestCaseRunner.runChild(LuceneTestCase.java:1333)
	at org.apache.lucene.util.LuceneTestCase$LuceneTestCaseRunner.runChild(LuceneTestCase.java:1251)
	at org.apache.lucene.index.SegmentMerger.createCompoundFile(SegmentMerger.java:139)
	at org.apache.lucene.index.IndexWriter.mergeMiddle(IndexWriter.java:3420)
	at org.apache.lucene.index.IndexWriter.merge(IndexWriter.java:3035)
	at org.apache.lucene.index.SerialMergeScheduler.merge(SerialMergeScheduler.java:37)
	at org.apache.lucene.index.IndexWriter.maybeMerge(IndexWriter.java:1866)
	at org.apache.lucene.index.IndexWriter.maybeMerge(IndexWriter.java:1861)
	at org.apache.lucene.index.IndexWriter.maybeMerge(IndexWriter.java:1857)
	at org.apache.lucene.index.IndexWriter.updateDocument(IndexWriter.java:1475)
	at org.apache.lucene.index.IndexWriter.addDocument(IndexWriter.java:1227)
	at org.apache.lucene.index.IndexWriter.addDocument(IndexWriter.java:1208)
	at org.apache.lucene.index.TestTieredMergePolicy.testPartialOptimize(TestTieredMergePolicy.java:89)


FAILED:  junit.framework.TestSuite.org.apache.lucene.search.TestBoolean2

Error Message:
separate norms file (.s*) is not allowed in .cfs: _74_0.skp

Stack Trace:
junit.framework.AssertionFailedError: separate norms file (.s*) is not allowed in .cfs: _74_0.skp
	at org.apache.lucene.index.SegmentMerger.createCompoundFile(SegmentMerger.java:139)
	at org.apache.lucene.index.IndexWriter.mergeMiddle(IndexWriter.java:3420)
	at org.apache.lucene.index.IndexWriter.merge(IndexWriter.java:3035)
	at org.apache.lucene.index.SerialMergeScheduler.merge(SerialMergeScheduler.java:37)
	at org.apache.lucene.index.IndexWriter.maybeMerge(IndexWriter.java:1866)
	at org.apache.lucene.index.IndexWriter.optimize(IndexWriter.java:1676)
	at org.apache.lucene.index.IndexWriter.optimize(IndexWriter.java:1631)
	at org.apache.lucene.index.IndexWriter.optimize(IndexWriter.java:1601)
	at org.apache.lucene.index.RandomIndexWriter.doRandomOptimize(RandomIndexWriter.java:237)
	at org.apache.lucene.index.RandomIndexWriter.close(RandomIndexWriter.java:276)
	at org.apache.lucene.search.TestBoolean2.beforeClass(TestBoolean2.java:77)


FAILED:  junit.framework.TestSuite.org.apache.lucene.search.TestBoolean2

Error Message:
null

Stack Trace:
java.lang.NullPointerException
	at org.apache.lucene.search.TestBoolean2.afterClass(TestBoolean2.java:102)


FAILED:  junit.framework.TestSuite.org.apache.lucene.search.TestBoolean2

Error Message:
directory of test was not closed, opened from: org.apache.lucene.search.TestBoolean2.beforeClass(TestBoolean2.java:56)

Stack Trace:
junit.framework.AssertionFailedError: directory of test was not closed, opened from: org.apache.lucene.search.TestBoolean2.beforeClass(TestBoolean2.java:56)
	at org.apache.lucene.util.LuceneTestCase.afterClassLuceneTestCaseJ4(LuceneTestCase.java:433)


FAILED:  junit.framework.TestSuite.org.apache.lucene.search.TestFieldCacheRangeFilter

Error Message:
separate norms file (.s*) is not allowed in .cfs: _1x_0.skp

Stack Trace:
junit.framework.AssertionFailedError: separate norms file (.s*) is not allowed in .cfs: _1x_0.skp
	at org.apache.lucene.index.SegmentMerger.createCompoundFile(SegmentMerger.java:139)
	at org.apache.lucene.index.IndexWriter.mergeMiddle(IndexWriter.java:3420)
	at org.apache.lucene.index.IndexWriter.merge(IndexWriter.java:3035)
	at org.apache.lucene.index.SerialMergeScheduler.merge(SerialMergeScheduler.java:37)
	at org.apache.lucene.index.IndexWriter.maybeMerge(IndexWriter.java:1866)
	at org.apache.lucene.index.IndexWriter.maybeMerge(IndexWriter.java:1861)
	at org.apache.lucene.index.IndexWriter.maybeMerge(IndexWriter.java:1857)
	at org.apache.lucene.index.IndexWriter.updateDocument(IndexWriter.java:1475)
	at org.apache.lucene.index.IndexWriter.addDocument(IndexWriter.java:1227)
	at org.apache.lucene.index.IndexWriter.addDocument(IndexWriter.java:1208)
	at org.apache.lucene.index.RandomIndexWriter.addDocument(RandomIndexWriter.java:136)
	at org.apache.lucene.search.BaseTestRangeFilter.build(BaseTestRangeFilter.java:154)
	at org.apache.lucene.search.BaseTestRangeFilter.beforeClassBaseTestRangeFilter(BaseTestRangeFilter.java:98)


FAILED:  junit.framework.TestSuite.org.apache.lucene.search.TestFieldCacheRangeFilter

Error Message:
null

Stack Trace:
java.lang.NullPointerException
	at org.apache.lucene.search.BaseTestRangeFilter.afterClassBaseTestRangeFilter(BaseTestRangeFilter.java:104)


FAILED:  junit.framework.TestSuite.org.apache.lucene.search.TestFieldCacheRangeFilter

Error Message:
directory of test was not closed, opened from: org.apache.lucene.search.BaseTestRangeFilter$TestIndex.<init>(BaseTestRangeFilter.java:58)

Stack Trace:
junit.framework.AssertionFailedError: directory of test was not closed, opened from: org.apache.lucene.search.BaseTestRangeFilter$TestIndex.<init>(BaseTestRangeFilter.java:58)
	at org.apache.lucene.util.LuceneTestCase.afterClassLuceneTestCaseJ4(LuceneTestCase.java:433)


REGRESSION:  org.apache.lucene.search.TestMultiValuedNumericRangeQuery.testMultiValuedNRQ

Error Message:
separate norms file (.s*) is not allowed in .cfs: _10_1.sd

Stack Trace:
junit.framework.AssertionFailedError: separate norms file (.s*) is not allowed in .cfs: _10_1.sd
	at org.apache.lucene.util.LuceneTestCase$LuceneTestCaseRunner.runChild(LuceneTestCase.java:1333)
	at org.apache.lucene.util.LuceneTestCase$LuceneTestCaseRunner.runChild(LuceneTestCase.java:1251)
	at org.apache.lucene.index.SegmentMerger.createCompoundFile(SegmentMerger.java:139)
	at org.apache.lucene.index.IndexWriter.mergeMiddle(IndexWriter.java:3420)
	at org.apache.lucene.index.IndexWriter.merge(IndexWriter.java:3035)
	at org.apache.lucene.index.SerialMergeScheduler.merge(SerialMergeScheduler.java:37)
	at org.apache.lucene.index.IndexWriter.maybeMerge(IndexWriter.java:1866)
	at org.apache.lucene.index.IndexWriter.maybeMerge(IndexWriter.java:1861)
	at org.apache.lucene.index.IndexWriter.maybeMerge(IndexWriter.java:1857)
	at org.apache.lucene.index.IndexWriter.updateDocument(IndexWriter.java:1475)
	at org.apache.lucene.index.IndexWriter.addDocument(IndexWriter.java:1227)
	at org.apache.lucene.index.IndexWriter.addDocument(IndexWriter.java:1208)
	at org.apache.lucene.index.RandomIndexWriter.addDocument(RandomIndexWriter.java:136)
	at org.apache.lucene.search.TestMultiValuedNumericRangeQuery.testMultiValuedNRQ(TestMultiValuedNumericRangeQuery.java:57)


FAILED:  junit.framework.TestSuite.org.apache.lucene.search.TestNumericRangeQuery64

Error Message:
background merge hit exception: _2p(4.0):c329 _2q(4.0):c329 _2u(4.0):c110 _2x(4.0):c329 _32(4.0):c329
into _85 [optimize]

Stack Trace:
java.io.IOException: background merge hit exception: _2p(4.0):c329 _2q(4.0):c329 _2u(4.0):c110
_2x(4.0):c329 _32(4.0):c329 into _85 [optimize]
	at org.apache.lucene.index.IndexWriter.optimize(IndexWriter.java:1693)
	at org.apache.lucene.index.IndexWriter.optimize(IndexWriter.java:1617)
	at org.apache.lucene.index.RandomIndexWriter.doRandomOptimize(RandomIndexWriter.java:241)
	at org.apache.lucene.index.RandomIndexWriter.getReader(RandomIndexWriter.java:249)
	at org.apache.lucene.index.RandomIndexWriter.getReader(RandomIndexWriter.java:230)
	at org.apache.lucene.search.TestNumericRangeQuery64.beforeClass(TestNumericRangeQuery64.java:91)
	at org.apache.lucene.index.SegmentMerger.createCompoundFile(SegmentMerger.java:139)
	at org.apache.lucene.index.IndexWriter.mergeMiddle(IndexWriter.java:3420)
	at org.apache.lucene.index.IndexWriter.merge(IndexWriter.java:3035)
	at org.apache.lucene.index.ConcurrentMergeScheduler.doMerge(ConcurrentMergeScheduler.java:379)
	at org.apache.lucene.index.ConcurrentMergeScheduler$MergeThread.run(ConcurrentMergeScheduler.java:447)


FAILED:  junit.framework.TestSuite.org.apache.lucene.search.TestNumericRangeQuery64

Error Message:
null

Stack Trace:
java.lang.NullPointerException
	at org.apache.lucene.search.TestNumericRangeQuery64.afterClass(TestNumericRangeQuery64.java:98)


FAILED:  junit.framework.TestSuite.org.apache.lucene.search.TestNumericRangeQuery64

Error Message:
directory of test was not closed, opened from: org.apache.lucene.search.TestNumericRangeQuery64.beforeClass(TestNumericRangeQuery64.java:52)

Stack Trace:
junit.framework.AssertionFailedError: directory of test was not closed, opened from: org.apache.lucene.search.TestNumericRangeQuery64.beforeClass(TestNumericRangeQuery64.java:52)
	at org.apache.lucene.util.LuceneTestCase.afterClassLuceneTestCaseJ4(LuceneTestCase.java:433)


REGRESSION:  org.apache.lucene.search.TestRegexpRandom2.testRegexps

Error Message:
Some threads threw uncaught exceptions!

Stack Trace:
junit.framework.AssertionFailedError: Some threads threw uncaught exceptions!
	at org.apache.lucene.util.LuceneTestCase$LuceneTestCaseRunner.runChild(LuceneTestCase.java:1333)
	at org.apache.lucene.util.LuceneTestCase$LuceneTestCaseRunner.runChild(LuceneTestCase.java:1251)
	at org.apache.lucene.util.LuceneTestCase.tearDown(LuceneTestCase.java:591)
	at org.apache.lucene.search.TestRegexpRandom2.tearDown(TestRegexpRandom2.java:98)


REGRESSION:  org.apache.lucene.search.TestSimpleExplanations.testT1

Error Message:
Some threads threw uncaught exceptions!

Stack Trace:
junit.framework.AssertionFailedError: Some threads threw uncaught exceptions!
	at org.apache.lucene.util.LuceneTestCase$LuceneTestCaseRunner.runChild(LuceneTestCase.java:1333)
	at org.apache.lucene.util.LuceneTestCase$LuceneTestCaseRunner.runChild(LuceneTestCase.java:1251)
	at org.apache.lucene.util.LuceneTestCase.tearDown(LuceneTestCase.java:591)
	at org.apache.lucene.search.TestExplanations.tearDown(TestExplanations.java:67)


REGRESSION:  org.apache.lucene.search.TestSimpleExplanations.testMA1

Error Message:
Some threads threw uncaught exceptions!

Stack Trace:
junit.framework.AssertionFailedError: Some threads threw uncaught exceptions!
	at org.apache.lucene.util.LuceneTestCase$LuceneTestCaseRunner.runChild(LuceneTestCase.java:1333)
	at org.apache.lucene.util.LuceneTestCase$LuceneTestCaseRunner.runChild(LuceneTestCase.java:1251)
	at org.apache.lucene.util.LuceneTestCase.tearDown(LuceneTestCase.java:591)
	at org.apache.lucene.search.TestExplanations.tearDown(TestExplanations.java:67)


REGRESSION:  org.apache.lucene.search.TestTermRangeQuery.testExclusive

Error Message:
Some threads threw uncaught exceptions!

Stack Trace:
junit.framework.AssertionFailedError: Some threads threw uncaught exceptions!
	at org.apache.lucene.util.LuceneTestCase$LuceneTestCaseRunner.runChild(LuceneTestCase.java:1333)
	at org.apache.lucene.util.LuceneTestCase$LuceneTestCaseRunner.runChild(LuceneTestCase.java:1251)
	at org.apache.lucene.util.LuceneTestCase.tearDown(LuceneTestCase.java:591)
	at org.apache.lucene.search.TestTermRangeQuery.tearDown(TestTermRangeQuery.java:52)




Build Log (for compile errors):
[...truncated 12942 lines...]



---------------------------------------------------------------------
To unsubscribe, e-mail: dev-unsubscribe@lucene.apache.org
For additional commands, e-mail: dev-help@lucene.apache.org


Mime
View raw message