lucene-dev mailing list archives

Site index · List index
Message view « Date » · « Thread »
Top « Date » · « Thread »
From Apache Hudson Server <hud...@hudson.apache.org>
Subject [HUDSON] Solr-trunk - Build # 1465 - Still Failing
Date Tue, 05 Apr 2011 08:24:27 GMT
Build: https://hudson.apache.org/hudson/job/Solr-trunk/1465/

108 tests failed.
FAILED:  junit.framework.TestSuite.org.apache.solr.cloud.BasicZkTest

Error Message:
KeeperErrorCode = ConnectionLoss for /solr

Stack Trace:
org.apache.zookeeper.KeeperException$ConnectionLossException: KeeperErrorCode = ConnectionLoss for /solr
	at org.apache.zookeeper.KeeperException.create(KeeperException.java:90)
	at org.apache.zookeeper.KeeperException.create(KeeperException.java:42)
	at org.apache.zookeeper.ZooKeeper.create(ZooKeeper.java:637)
	at org.apache.solr.common.cloud.SolrZkClient.makePath(SolrZkClient.java:347)
	at org.apache.solr.common.cloud.SolrZkClient.makePath(SolrZkClient.java:308)
	at org.apache.solr.common.cloud.SolrZkClient.makePath(SolrZkClient.java:290)
	at org.apache.solr.common.cloud.SolrZkClient.makePath(SolrZkClient.java:255)
	at org.apache.solr.cloud.AbstractZkTestCase.buildZooKeeper(AbstractZkTestCase.java:72)
	at org.apache.solr.cloud.AbstractZkTestCase.azt_beforeClass(AbstractZkTestCase.java:62)


REGRESSION:  org.apache.solr.cloud.CloudStateUpdateTest.testCoreRegistration

Error Message:
null

Stack Trace:
org.apache.solr.common.cloud.ZooKeeperException: 
	at org.apache.solr.core.CoreContainer.load(CoreContainer.java:428)
	at org.apache.solr.core.CoreContainer$Initializer.initialize(CoreContainer.java:242)
	at org.apache.solr.cloud.CloudStateUpdateTest.setUp(CloudStateUpdateTest.java:112)
	at org.apache.lucene.util.LuceneTestCase$LuceneTestCaseRunner.runChild(LuceneTestCase.java:1232)
	at org.apache.lucene.util.LuceneTestCase$LuceneTestCaseRunner.runChild(LuceneTestCase.java:1160)
Caused by: org.apache.zookeeper.KeeperException$ConnectionLossException: KeeperErrorCode = ConnectionLoss for /collections
	at org.apache.zookeeper.KeeperException.create(KeeperException.java:90)
	at org.apache.zookeeper.KeeperException.create(KeeperException.java:42)
	at org.apache.zookeeper.ZooKeeper.getChildren(ZooKeeper.java:1243)
	at org.apache.solr.common.cloud.SolrZkClient.getChildren(SolrZkClient.java:198)
	at org.apache.solr.common.cloud.ZkStateReader.makeShardZkNodeWatches(ZkStateReader.java:184)
	at org.apache.solr.core.CoreContainer.load(CoreContainer.java:417)


FAILED:  junit.framework.TestSuite.org.apache.solr.cloud.CloudStateUpdateTest

Error Message:
ERROR: SolrIndexSearcher opens=20 closes=19

Stack Trace:
junit.framework.AssertionFailedError: ERROR: SolrIndexSearcher opens=20 closes=19
	at org.apache.solr.SolrTestCaseJ4.endTrackingSearchers(SolrTestCaseJ4.java:119)
	at org.apache.solr.SolrTestCaseJ4.deleteCore(SolrTestCaseJ4.java:293)
	at org.apache.solr.SolrTestCaseJ4.afterClassSolrTestCase(SolrTestCaseJ4.java:70)


FAILED:  junit.framework.TestSuite.org.apache.solr.cloud.ZkControllerTest

Error Message:
ERROR: SolrIndexSearcher opens=20 closes=19

Stack Trace:
junit.framework.AssertionFailedError: ERROR: SolrIndexSearcher opens=20 closes=19
	at org.apache.solr.SolrTestCaseJ4.endTrackingSearchers(SolrTestCaseJ4.java:119)
	at org.apache.solr.SolrTestCaseJ4.deleteCore(SolrTestCaseJ4.java:293)
	at org.apache.solr.SolrTestCaseJ4.afterClassSolrTestCase(SolrTestCaseJ4.java:70)


FAILED:  junit.framework.TestSuite.org.apache.solr.cloud.ZkNodePropsTest

Error Message:
ERROR: SolrIndexSearcher opens=20 closes=19

Stack Trace:
junit.framework.AssertionFailedError: ERROR: SolrIndexSearcher opens=20 closes=19
	at org.apache.solr.SolrTestCaseJ4.endTrackingSearchers(SolrTestCaseJ4.java:119)
	at org.apache.solr.SolrTestCaseJ4.deleteCore(SolrTestCaseJ4.java:293)
	at org.apache.solr.SolrTestCaseJ4.afterClassSolrTestCase(SolrTestCaseJ4.java:70)


FAILED:  junit.framework.TestSuite.org.apache.solr.core.AlternateDirectoryTest

Error Message:
org.apache.solr.common.cloud.ZooKeeperException: 

Stack Trace:
java.lang.RuntimeException: org.apache.solr.common.cloud.ZooKeeperException: 
	at org.apache.solr.util.TestHarness.<init>(TestHarness.java:153)
	at org.apache.solr.util.TestHarness.<init>(TestHarness.java:135)
	at org.apache.solr.util.TestHarness.<init>(TestHarness.java:125)
	at org.apache.solr.SolrTestCaseJ4.initCore(SolrTestCaseJ4.java:238)
	at org.apache.solr.SolrTestCaseJ4.initCore(SolrTestCaseJ4.java:101)
	at org.apache.solr.SolrTestCaseJ4.initCore(SolrTestCaseJ4.java:89)
	at org.apache.solr.core.AlternateDirectoryTest.beforeClass(AlternateDirectoryTest.java:31)
Caused by: org.apache.solr.common.cloud.ZooKeeperException: 
	at org.apache.solr.core.CoreContainer.initZooKeeper(CoreContainer.java:183)
	at org.apache.solr.util.TestHarness$Initializer$1.<init>(TestHarness.java:184)
	at org.apache.solr.util.TestHarness$Initializer.initialize(TestHarness.java:179)
	at org.apache.solr.util.TestHarness.<init>(TestHarness.java:140)
Caused by: java.util.concurrent.TimeoutException: Could not connect to ZooKeeper 127.0.0.1:54597/solr within 5000 ms
	at org.apache.solr.common.cloud.ConnectionManager.waitForConnected(ConnectionManager.java:124)
	at org.apache.solr.common.cloud.SolrZkClient.<init>(SolrZkClient.java:121)
	at org.apache.solr.common.cloud.SolrZkClient.<init>(SolrZkClient.java:69)
	at org.apache.solr.cloud.ZkController.<init>(ZkController.java:104)
	at org.apache.solr.core.CoreContainer.initZooKeeper(CoreContainer.java:164)


REGRESSION:  org.apache.solr.core.IndexReaderFactoryTest.testAltReaderUsed

Error Message:
org.apache.solr.common.cloud.ZooKeeperException: 

Stack Trace:
java.lang.RuntimeException: org.apache.solr.common.cloud.ZooKeeperException: 
	at org.apache.solr.util.TestHarness.<init>(TestHarness.java:153)
	at org.apache.solr.util.TestHarness.<init>(TestHarness.java:135)
	at org.apache.solr.util.TestHarness.<init>(TestHarness.java:125)
	at org.apache.solr.util.AbstractSolrTestCase.setUp(AbstractSolrTestCase.java:132)
	at org.apache.lucene.util.LuceneTestCase$LuceneTestCaseRunner.runChild(LuceneTestCase.java:1232)
	at org.apache.lucene.util.LuceneTestCase$LuceneTestCaseRunner.runChild(LuceneTestCase.java:1160)
Caused by: org.apache.solr.common.cloud.ZooKeeperException: 
	at org.apache.solr.core.CoreContainer.initZooKeeper(CoreContainer.java:183)
	at org.apache.solr.util.TestHarness$Initializer$1.<init>(TestHarness.java:184)
	at org.apache.solr.util.TestHarness$Initializer.initialize(TestHarness.java:179)
	at org.apache.solr.util.TestHarness.<init>(TestHarness.java:140)
Caused by: java.util.concurrent.TimeoutException: Could not connect to ZooKeeper 127.0.0.1:54597/solr within 5000 ms
	at org.apache.solr.common.cloud.ConnectionManager.waitForConnected(ConnectionManager.java:124)
	at org.apache.solr.common.cloud.SolrZkClient.<init>(SolrZkClient.java:121)
	at org.apache.solr.common.cloud.SolrZkClient.<init>(SolrZkClient.java:69)
	at org.apache.solr.cloud.ZkController.<init>(ZkController.java:104)
	at org.apache.solr.core.CoreContainer.initZooKeeper(CoreContainer.java:164)


FAILED:  junit.framework.TestSuite.org.apache.solr.core.RequestHandlersTest

Error Message:
org.apache.solr.common.cloud.ZooKeeperException: 

Stack Trace:
java.lang.RuntimeException: org.apache.solr.common.cloud.ZooKeeperException: 
	at org.apache.solr.util.TestHarness.<init>(TestHarness.java:153)
	at org.apache.solr.util.TestHarness.<init>(TestHarness.java:135)
	at org.apache.solr.util.TestHarness.<init>(TestHarness.java:125)
	at org.apache.solr.SolrTestCaseJ4.initCore(SolrTestCaseJ4.java:238)
	at org.apache.solr.SolrTestCaseJ4.initCore(SolrTestCaseJ4.java:101)
	at org.apache.solr.SolrTestCaseJ4.initCore(SolrTestCaseJ4.java:89)
	at org.apache.solr.core.RequestHandlersTest.beforeClass(RequestHandlersTest.java:29)
Caused by: org.apache.solr.common.cloud.ZooKeeperException: 
	at org.apache.solr.core.CoreContainer.initZooKeeper(CoreContainer.java:183)
	at org.apache.solr.util.TestHarness$Initializer$1.<init>(TestHarness.java:184)
	at org.apache.solr.util.TestHarness$Initializer.initialize(TestHarness.java:179)
	at org.apache.solr.util.TestHarness.<init>(TestHarness.java:140)
Caused by: java.util.concurrent.TimeoutException: Could not connect to ZooKeeper 127.0.0.1:54597/solr within 5000 ms
	at org.apache.solr.common.cloud.ConnectionManager.waitForConnected(ConnectionManager.java:124)
	at org.apache.solr.common.cloud.SolrZkClient.<init>(SolrZkClient.java:121)
	at org.apache.solr.common.cloud.SolrZkClient.<init>(SolrZkClient.java:69)
	at org.apache.solr.cloud.ZkController.<init>(ZkController.java:104)
	at org.apache.solr.core.CoreContainer.initZooKeeper(CoreContainer.java:164)


FAILED:  junit.framework.TestSuite.org.apache.solr.core.SOLR749Test

Error Message:
org.apache.solr.common.cloud.ZooKeeperException: 

Stack Trace:
java.lang.RuntimeException: org.apache.solr.common.cloud.ZooKeeperException: 
	at org.apache.solr.util.TestHarness.<init>(TestHarness.java:153)
	at org.apache.solr.util.TestHarness.<init>(TestHarness.java:135)
	at org.apache.solr.util.TestHarness.<init>(TestHarness.java:125)
	at org.apache.solr.SolrTestCaseJ4.initCore(SolrTestCaseJ4.java:238)
	at org.apache.solr.SolrTestCaseJ4.initCore(SolrTestCaseJ4.java:101)
	at org.apache.solr.SolrTestCaseJ4.initCore(SolrTestCaseJ4.java:89)
	at org.apache.solr.core.SOLR749Test.beforeClass(SOLR749Test.java:33)
Caused by: org.apache.solr.common.cloud.ZooKeeperException: 
	at org.apache.solr.core.CoreContainer.initZooKeeper(CoreContainer.java:183)
	at org.apache.solr.util.TestHarness$Initializer$1.<init>(TestHarness.java:184)
	at org.apache.solr.util.TestHarness$Initializer.initialize(TestHarness.java:179)
	at org.apache.solr.util.TestHarness.<init>(TestHarness.java:140)
Caused by: java.util.concurrent.TimeoutException: Could not connect to ZooKeeper 127.0.0.1:54597/solr within 5000 ms
	at org.apache.solr.common.cloud.ConnectionManager.waitForConnected(ConnectionManager.java:124)
	at org.apache.solr.common.cloud.SolrZkClient.<init>(SolrZkClient.java:121)
	at org.apache.solr.common.cloud.SolrZkClient.<init>(SolrZkClient.java:69)
	at org.apache.solr.cloud.ZkController.<init>(ZkController.java:104)
	at org.apache.solr.core.CoreContainer.initZooKeeper(CoreContainer.java:164)


REGRESSION:  org.apache.solr.core.SolrCoreTest.testRequestHandlerRegistry

Error Message:
org.apache.solr.common.cloud.ZooKeeperException: 

Stack Trace:
java.lang.RuntimeException: org.apache.solr.common.cloud.ZooKeeperException: 
	at org.apache.solr.util.TestHarness.<init>(TestHarness.java:153)
	at org.apache.solr.util.TestHarness.<init>(TestHarness.java:135)
	at org.apache.solr.util.TestHarness.<init>(TestHarness.java:125)
	at org.apache.solr.SolrTestCaseJ4.initCore(SolrTestCaseJ4.java:238)
	at org.apache.solr.SolrTestCaseJ4.initCore(SolrTestCaseJ4.java:101)
	at org.apache.solr.SolrTestCaseJ4.initCore(SolrTestCaseJ4.java:89)
	at org.apache.solr.core.SolrCoreTest.setUp(SolrCoreTest.java:36)
	at org.apache.lucene.util.LuceneTestCase$LuceneTestCaseRunner.runChild(LuceneTestCase.java:1232)
	at org.apache.lucene.util.LuceneTestCase$LuceneTestCaseRunner.runChild(LuceneTestCase.java:1160)
Caused by: org.apache.solr.common.cloud.ZooKeeperException: 
	at org.apache.solr.core.CoreContainer.initZooKeeper(CoreContainer.java:183)
	at org.apache.solr.util.TestHarness$Initializer$1.<init>(TestHarness.java:184)
	at org.apache.solr.util.TestHarness$Initializer.initialize(TestHarness.java:179)
	at org.apache.solr.util.TestHarness.<init>(TestHarness.java:140)
Caused by: java.util.concurrent.TimeoutException: Could not connect to ZooKeeper 127.0.0.1:54597/solr within 5000 ms
	at org.apache.solr.common.cloud.ConnectionManager.waitForConnected(ConnectionManager.java:124)
	at org.apache.solr.common.cloud.SolrZkClient.<init>(SolrZkClient.java:121)
	at org.apache.solr.common.cloud.SolrZkClient.<init>(SolrZkClient.java:69)
	at org.apache.solr.cloud.ZkController.<init>(ZkController.java:104)
	at org.apache.solr.core.CoreContainer.initZooKeeper(CoreContainer.java:164)


REGRESSION:  org.apache.solr.core.SolrCoreTest.testClose

Error Message:
org.apache.solr.common.cloud.ZooKeeperException: 

Stack Trace:
java.lang.RuntimeException: org.apache.solr.common.cloud.ZooKeeperException: 
	at org.apache.solr.util.TestHarness.<init>(TestHarness.java:153)
	at org.apache.solr.util.TestHarness.<init>(TestHarness.java:135)
	at org.apache.solr.util.TestHarness.<init>(TestHarness.java:125)
	at org.apache.solr.SolrTestCaseJ4.initCore(SolrTestCaseJ4.java:238)
	at org.apache.solr.SolrTestCaseJ4.initCore(SolrTestCaseJ4.java:101)
	at org.apache.solr.SolrTestCaseJ4.initCore(SolrTestCaseJ4.java:89)
	at org.apache.solr.core.SolrCoreTest.setUp(SolrCoreTest.java:36)
	at org.apache.lucene.util.LuceneTestCase$LuceneTestCaseRunner.runChild(LuceneTestCase.java:1232)
	at org.apache.lucene.util.LuceneTestCase$LuceneTestCaseRunner.runChild(LuceneTestCase.java:1160)
Caused by: org.apache.solr.common.cloud.ZooKeeperException: 
	at org.apache.solr.core.CoreContainer.initZooKeeper(CoreContainer.java:183)
	at org.apache.solr.util.TestHarness$Initializer$1.<init>(TestHarness.java:184)
	at org.apache.solr.util.TestHarness$Initializer.initialize(TestHarness.java:179)
	at org.apache.solr.util.TestHarness.<init>(TestHarness.java:140)
Caused by: java.util.concurrent.TimeoutException: Could not connect to ZooKeeper 127.0.0.1:54597/solr within 5000 ms
	at org.apache.solr.common.cloud.ConnectionManager.waitForConnected(ConnectionManager.java:124)
	at org.apache.solr.common.cloud.SolrZkClient.<init>(SolrZkClient.java:121)
	at org.apache.solr.common.cloud.SolrZkClient.<init>(SolrZkClient.java:69)
	at org.apache.solr.cloud.ZkController.<init>(ZkController.java:104)
	at org.apache.solr.core.CoreContainer.initZooKeeper(CoreContainer.java:164)


REGRESSION:  org.apache.solr.core.SolrCoreTest.testRefCount

Error Message:
org.apache.solr.common.cloud.ZooKeeperException: 

Stack Trace:
java.lang.RuntimeException: org.apache.solr.common.cloud.ZooKeeperException: 
	at org.apache.solr.util.TestHarness.<init>(TestHarness.java:153)
	at org.apache.solr.util.TestHarness.<init>(TestHarness.java:135)
	at org.apache.solr.util.TestHarness.<init>(TestHarness.java:125)
	at org.apache.solr.SolrTestCaseJ4.initCore(SolrTestCaseJ4.java:238)
	at org.apache.solr.SolrTestCaseJ4.initCore(SolrTestCaseJ4.java:101)
	at org.apache.solr.SolrTestCaseJ4.initCore(SolrTestCaseJ4.java:89)
	at org.apache.solr.core.SolrCoreTest.setUp(SolrCoreTest.java:36)
	at org.apache.lucene.util.LuceneTestCase$LuceneTestCaseRunner.runChild(LuceneTestCase.java:1232)
	at org.apache.lucene.util.LuceneTestCase$LuceneTestCaseRunner.runChild(LuceneTestCase.java:1160)
Caused by: org.apache.solr.common.cloud.ZooKeeperException: 
	at org.apache.solr.core.CoreContainer.initZooKeeper(CoreContainer.java:183)
	at org.apache.solr.util.TestHarness$Initializer$1.<init>(TestHarness.java:184)
	at org.apache.solr.util.TestHarness$Initializer.initialize(TestHarness.java:179)
	at org.apache.solr.util.TestHarness.<init>(TestHarness.java:140)
Caused by: java.util.concurrent.TimeoutException: Could not connect to ZooKeeper 127.0.0.1:54597/solr within 5000 ms
	at org.apache.solr.common.cloud.ConnectionManager.waitForConnected(ConnectionManager.java:124)
	at org.apache.solr.common.cloud.SolrZkClient.<init>(SolrZkClient.java:121)
	at org.apache.solr.common.cloud.SolrZkClient.<init>(SolrZkClient.java:69)
	at org.apache.solr.cloud.ZkController.<init>(ZkController.java:104)
	at org.apache.solr.core.CoreContainer.initZooKeeper(CoreContainer.java:164)


REGRESSION:  org.apache.solr.core.SolrCoreTest.testRefCountMT

Error Message:
org.apache.solr.common.cloud.ZooKeeperException: 

Stack Trace:
java.lang.RuntimeException: org.apache.solr.common.cloud.ZooKeeperException: 
	at org.apache.solr.util.TestHarness.<init>(TestHarness.java:153)
	at org.apache.solr.util.TestHarness.<init>(TestHarness.java:135)
	at org.apache.solr.util.TestHarness.<init>(TestHarness.java:125)
	at org.apache.solr.SolrTestCaseJ4.initCore(SolrTestCaseJ4.java:238)
	at org.apache.solr.SolrTestCaseJ4.initCore(SolrTestCaseJ4.java:101)
	at org.apache.solr.SolrTestCaseJ4.initCore(SolrTestCaseJ4.java:89)
	at org.apache.solr.core.SolrCoreTest.setUp(SolrCoreTest.java:36)
	at org.apache.lucene.util.LuceneTestCase$LuceneTestCaseRunner.runChild(LuceneTestCase.java:1232)
	at org.apache.lucene.util.LuceneTestCase$LuceneTestCaseRunner.runChild(LuceneTestCase.java:1160)
Caused by: org.apache.solr.common.cloud.ZooKeeperException: 
	at org.apache.solr.core.CoreContainer.initZooKeeper(CoreContainer.java:183)
	at org.apache.solr.util.TestHarness$Initializer$1.<init>(TestHarness.java:184)
	at org.apache.solr.util.TestHarness$Initializer.initialize(TestHarness.java:179)
	at org.apache.solr.util.TestHarness.<init>(TestHarness.java:140)
Caused by: java.util.concurrent.TimeoutException: Could not connect to ZooKeeper 127.0.0.1:54597/solr within 5000 ms
	at org.apache.solr.common.cloud.ConnectionManager.waitForConnected(ConnectionManager.java:124)
	at org.apache.solr.common.cloud.SolrZkClient.<init>(SolrZkClient.java:121)
	at org.apache.solr.common.cloud.SolrZkClient.<init>(SolrZkClient.java:69)
	at org.apache.solr.cloud.ZkController.<init>(ZkController.java:104)
	at org.apache.solr.core.CoreContainer.initZooKeeper(CoreContainer.java:164)


REGRESSION:  org.apache.solr.core.SolrCoreTest.testInfoRegistry

Error Message:
org.apache.solr.common.cloud.ZooKeeperException: 

Stack Trace:
java.lang.RuntimeException: org.apache.solr.common.cloud.ZooKeeperException: 
	at org.apache.solr.util.TestHarness.<init>(TestHarness.java:153)
	at org.apache.solr.util.TestHarness.<init>(TestHarness.java:135)
	at org.apache.solr.util.TestHarness.<init>(TestHarness.java:125)
	at org.apache.solr.SolrTestCaseJ4.initCore(SolrTestCaseJ4.java:238)
	at org.apache.solr.SolrTestCaseJ4.initCore(SolrTestCaseJ4.java:101)
	at org.apache.solr.SolrTestCaseJ4.initCore(SolrTestCaseJ4.java:89)
	at org.apache.solr.core.SolrCoreTest.setUp(SolrCoreTest.java:36)
	at org.apache.lucene.util.LuceneTestCase$LuceneTestCaseRunner.runChild(LuceneTestCase.java:1232)
	at org.apache.lucene.util.LuceneTestCase$LuceneTestCaseRunner.runChild(LuceneTestCase.java:1160)
Caused by: org.apache.solr.common.cloud.ZooKeeperException: 
	at org.apache.solr.core.CoreContainer.initZooKeeper(CoreContainer.java:183)
	at org.apache.solr.util.TestHarness$Initializer$1.<init>(TestHarness.java:184)
	at org.apache.solr.util.TestHarness$Initializer.initialize(TestHarness.java:179)
	at org.apache.solr.util.TestHarness.<init>(TestHarness.java:140)
Caused by: java.util.concurrent.TimeoutException: Could not connect to ZooKeeper 127.0.0.1:54597/solr within 5000 ms
	at org.apache.solr.common.cloud.ConnectionManager.waitForConnected(ConnectionManager.java:124)
	at org.apache.solr.common.cloud.SolrZkClient.<init>(SolrZkClient.java:121)
	at org.apache.solr.common.cloud.SolrZkClient.<init>(SolrZkClient.java:69)
	at org.apache.solr.cloud.ZkController.<init>(ZkController.java:104)
	at org.apache.solr.core.CoreContainer.initZooKeeper(CoreContainer.java:164)


REGRESSION:  org.apache.solr.core.TestArbitraryIndexDir.testLoadNewIndexDir

Error Message:
org.apache.solr.common.cloud.ZooKeeperException: 

Stack Trace:
java.lang.RuntimeException: org.apache.solr.common.cloud.ZooKeeperException: 
	at org.apache.solr.util.TestHarness.<init>(TestHarness.java:153)
	at org.apache.solr.util.TestHarness.<init>(TestHarness.java:135)
	at org.apache.solr.util.TestHarness.<init>(TestHarness.java:125)
	at org.apache.solr.core.TestArbitraryIndexDir.setUp(TestArbitraryIndexDir.java:56)
	at org.apache.lucene.util.LuceneTestCase$LuceneTestCaseRunner.runChild(LuceneTestCase.java:1232)
	at org.apache.lucene.util.LuceneTestCase$LuceneTestCaseRunner.runChild(LuceneTestCase.java:1160)
Caused by: org.apache.solr.common.cloud.ZooKeeperException: 
	at org.apache.solr.core.CoreContainer.initZooKeeper(CoreContainer.java:183)
	at org.apache.solr.util.TestHarness$Initializer$1.<init>(TestHarness.java:184)
	at org.apache.solr.util.TestHarness$Initializer.initialize(TestHarness.java:179)
	at org.apache.solr.util.TestHarness.<init>(TestHarness.java:140)
Caused by: java.util.concurrent.TimeoutException: Could not connect to ZooKeeper 127.0.0.1:54597/solr within 5000 ms
	at org.apache.solr.common.cloud.ConnectionManager.waitForConnected(ConnectionManager.java:124)
	at org.apache.solr.common.cloud.SolrZkClient.<init>(SolrZkClient.java:121)
	at org.apache.solr.common.cloud.SolrZkClient.<init>(SolrZkClient.java:69)
	at org.apache.solr.cloud.ZkController.<init>(ZkController.java:104)
	at org.apache.solr.core.CoreContainer.initZooKeeper(CoreContainer.java:164)


FAILED:  junit.framework.TestSuite.org.apache.solr.core.TestConfig

Error Message:
org.apache.solr.common.cloud.ZooKeeperException: 

Stack Trace:
java.lang.RuntimeException: org.apache.solr.common.cloud.ZooKeeperException: 
	at org.apache.solr.util.TestHarness.<init>(TestHarness.java:153)
	at org.apache.solr.util.TestHarness.<init>(TestHarness.java:135)
	at org.apache.solr.util.TestHarness.<init>(TestHarness.java:125)
	at org.apache.solr.SolrTestCaseJ4.initCore(SolrTestCaseJ4.java:238)
	at org.apache.solr.SolrTestCaseJ4.initCore(SolrTestCaseJ4.java:101)
	at org.apache.solr.SolrTestCaseJ4.initCore(SolrTestCaseJ4.java:89)
	at org.apache.solr.core.TestConfig.beforeClass(TestConfig.java:40)
Caused by: org.apache.solr.common.cloud.ZooKeeperException: 
	at org.apache.solr.core.CoreContainer.initZooKeeper(CoreContainer.java:183)
	at org.apache.solr.util.TestHarness$Initializer$1.<init>(TestHarness.java:184)
	at org.apache.solr.util.TestHarness$Initializer.initialize(TestHarness.java:179)
	at org.apache.solr.util.TestHarness.<init>(TestHarness.java:140)
Caused by: java.util.concurrent.TimeoutException: Could not connect to ZooKeeper 127.0.0.1:54597/solr within 5000 ms
	at org.apache.solr.common.cloud.ConnectionManager.waitForConnected(ConnectionManager.java:124)
	at org.apache.solr.common.cloud.SolrZkClient.<init>(SolrZkClient.java:121)
	at org.apache.solr.common.cloud.SolrZkClient.<init>(SolrZkClient.java:69)
	at org.apache.solr.cloud.ZkController.<init>(ZkController.java:104)
	at org.apache.solr.core.CoreContainer.initZooKeeper(CoreContainer.java:164)


REGRESSION:  org.apache.solr.core.TestJmxIntegration.testJmxRegistration

Error Message:
org.apache.solr.common.cloud.ZooKeeperException: 

Stack Trace:
java.lang.RuntimeException: org.apache.solr.common.cloud.ZooKeeperException: 
	at org.apache.solr.util.TestHarness.<init>(TestHarness.java:153)
	at org.apache.solr.util.TestHarness.<init>(TestHarness.java:135)
	at org.apache.solr.util.TestHarness.<init>(TestHarness.java:125)
	at org.apache.solr.util.AbstractSolrTestCase.setUp(AbstractSolrTestCase.java:132)
	at org.apache.solr.core.TestJmxIntegration.setUp(TestJmxIntegration.java:54)
	at org.apache.lucene.util.LuceneTestCase$LuceneTestCaseRunner.runChild(LuceneTestCase.java:1232)
	at org.apache.lucene.util.LuceneTestCase$LuceneTestCaseRunner.runChild(LuceneTestCase.java:1160)
Caused by: org.apache.solr.common.cloud.ZooKeeperException: 
	at org.apache.solr.core.CoreContainer.initZooKeeper(CoreContainer.java:183)
	at org.apache.solr.util.TestHarness$Initializer$1.<init>(TestHarness.java:184)
	at org.apache.solr.util.TestHarness$Initializer.initialize(TestHarness.java:179)
	at org.apache.solr.util.TestHarness.<init>(TestHarness.java:140)
Caused by: java.util.concurrent.TimeoutException: Could not connect to ZooKeeper 127.0.0.1:54597/solr within 5000 ms
	at org.apache.solr.common.cloud.ConnectionManager.waitForConnected(ConnectionManager.java:124)
	at org.apache.solr.common.cloud.SolrZkClient.<init>(SolrZkClient.java:121)
	at org.apache.solr.common.cloud.SolrZkClient.<init>(SolrZkClient.java:69)
	at org.apache.solr.cloud.ZkController.<init>(ZkController.java:104)
	at org.apache.solr.core.CoreContainer.initZooKeeper(CoreContainer.java:164)


REGRESSION:  org.apache.solr.core.TestJmxIntegration.testJmxUpdate

Error Message:
org.apache.solr.common.cloud.ZooKeeperException: 

Stack Trace:
java.lang.RuntimeException: org.apache.solr.common.cloud.ZooKeeperException: 
	at org.apache.solr.util.TestHarness.<init>(TestHarness.java:153)
	at org.apache.solr.util.TestHarness.<init>(TestHarness.java:135)
	at org.apache.solr.util.TestHarness.<init>(TestHarness.java:125)
	at org.apache.solr.util.AbstractSolrTestCase.setUp(AbstractSolrTestCase.java:132)
	at org.apache.solr.core.TestJmxIntegration.setUp(TestJmxIntegration.java:54)
	at org.apache.lucene.util.LuceneTestCase$LuceneTestCaseRunner.runChild(LuceneTestCase.java:1232)
	at org.apache.lucene.util.LuceneTestCase$LuceneTestCaseRunner.runChild(LuceneTestCase.java:1160)
Caused by: org.apache.solr.common.cloud.ZooKeeperException: 
	at org.apache.solr.core.CoreContainer.initZooKeeper(CoreContainer.java:183)
	at org.apache.solr.util.TestHarness$Initializer$1.<init>(TestHarness.java:184)
	at org.apache.solr.util.TestHarness$Initializer.initialize(TestHarness.java:179)
	at org.apache.solr.util.TestHarness.<init>(TestHarness.java:140)
Caused by: java.util.concurrent.TimeoutException: Could not connect to ZooKeeper 127.0.0.1:54597/solr within 5000 ms
	at org.apache.solr.common.cloud.ConnectionManager.waitForConnected(ConnectionManager.java:124)
	at org.apache.solr.common.cloud.SolrZkClient.<init>(SolrZkClient.java:121)
	at org.apache.solr.common.cloud.SolrZkClient.<init>(SolrZkClient.java:69)
	at org.apache.solr.cloud.ZkController.<init>(ZkController.java:104)
	at org.apache.solr.core.CoreContainer.initZooKeeper(CoreContainer.java:164)


FAILED:  junit.framework.TestSuite.org.apache.solr.core.TestLegacyMergeSchedulerPolicyConfig

Error Message:
org.apache.solr.common.cloud.ZooKeeperException: 

Stack Trace:
java.lang.RuntimeException: org.apache.solr.common.cloud.ZooKeeperException: 
	at org.apache.solr.util.TestHarness.<init>(TestHarness.java:153)
	at org.apache.solr.util.TestHarness.<init>(TestHarness.java:135)
	at org.apache.solr.util.TestHarness.<init>(TestHarness.java:125)
	at org.apache.solr.SolrTestCaseJ4.initCore(SolrTestCaseJ4.java:238)
	at org.apache.solr.SolrTestCaseJ4.initCore(SolrTestCaseJ4.java:101)
	at org.apache.solr.SolrTestCaseJ4.initCore(SolrTestCaseJ4.java:89)
	at org.apache.solr.core.TestLegacyMergeSchedulerPolicyConfig.beforeClass(TestLegacyMergeSchedulerPolicyConfig.java:33)
Caused by: org.apache.solr.common.cloud.ZooKeeperException: 
	at org.apache.solr.core.CoreContainer.initZooKeeper(CoreContainer.java:183)
	at org.apache.solr.util.TestHarness$Initializer$1.<init>(TestHarness.java:184)
	at org.apache.solr.util.TestHarness$Initializer.initialize(TestHarness.java:179)
	at org.apache.solr.util.TestHarness.<init>(TestHarness.java:140)
Caused by: java.util.concurrent.TimeoutException: Could not connect to ZooKeeper 127.0.0.1:54597/solr within 5000 ms
	at org.apache.solr.common.cloud.ConnectionManager.waitForConnected(ConnectionManager.java:124)
	at org.apache.solr.common.cloud.SolrZkClient.<init>(SolrZkClient.java:121)
	at org.apache.solr.common.cloud.SolrZkClient.<init>(SolrZkClient.java:69)
	at org.apache.solr.cloud.ZkController.<init>(ZkController.java:104)
	at org.apache.solr.core.CoreContainer.initZooKeeper(CoreContainer.java:164)


REGRESSION:  org.apache.solr.core.TestPropInject.testMergePolicy

Error Message:
org.apache.solr.common.cloud.ZooKeeperException: 

Stack Trace:
java.lang.RuntimeException: org.apache.solr.common.cloud.ZooKeeperException: 
	at org.apache.solr.util.TestHarness.<init>(TestHarness.java:153)
	at org.apache.solr.util.TestHarness.<init>(TestHarness.java:135)
	at org.apache.solr.util.TestHarness.<init>(TestHarness.java:125)
	at org.apache.solr.util.AbstractSolrTestCase.setUp(AbstractSolrTestCase.java:132)
	at org.apache.lucene.util.LuceneTestCase$LuceneTestCaseRunner.runChild(LuceneTestCase.java:1232)
	at org.apache.lucene.util.LuceneTestCase$LuceneTestCaseRunner.runChild(LuceneTestCase.java:1160)
Caused by: org.apache.solr.common.cloud.ZooKeeperException: 
	at org.apache.solr.core.CoreContainer.initZooKeeper(CoreContainer.java:183)
	at org.apache.solr.util.TestHarness$Initializer$1.<init>(TestHarness.java:184)
	at org.apache.solr.util.TestHarness$Initializer.initialize(TestHarness.java:179)
	at org.apache.solr.util.TestHarness.<init>(TestHarness.java:140)
Caused by: java.util.concurrent.TimeoutException: Could not connect to ZooKeeper 127.0.0.1:54597/solr within 5000 ms
	at org.apache.solr.common.cloud.ConnectionManager.waitForConnected(ConnectionManager.java:124)
	at org.apache.solr.common.cloud.SolrZkClient.<init>(SolrZkClient.java:121)
	at org.apache.solr.common.cloud.SolrZkClient.<init>(SolrZkClient.java:69)
	at org.apache.solr.cloud.ZkController.<init>(ZkController.java:104)
	at org.apache.solr.core.CoreContainer.initZooKeeper(CoreContainer.java:164)


REGRESSION:  org.apache.solr.core.TestPropInject.testProps

Error Message:
org.apache.solr.common.cloud.ZooKeeperException: 

Stack Trace:
java.lang.RuntimeException: org.apache.solr.common.cloud.ZooKeeperException: 
	at org.apache.solr.util.TestHarness.<init>(TestHarness.java:153)
	at org.apache.solr.util.TestHarness.<init>(TestHarness.java:135)
	at org.apache.solr.util.TestHarness.<init>(TestHarness.java:125)
	at org.apache.solr.util.AbstractSolrTestCase.setUp(AbstractSolrTestCase.java:132)
	at org.apache.lucene.util.LuceneTestCase$LuceneTestCaseRunner.runChild(LuceneTestCase.java:1232)
	at org.apache.lucene.util.LuceneTestCase$LuceneTestCaseRunner.runChild(LuceneTestCase.java:1160)
Caused by: org.apache.solr.common.cloud.ZooKeeperException: 
	at org.apache.solr.core.CoreContainer.initZooKeeper(CoreContainer.java:183)
	at org.apache.solr.util.TestHarness$Initializer$1.<init>(TestHarness.java:184)
	at org.apache.solr.util.TestHarness$Initializer.initialize(TestHarness.java:179)
	at org.apache.solr.util.TestHarness.<init>(TestHarness.java:140)
Caused by: java.util.concurrent.TimeoutException: Could not connect to ZooKeeper 127.0.0.1:54597/solr within 5000 ms
	at org.apache.solr.common.cloud.ConnectionManager.waitForConnected(ConnectionManager.java:124)
	at org.apache.solr.common.cloud.SolrZkClient.<init>(SolrZkClient.java:121)
	at org.apache.solr.common.cloud.SolrZkClient.<init>(SolrZkClient.java:69)
	at org.apache.solr.cloud.ZkController.<init>(ZkController.java:104)
	at org.apache.solr.core.CoreContainer.initZooKeeper(CoreContainer.java:164)


FAILED:  junit.framework.TestSuite.org.apache.solr.core.TestPropInjectDefaults

Error Message:
org.apache.solr.common.cloud.ZooKeeperException: 

Stack Trace:
java.lang.RuntimeException: org.apache.solr.common.cloud.ZooKeeperException: 
	at org.apache.solr.util.TestHarness.<init>(TestHarness.java:153)
	at org.apache.solr.util.TestHarness.<init>(TestHarness.java:135)
	at org.apache.solr.util.TestHarness.<init>(TestHarness.java:125)
	at org.apache.solr.SolrTestCaseJ4.initCore(SolrTestCaseJ4.java:238)
	at org.apache.solr.SolrTestCaseJ4.initCore(SolrTestCaseJ4.java:101)
	at org.apache.solr.SolrTestCaseJ4.initCore(SolrTestCaseJ4.java:89)
	at org.apache.solr.core.TestPropInjectDefaults.beforeClass(TestPropInjectDefaults.java:33)
Caused by: org.apache.solr.common.cloud.ZooKeeperException: 
	at org.apache.solr.core.CoreContainer.initZooKeeper(CoreContainer.java:183)
	at org.apache.solr.util.TestHarness$Initializer$1.<init>(TestHarness.java:184)
	at org.apache.solr.util.TestHarness$Initializer.initialize(TestHarness.java:179)
	at org.apache.solr.util.TestHarness.<init>(TestHarness.java:140)
Caused by: java.util.concurrent.TimeoutException: Could not connect to ZooKeeper 127.0.0.1:54597/solr within 5000 ms
	at org.apache.solr.common.cloud.ConnectionManager.waitForConnected(ConnectionManager.java:124)
	at org.apache.solr.common.cloud.SolrZkClient.<init>(SolrZkClient.java:121)
	at org.apache.solr.common.cloud.SolrZkClient.<init>(SolrZkClient.java:69)
	at org.apache.solr.cloud.ZkController.<init>(ZkController.java:104)
	at org.apache.solr.core.CoreContainer.initZooKeeper(CoreContainer.java:164)


FAILED:  junit.framework.TestSuite.org.apache.solr.core.TestQuerySenderListener

Error Message:
org.apache.solr.common.cloud.ZooKeeperException: 

Stack Trace:
java.lang.RuntimeException: org.apache.solr.common.cloud.ZooKeeperException: 
	at org.apache.solr.util.TestHarness.<init>(TestHarness.java:153)
	at org.apache.solr.util.TestHarness.<init>(TestHarness.java:135)
	at org.apache.solr.util.TestHarness.<init>(TestHarness.java:125)
	at org.apache.solr.SolrTestCaseJ4.initCore(SolrTestCaseJ4.java:238)
	at org.apache.solr.SolrTestCaseJ4.initCore(SolrTestCaseJ4.java:101)
	at org.apache.solr.SolrTestCaseJ4.initCore(SolrTestCaseJ4.java:89)
	at org.apache.solr.core.TestQuerySenderListener.beforeClass(TestQuerySenderListener.java:43)
Caused by: org.apache.solr.common.cloud.ZooKeeperException: 
	at org.apache.solr.core.CoreContainer.initZooKeeper(CoreContainer.java:183)
	at org.apache.solr.util.TestHarness$Initializer$1.<init>(TestHarness.java:184)
	at org.apache.solr.util.TestHarness$Initializer.initialize(TestHarness.java:179)
	at org.apache.solr.util.TestHarness.<init>(TestHarness.java:140)
Caused by: java.util.concurrent.TimeoutException: Could not connect to ZooKeeper 127.0.0.1:54597/solr within 5000 ms
	at org.apache.solr.common.cloud.ConnectionManager.waitForConnected(ConnectionManager.java:124)
	at org.apache.solr.common.cloud.SolrZkClient.<init>(SolrZkClient.java:121)
	at org.apache.solr.common.cloud.SolrZkClient.<init>(SolrZkClient.java:69)
	at org.apache.solr.cloud.ZkController.<init>(ZkController.java:104)
	at org.apache.solr.core.CoreContainer.initZooKeeper(CoreContainer.java:164)


FAILED:  junit.framework.TestSuite.org.apache.solr.core.TestSolrDeletionPolicy1

Error Message:
org.apache.solr.common.cloud.ZooKeeperException: 

Stack Trace:
java.lang.RuntimeException: org.apache.solr.common.cloud.ZooKeeperException: 
	at org.apache.solr.util.TestHarness.<init>(TestHarness.java:153)
	at org.apache.solr.util.TestHarness.<init>(TestHarness.java:135)
	at org.apache.solr.util.TestHarness.<init>(TestHarness.java:125)
	at org.apache.solr.SolrTestCaseJ4.initCore(SolrTestCaseJ4.java:238)
	at org.apache.solr.SolrTestCaseJ4.initCore(SolrTestCaseJ4.java:101)
	at org.apache.solr.SolrTestCaseJ4.initCore(SolrTestCaseJ4.java:89)
	at org.apache.solr.core.TestSolrDeletionPolicy1.beforeClass(TestSolrDeletionPolicy1.java:34)
Caused by: org.apache.solr.common.cloud.ZooKeeperException: 
	at org.apache.solr.core.CoreContainer.initZooKeeper(CoreContainer.java:183)
	at org.apache.solr.util.TestHarness$Initializer$1.<init>(TestHarness.java:184)
	at org.apache.solr.util.TestHarness$Initializer.initialize(TestHarness.java:179)
	at org.apache.solr.util.TestHarness.<init>(TestHarness.java:140)
Caused by: java.util.concurrent.TimeoutException: Could not connect to ZooKeeper 127.0.0.1:54597/solr within 5000 ms
	at org.apache.solr.common.cloud.ConnectionManager.waitForConnected(ConnectionManager.java:124)
	at org.apache.solr.common.cloud.SolrZkClient.<init>(SolrZkClient.java:121)
	at org.apache.solr.common.cloud.SolrZkClient.<init>(SolrZkClient.java:69)
	at org.apache.solr.cloud.ZkController.<init>(ZkController.java:104)
	at org.apache.solr.core.CoreContainer.initZooKeeper(CoreContainer.java:164)


FAILED:  junit.framework.TestSuite.org.apache.solr.core.TestSolrDeletionPolicy2

Error Message:
org.apache.solr.common.cloud.ZooKeeperException: 

Stack Trace:
java.lang.RuntimeException: org.apache.solr.common.cloud.ZooKeeperException: 
	at org.apache.solr.util.TestHarness.<init>(TestHarness.java:153)
	at org.apache.solr.util.TestHarness.<init>(TestHarness.java:135)
	at org.apache.solr.util.TestHarness.<init>(TestHarness.java:125)
	at org.apache.solr.SolrTestCaseJ4.initCore(SolrTestCaseJ4.java:238)
	at org.apache.solr.SolrTestCaseJ4.initCore(SolrTestCaseJ4.java:101)
	at org.apache.solr.SolrTestCaseJ4.initCore(SolrTestCaseJ4.java:89)
	at org.apache.solr.core.TestSolrDeletionPolicy2.beforeClass(TestSolrDeletionPolicy2.java:29)
Caused by: org.apache.solr.common.cloud.ZooKeeperException: 
	at org.apache.solr.core.CoreContainer.initZooKeeper(CoreContainer.java:183)
	at org.apache.solr.util.TestHarness$Initializer$1.<init>(TestHarness.java:184)
	at org.apache.solr.util.TestHarness$Initializer.initialize(TestHarness.java:179)
	at org.apache.solr.util.TestHarness.<init>(TestHarness.java:140)
Caused by: java.util.concurrent.TimeoutException: Could not connect to ZooKeeper 127.0.0.1:54597/solr within 5000 ms
	at org.apache.solr.common.cloud.ConnectionManager.waitForConnected(ConnectionManager.java:124)
	at org.apache.solr.common.cloud.SolrZkClient.<init>(SolrZkClient.java:121)
	at org.apache.solr.common.cloud.SolrZkClient.<init>(SolrZkClient.java:69)
	at org.apache.solr.cloud.ZkController.<init>(ZkController.java:104)
	at org.apache.solr.core.CoreContainer.initZooKeeper(CoreContainer.java:164)


REGRESSION:  org.apache.solr.core.TestXIncludeConfig.testXInclude

Error Message:
org.apache.solr.common.cloud.ZooKeeperException: 

Stack Trace:
java.lang.RuntimeException: org.apache.solr.common.cloud.ZooKeeperException: 
	at org.apache.solr.util.TestHarness.<init>(TestHarness.java:153)
	at org.apache.solr.util.TestHarness.<init>(TestHarness.java:135)
	at org.apache.solr.util.TestHarness.<init>(TestHarness.java:125)
	at org.apache.solr.util.AbstractSolrTestCase.setUp(AbstractSolrTestCase.java:132)
	at org.apache.solr.core.TestXIncludeConfig.setUp(TestXIncludeConfig.java:55)
	at org.apache.lucene.util.LuceneTestCase$LuceneTestCaseRunner.runChild(LuceneTestCase.java:1232)
	at org.apache.lucene.util.LuceneTestCase$LuceneTestCaseRunner.runChild(LuceneTestCase.java:1160)
Caused by: org.apache.solr.common.cloud.ZooKeeperException: 
	at org.apache.solr.core.CoreContainer.initZooKeeper(CoreContainer.java:183)
	at org.apache.solr.util.TestHarness$Initializer$1.<init>(TestHarness.java:184)
	at org.apache.solr.util.TestHarness$Initializer.initialize(TestHarness.java:179)
	at org.apache.solr.util.TestHarness.<init>(TestHarness.java:140)
Caused by: java.util.concurrent.TimeoutException: Could not connect to ZooKeeper 127.0.0.1:54597/solr within 5000 ms
	at org.apache.solr.common.cloud.ConnectionManager.waitForConnected(ConnectionManager.java:124)
	at org.apache.solr.common.cloud.SolrZkClient.<init>(SolrZkClient.java:121)
	at org.apache.solr.common.cloud.SolrZkClient.<init>(SolrZkClient.java:69)
	at org.apache.solr.cloud.ZkController.<init>(ZkController.java:104)
	at org.apache.solr.core.CoreContainer.initZooKeeper(CoreContainer.java:164)


FAILED:  junit.framework.TestSuite.org.apache.solr.handler.DocumentAnalysisRequestHandlerTest

Error Message:
org.apache.solr.common.cloud.ZooKeeperException: 

Stack Trace:
java.lang.RuntimeException: org.apache.solr.common.cloud.ZooKeeperException: 
	at org.apache.solr.util.TestHarness.<init>(TestHarness.java:153)
	at org.apache.solr.util.TestHarness.<init>(TestHarness.java:135)
	at org.apache.solr.util.TestHarness.<init>(TestHarness.java:125)
	at org.apache.solr.SolrTestCaseJ4.initCore(SolrTestCaseJ4.java:238)
	at org.apache.solr.SolrTestCaseJ4.initCore(SolrTestCaseJ4.java:101)
	at org.apache.solr.SolrTestCaseJ4.initCore(SolrTestCaseJ4.java:89)
	at org.apache.solr.handler.DocumentAnalysisRequestHandlerTest.beforeClass(DocumentAnalysisRequestHandlerTest.java:52)
Caused by: org.apache.solr.common.cloud.ZooKeeperException: 
	at org.apache.solr.core.CoreContainer.initZooKeeper(CoreContainer.java:183)
	at org.apache.solr.util.TestHarness$Initializer$1.<init>(TestHarness.java:184)
	at org.apache.solr.util.TestHarness$Initializer.initialize(TestHarness.java:179)
	at org.apache.solr.util.TestHarness.<init>(TestHarness.java:140)
Caused by: java.util.concurrent.TimeoutException: Could not connect to ZooKeeper 127.0.0.1:54597/solr within 5000 ms
	at org.apache.solr.common.cloud.ConnectionManager.waitForConnected(ConnectionManager.java:124)
	at org.apache.solr.common.cloud.SolrZkClient.<init>(SolrZkClient.java:121)
	at org.apache.solr.common.cloud.SolrZkClient.<init>(SolrZkClient.java:69)
	at org.apache.solr.cloud.ZkController.<init>(ZkController.java:104)
	at org.apache.solr.core.CoreContainer.initZooKeeper(CoreContainer.java:164)


FAILED:  junit.framework.TestSuite.org.apache.solr.handler.FieldAnalysisRequestHandlerTest

Error Message:
org.apache.solr.common.cloud.ZooKeeperException: 

Stack Trace:
java.lang.RuntimeException: org.apache.solr.common.cloud.ZooKeeperException: 
	at org.apache.solr.util.TestHarness.<init>(TestHarness.java:153)
	at org.apache.solr.util.TestHarness.<init>(TestHarness.java:135)
	at org.apache.solr.util.TestHarness.<init>(TestHarness.java:125)
	at org.apache.solr.SolrTestCaseJ4.initCore(SolrTestCaseJ4.java:238)
	at org.apache.solr.SolrTestCaseJ4.initCore(SolrTestCaseJ4.java:101)
	at org.apache.solr.SolrTestCaseJ4.initCore(SolrTestCaseJ4.java:89)
	at org.apache.solr.handler.FieldAnalysisRequestHandlerTest.beforeClass(FieldAnalysisRequestHandlerTest.java:54)
Caused by: org.apache.solr.common.cloud.ZooKeeperException: 
	at org.apache.solr.core.CoreContainer.initZooKeeper(CoreContainer.java:183)
	at org.apache.solr.util.TestHarness$Initializer$1.<init>(TestHarness.java:184)
	at org.apache.solr.util.TestHarness$Initializer.initialize(TestHarness.java:179)
	at org.apache.solr.util.TestHarness.<init>(TestHarness.java:140)
Caused by: java.util.concurrent.TimeoutException: Could not connect to ZooKeeper 127.0.0.1:54597/solr within 5000 ms
	at org.apache.solr.common.cloud.ConnectionManager.waitForConnected(ConnectionManager.java:124)
	at org.apache.solr.common.cloud.SolrZkClient.<init>(SolrZkClient.java:121)
	at org.apache.solr.common.cloud.SolrZkClient.<init>(SolrZkClient.java:69)
	at org.apache.solr.cloud.ZkController.<init>(ZkController.java:104)
	at org.apache.solr.core.CoreContainer.initZooKeeper(CoreContainer.java:164)


FAILED:  junit.framework.TestSuite.org.apache.solr.handler.JsonLoaderTest

Error Message:
org.apache.solr.common.cloud.ZooKeeperException: 

Stack Trace:
java.lang.RuntimeException: org.apache.solr.common.cloud.ZooKeeperException: 
	at org.apache.solr.util.TestHarness.<init>(TestHarness.java:153)
	at org.apache.solr.util.TestHarness.<init>(TestHarness.java:135)
	at org.apache.solr.util.TestHarness.<init>(TestHarness.java:125)
	at org.apache.solr.SolrTestCaseJ4.initCore(SolrTestCaseJ4.java:238)
	at org.apache.solr.SolrTestCaseJ4.initCore(SolrTestCaseJ4.java:101)
	at org.apache.solr.SolrTestCaseJ4.initCore(SolrTestCaseJ4.java:89)
	at org.apache.solr.handler.JsonLoaderTest.beforeTests(JsonLoaderTest.java:40)
Caused by: org.apache.solr.common.cloud.ZooKeeperException: 
	at org.apache.solr.core.CoreContainer.initZooKeeper(CoreContainer.java:183)
	at org.apache.solr.util.TestHarness$Initializer$1.<init>(TestHarness.java:184)
	at org.apache.solr.util.TestHarness$Initializer.initialize(TestHarness.java:179)
	at org.apache.solr.util.TestHarness.<init>(TestHarness.java:140)
Caused by: java.util.concurrent.TimeoutException: Could not connect to ZooKeeper 127.0.0.1:54597/solr within 5000 ms
	at org.apache.solr.common.cloud.ConnectionManager.waitForConnected(ConnectionManager.java:124)
	at org.apache.solr.common.cloud.SolrZkClient.<init>(SolrZkClient.java:121)
	at org.apache.solr.common.cloud.SolrZkClient.<init>(SolrZkClient.java:69)
	at org.apache.solr.cloud.ZkController.<init>(ZkController.java:104)
	at org.apache.solr.core.CoreContainer.initZooKeeper(CoreContainer.java:164)


FAILED:  junit.framework.TestSuite.org.apache.solr.handler.MoreLikeThisHandlerTest

Error Message:
org.apache.solr.common.cloud.ZooKeeperException: 

Stack Trace:
java.lang.RuntimeException: org.apache.solr.common.cloud.ZooKeeperException: 
	at org.apache.solr.util.TestHarness.<init>(TestHarness.java:153)
	at org.apache.solr.util.TestHarness.<init>(TestHarness.java:135)
	at org.apache.solr.util.TestHarness.<init>(TestHarness.java:125)
	at org.apache.solr.SolrTestCaseJ4.initCore(SolrTestCaseJ4.java:238)
	at org.apache.solr.SolrTestCaseJ4.initCore(SolrTestCaseJ4.java:101)
	at org.apache.solr.SolrTestCaseJ4.initCore(SolrTestCaseJ4.java:89)
	at org.apache.solr.handler.MoreLikeThisHandlerTest.moreLikeThisBeforeClass(MoreLikeThisHandlerTest.java:41)
Caused by: org.apache.solr.common.cloud.ZooKeeperException: 
	at org.apache.solr.core.CoreContainer.initZooKeeper(CoreContainer.java:183)
	at org.apache.solr.util.TestHarness$Initializer$1.<init>(TestHarness.java:184)
	at org.apache.solr.util.TestHarness$Initializer.initialize(TestHarness.java:179)
	at org.apache.solr.util.TestHarness.<init>(TestHarness.java:140)
Caused by: java.util.concurrent.TimeoutException: Could not connect to ZooKeeper 127.0.0.1:54597/solr within 5000 ms
	at org.apache.solr.common.cloud.ConnectionManager.waitForConnected(ConnectionManager.java:124)
	at org.apache.solr.common.cloud.SolrZkClient.<init>(SolrZkClient.java:121)
	at org.apache.solr.common.cloud.SolrZkClient.<init>(SolrZkClient.java:69)
	at org.apache.solr.cloud.ZkController.<init>(ZkController.java:104)
	at org.apache.solr.core.CoreContainer.initZooKeeper(CoreContainer.java:164)


REGRESSION:  org.apache.solr.handler.StandardRequestHandlerTest.testSorting

Error Message:
org.apache.solr.common.cloud.ZooKeeperException: 

Stack Trace:
java.lang.RuntimeException: org.apache.solr.common.cloud.ZooKeeperException: 
	at org.apache.solr.util.TestHarness.<init>(TestHarness.java:153)
	at org.apache.solr.util.TestHarness.<init>(TestHarness.java:135)
	at org.apache.solr.util.TestHarness.<init>(TestHarness.java:125)
	at org.apache.solr.util.AbstractSolrTestCase.setUp(AbstractSolrTestCase.java:132)
	at org.apache.solr.handler.StandardRequestHandlerTest.setUp(StandardRequestHandlerTest.java:40)
	at org.apache.lucene.util.LuceneTestCase$LuceneTestCaseRunner.runChild(LuceneTestCase.java:1232)
	at org.apache.lucene.util.LuceneTestCase$LuceneTestCaseRunner.runChild(LuceneTestCase.java:1160)
Caused by: org.apache.solr.common.cloud.ZooKeeperException: 
	at org.apache.solr.core.CoreContainer.initZooKeeper(CoreContainer.java:183)
	at org.apache.solr.util.TestHarness$Initializer$1.<init>(TestHarness.java:184)
	at org.apache.solr.util.TestHarness$Initializer.initialize(TestHarness.java:179)
	at org.apache.solr.util.TestHarness.<init>(TestHarness.java:140)
Caused by: java.util.concurrent.TimeoutException: Could not connect to ZooKeeper 127.0.0.1:54597/solr within 5000 ms
	at org.apache.solr.common.cloud.ConnectionManager.waitForConnected(ConnectionManager.java:124)
	at org.apache.solr.common.cloud.SolrZkClient.<init>(SolrZkClient.java:121)
	at org.apache.solr.common.cloud.SolrZkClient.<init>(SolrZkClient.java:69)
	at org.apache.solr.cloud.ZkController.<init>(ZkController.java:104)
	at org.apache.solr.core.CoreContainer.initZooKeeper(CoreContainer.java:164)


FAILED:  junit.framework.TestSuite.org.apache.solr.handler.TestCSVLoader

Error Message:
org.apache.solr.common.cloud.ZooKeeperException: 

Stack Trace:
java.lang.RuntimeException: org.apache.solr.common.cloud.ZooKeeperException: 
	at org.apache.solr.util.TestHarness.<init>(TestHarness.java:153)
	at org.apache.solr.util.TestHarness.<init>(TestHarness.java:135)
	at org.apache.solr.util.TestHarness.<init>(TestHarness.java:125)
	at org.apache.solr.SolrTestCaseJ4.initCore(SolrTestCaseJ4.java:238)
	at org.apache.solr.SolrTestCaseJ4.initCore(SolrTestCaseJ4.java:101)
	at org.apache.solr.SolrTestCaseJ4.initCore(SolrTestCaseJ4.java:89)
	at org.apache.solr.handler.TestCSVLoader.beforeClass(TestCSVLoader.java:38)
Caused by: org.apache.solr.common.cloud.ZooKeeperException: 
	at org.apache.solr.core.CoreContainer.initZooKeeper(CoreContainer.java:183)
	at org.apache.solr.util.TestHarness$Initializer$1.<init>(TestHarness.java:184)
	at org.apache.solr.util.TestHarness$Initializer.initialize(TestHarness.java:179)
	at org.apache.solr.util.TestHarness.<init>(TestHarness.java:140)
Caused by: java.util.concurrent.TimeoutException: Could not connect to ZooKeeper 127.0.0.1:54597/solr within 5000 ms
	at org.apache.solr.common.cloud.ConnectionManager.waitForConnected(ConnectionManager.java:124)
	at org.apache.solr.common.cloud.SolrZkClient.<init>(SolrZkClient.java:121)
	at org.apache.solr.common.cloud.SolrZkClient.<init>(SolrZkClient.java:69)
	at org.apache.solr.cloud.ZkController.<init>(ZkController.java:104)
	at org.apache.solr.core.CoreContainer.initZooKeeper(CoreContainer.java:164)


REGRESSION:  org.apache.solr.handler.TestReplicationHandler.testDetails

Error Message:
Severe errors in solr configuration.  Check your log files for more detailed information on what may be wrong.  ------------------------------------------------------------- org.apache.solr.common.cloud.ZooKeeperException:   at org.apache.solr.core.CoreContainer.initZooKeeper(CoreContainer.java:183)  at org.apache.solr.core.CoreContainer.load(CoreContainer.java:333)  at org.apache.solr.core.CoreContainer$Initializer.initialize(CoreContainer.java:242)  at org.apache.solr.servlet.SolrDispatchFilter.init(SolrDispatchFilter.java:93)  at org.mortbay.jetty.servlet.FilterHolder.doStart(FilterHolder.java:97)  at org.mortbay.component.AbstractLifeCycle.start(AbstractLifeCycle.java:50)  at org.mortbay.jetty.servlet.ServletHandler.initialize(ServletHandler.java:713)  at org.mortbay.jetty.servlet.ServletHandler.updateMappings(ServletHandler.java:1104)  at org.mortbay.jetty.servlet.ServletHandler.setFilterMappings(ServletHandler.java:1140)  at org.mortbay.jetty.servlet.ServletHandler.addFilterWithMapping(ServletHandler.java:940)  at org.mortbay.jetty.servlet.ServletHandler.addFilterWithMapping(ServletHandler.java:895)  at org.mortbay.jetty.servlet.Context.addFilter(Context.java:207)  at org.apache.solr.client.solrj.embedded.JettySolrRunner$1.lifeCycleStarted(JettySolrRunner.java:98)  at org.mortbay.component.AbstractLifeCycle.setStarted(AbstractLifeCycle.java:140)  at org.mortbay.component.AbstractLifeCycle.start(AbstractLifeCycle.java:52)  at org.apache.solr.client.solrj.embedded.JettySolrRunner.start(JettySolrRunner.java:123)  at org.apache.solr.client.solrj.embedded.JettySolrRunner.start(JettySolrRunner.java:118)  at org.apache.solr.handler.TestReplicationHandler.createJetty(TestReplicationHandler.java:110)  at org.apache.solr.handler.TestReplicationHandler.beforeClass(TestReplicationHandler.java:75)  at sun.reflect.NativeMethodAccessorImpl.invoke0(Native Method)  at sun.reflect.NativeMethodAccessorImpl.invoke(NativeMethodAccessorImpl.java:57)  at sun.reflect.DelegatingMethodAccessorImpl.invoke(DelegatingMethodAccessorImpl  Severe errors in solr configuration.  Check your log files for more detailed information on what may be wrong.  ------------------------------------------------------------- org.apache.solr.common.cloud.ZooKeeperException:   at org.apache.solr.core.CoreContainer.initZooKeeper(CoreContainer.java:183)  at org.apache.solr.core.CoreContainer.load(CoreContainer.java:333)  at org.apache.solr.core.CoreContainer$Initializer.initialize(CoreContainer.java:242)  at org.apache.solr.servlet.SolrDispatchFilter.init(SolrDispatchFilter.java:93)  at org.mortbay.jetty.servlet.FilterHolder.doStart(FilterHolder.java:97)  at org.mortbay.component.AbstractLifeCycle.start(AbstractLifeCycle.java:50)  at org.mortbay.jetty.servlet.ServletHandler.initialize(ServletHandler.java:713)  at org.mortbay.jetty.servlet.ServletHandler.updateMappings(ServletHandler.java:1104)  at org.mortbay.jetty.servlet.ServletHandler.setFilterMappings(ServletHandler.java:1140)  at org.mortbay.jetty.servlet.ServletHandler.addFilterWithMapping(ServletHandler.java:940)  at org.mortbay.jetty.servlet.ServletHandler.addFilterWithMapping(ServletHandler.java:895)  at org.mortbay.jetty.servlet.Context.addFilter(Context.java:207)  at org.apache.solr.client.solrj.embedded.JettySolrRunner$1.lifeCycleStarted(JettySolrRunner.java:98)  at org.mortbay.component.AbstractLifeCycle.setStarted(AbstractLifeCycle.java:140)  at org.mortbay.component.AbstractLifeCycle.start(AbstractLifeCycle.java:52)  at org.apache.solr.client.solrj.embedded.JettySolrRunner.start(JettySolrRunner.java:123)  at org.apache.solr.client.solrj.embedded.JettySolrRunner.start(JettySolrRunner.java:118)  at org.apache.solr.handler.TestReplicationHandler.createJetty(TestReplicationHandler.java:110)  at org.apache.solr.handler.TestReplicationHandler.beforeClass(TestReplicationHandler.java:75)  at sun.reflect.NativeMethodAccessorImpl.invoke0(Native Method)  at sun.reflect.NativeMethodAccessorImpl.invoke(NativeMethodAccessorImpl.java:57)  at sun.reflect.DelegatingMethodAccessorImpl.invoke(DelegatingMethodAccessorImpl  request: http://localhost:44427/solr/replication?command=details&qt=/replication&wt=javabin&version=2

Stack Trace:


request: http://localhost:44427/solr/replication?command=details&qt=/replication&wt=javabin&version=2
	at org.apache.solr.client.solrj.impl.CommonsHttpSolrServer.request(CommonsHttpSolrServer.java:436)
	at org.apache.solr.client.solrj.impl.CommonsHttpSolrServer.request(CommonsHttpSolrServer.java:245)
	at org.apache.solr.handler.TestReplicationHandler.getDetails(TestReplicationHandler.java:171)
	at org.apache.solr.handler.TestReplicationHandler.testDetails(TestReplicationHandler.java:186)
	at org.apache.lucene.util.LuceneTestCase$LuceneTestCaseRunner.runChild(LuceneTestCase.java:1232)
	at org.apache.lucene.util.LuceneTestCase$LuceneTestCaseRunner.runChild(LuceneTestCase.java:1160)


REGRESSION:  org.apache.solr.handler.TestReplicationHandler.testReplicateAfterWrite2Slave

Error Message:
Error executing query

Stack Trace:
org.apache.solr.client.solrj.SolrServerException: Error executing query
	at org.apache.solr.client.solrj.request.QueryRequest.process(QueryRequest.java:95)
	at org.apache.solr.client.solrj.SolrServer.query(SolrServer.java:119)
	at org.apache.solr.handler.TestReplicationHandler.query(TestReplicationHandler.java:142)
	at org.apache.solr.handler.TestReplicationHandler.clearIndexWithReplication(TestReplicationHandler.java:85)
	at org.apache.solr.handler.TestReplicationHandler.testReplicateAfterWrite2Slave(TestReplicationHandler.java:239)
	at org.apache.lucene.util.LuceneTestCase$LuceneTestCaseRunner.runChild(LuceneTestCase.java:1232)
	at org.apache.lucene.util.LuceneTestCase$LuceneTestCaseRunner.runChild(LuceneTestCase.java:1160)


request: http://localhost:44427/solr/select?q=*:*&wt=javabin&version=2
	at org.apache.solr.client.solrj.impl.CommonsHttpSolrServer.request(CommonsHttpSolrServer.java:436)
	at org.apache.solr.client.solrj.impl.CommonsHttpSolrServer.request(CommonsHttpSolrServer.java:245)
	at org.apache.solr.client.solrj.request.QueryRequest.process(QueryRequest.java:89)


REGRESSION:  org.apache.solr.handler.TestReplicationHandler.testIndexAndConfigReplication

Error Message:
Error executing query

Stack Trace:
org.apache.solr.client.solrj.SolrServerException: Error executing query
	at org.apache.solr.client.solrj.request.QueryRequest.process(QueryRequest.java:95)
	at org.apache.solr.client.solrj.SolrServer.query(SolrServer.java:119)
	at org.apache.solr.handler.TestReplicationHandler.query(TestReplicationHandler.java:142)
	at org.apache.solr.handler.TestReplicationHandler.clearIndexWithReplication(TestReplicationHandler.java:85)
	at org.apache.solr.handler.TestReplicationHandler.testIndexAndConfigReplication(TestReplicationHandler.java:304)
	at org.apache.lucene.util.LuceneTestCase$LuceneTestCaseRunner.runChild(LuceneTestCase.java:1232)
	at org.apache.lucene.util.LuceneTestCase$LuceneTestCaseRunner.runChild(LuceneTestCase.java:1160)


request: http://localhost:44427/solr/select?q=*:*&wt=javabin&version=2
	at org.apache.solr.client.solrj.impl.CommonsHttpSolrServer.request(CommonsHttpSolrServer.java:436)
	at org.apache.solr.client.solrj.impl.CommonsHttpSolrServer.request(CommonsHttpSolrServer.java:245)
	at org.apache.solr.client.solrj.request.QueryRequest.process(QueryRequest.java:89)


REGRESSION:  org.apache.solr.handler.TestReplicationHandler.testStopPoll

Error Message:
Error executing query

Stack Trace:
org.apache.solr.client.solrj.SolrServerException: Error executing query
	at org.apache.solr.client.solrj.request.QueryRequest.process(QueryRequest.java:95)
	at org.apache.solr.client.solrj.SolrServer.query(SolrServer.java:119)
	at org.apache.solr.handler.TestReplicationHandler.query(TestReplicationHandler.java:142)
	at org.apache.solr.handler.TestReplicationHandler.clearIndexWithReplication(TestReplicationHandler.java:85)
	at org.apache.solr.handler.TestReplicationHandler.testStopPoll(TestReplicationHandler.java:360)
	at org.apache.lucene.util.LuceneTestCase$LuceneTestCaseRunner.runChild(LuceneTestCase.java:1232)
	at org.apache.lucene.util.LuceneTestCase$LuceneTestCaseRunner.runChild(LuceneTestCase.java:1160)


request: http://localhost:44427/solr/select?q=*:*&wt=javabin&version=2
	at org.apache.solr.client.solrj.impl.CommonsHttpSolrServer.request(CommonsHttpSolrServer.java:436)
	at org.apache.solr.client.solrj.impl.CommonsHttpSolrServer.request(CommonsHttpSolrServer.java:245)
	at org.apache.solr.client.solrj.request.QueryRequest.process(QueryRequest.java:89)


REGRESSION:  org.apache.solr.handler.TestReplicationHandler.testSnapPullWithMasterUrl

Error Message:
Severe errors in solr configuration.  Check your log files for more detailed information on what may be wrong.  ------------------------------------------------------------- org.apache.solr.common.cloud.ZooKeeperException:   at org.apache.solr.core.CoreContainer.initZooKeeper(CoreContainer.java:183)  at org.apache.solr.core.CoreContainer.load(CoreContainer.java:333)  at org.apache.solr.core.CoreContainer$Initializer.initialize(CoreContainer.java:242)  at org.apache.solr.servlet.SolrDispatchFilter.init(SolrDispatchFilter.java:93)  at org.mortbay.jetty.servlet.FilterHolder.doStart(FilterHolder.java:97)  at org.mortbay.component.AbstractLifeCycle.start(AbstractLifeCycle.java:50)  at org.mortbay.jetty.servlet.ServletHandler.initialize(ServletHandler.java:713)  at org.mortbay.jetty.servlet.ServletHandler.updateMappings(ServletHandler.java:1104)  at org.mortbay.jetty.servlet.ServletHandler.setFilterMappings(ServletHandler.java:1140)  at org.mortbay.jetty.servlet.ServletHandler.addFilterWithMapping(ServletHandler.java:940)  at org.mortbay.jetty.servlet.ServletHandler.addFilterWithMapping(ServletHandler.java:895)  at org.mortbay.jetty.servlet.Context.addFilter(Context.java:207)  at org.apache.solr.client.solrj.embedded.JettySolrRunner$1.lifeCycleStarted(JettySolrRunner.java:98)  at org.mortbay.component.AbstractLifeCycle.setStarted(AbstractLifeCycle.java:140)  at org.mortbay.component.AbstractLifeCycle.start(AbstractLifeCycle.java:52)  at org.apache.solr.client.solrj.embedded.JettySolrRunner.start(JettySolrRunner.java:123)  at org.apache.solr.client.solrj.embedded.JettySolrRunner.start(JettySolrRunner.java:118)  at org.apache.solr.handler.TestReplicationHandler.createJetty(TestReplicationHandler.java:110)  at org.apache.solr.handler.TestReplicationHandler.beforeClass(TestReplicationHandler.java:75)  at sun.reflect.NativeMethodAccessorImpl.invoke0(Native Method)  at sun.reflect.NativeMethodAccessorImpl.invoke(NativeMethodAccessorImpl.java:57)  at sun.reflect.DelegatingMethodAccessorImpl.invoke(DelegatingMethodAccessorImpl  Severe errors in solr configuration.  Check your log files for more detailed information on what may be wrong.  ------------------------------------------------------------- org.apache.solr.common.cloud.ZooKeeperException:   at org.apache.solr.core.CoreContainer.initZooKeeper(CoreContainer.java:183)  at org.apache.solr.core.CoreContainer.load(CoreContainer.java:333)  at org.apache.solr.core.CoreContainer$Initializer.initialize(CoreContainer.java:242)  at org.apache.solr.servlet.SolrDispatchFilter.init(SolrDispatchFilter.java:93)  at org.mortbay.jetty.servlet.FilterHolder.doStart(FilterHolder.java:97)  at org.mortbay.component.AbstractLifeCycle.start(AbstractLifeCycle.java:50)  at org.mortbay.jetty.servlet.ServletHandler.initialize(ServletHandler.java:713)  at org.mortbay.jetty.servlet.ServletHandler.updateMappings(ServletHandler.java:1104)  at org.mortbay.jetty.servlet.ServletHandler.setFilterMappings(ServletHandler.java:1140)  at org.mortbay.jetty.servlet.ServletHandler.addFilterWithMapping(ServletHandler.java:940)  at org.mortbay.jetty.servlet.ServletHandler.addFilterWithMapping(ServletHandler.java:895)  at org.mortbay.jetty.servlet.Context.addFilter(Context.java:207)  at org.apache.solr.client.solrj.embedded.JettySolrRunner$1.lifeCycleStarted(JettySolrRunner.java:98)  at org.mortbay.component.AbstractLifeCycle.setStarted(AbstractLifeCycle.java:140)  at org.mortbay.component.AbstractLifeCycle.start(AbstractLifeCycle.java:52)  at org.apache.solr.client.solrj.embedded.JettySolrRunner.start(JettySolrRunner.java:123)  at org.apache.solr.client.solrj.embedded.JettySolrRunner.start(JettySolrRunner.java:118)  at org.apache.solr.handler.TestReplicationHandler.createJetty(TestReplicationHandler.java:110)  at org.apache.solr.handler.TestReplicationHandler.beforeClass(TestReplicationHandler.java:75)  at sun.reflect.NativeMethodAccessorImpl.invoke0(Native Method)  at sun.reflect.NativeMethodAccessorImpl.invoke(NativeMethodAccessorImpl.java:57)  at sun.reflect.DelegatingMethodAccessorImpl.invoke(DelegatingMethodAccessorImpl  request: http://localhost:44427/solr/update?wt=javabin&version=2

Stack Trace:


request: http://localhost:44427/solr/update?wt=javabin&version=2
	at org.apache.solr.client.solrj.impl.CommonsHttpSolrServer.request(CommonsHttpSolrServer.java:436)
	at org.apache.solr.client.solrj.impl.CommonsHttpSolrServer.request(CommonsHttpSolrServer.java:245)
	at org.apache.solr.client.solrj.request.AbstractUpdateRequest.process(AbstractUpdateRequest.java:105)
	at org.apache.solr.client.solrj.SolrServer.deleteByQuery(SolrServer.java:111)
	at org.apache.solr.handler.TestReplicationHandler.testSnapPullWithMasterUrl(TestReplicationHandler.java:435)
	at org.apache.lucene.util.LuceneTestCase$LuceneTestCaseRunner.runChild(LuceneTestCase.java:1232)
	at org.apache.lucene.util.LuceneTestCase$LuceneTestCaseRunner.runChild(LuceneTestCase.java:1160)


REGRESSION:  org.apache.solr.handler.TestReplicationHandler.testReplicateAfterStartup

Error Message:
Severe errors in solr configuration.  Check your log files for more detailed information on what may be wrong.  ------------------------------------------------------------- org.apache.solr.common.cloud.ZooKeeperException:   at org.apache.solr.core.CoreContainer.initZooKeeper(CoreContainer.java:183)  at org.apache.solr.core.CoreContainer.load(CoreContainer.java:333)  at org.apache.solr.core.CoreContainer$Initializer.initialize(CoreContainer.java:242)  at org.apache.solr.servlet.SolrDispatchFilter.init(SolrDispatchFilter.java:93)  at org.mortbay.jetty.servlet.FilterHolder.doStart(FilterHolder.java:97)  at org.mortbay.component.AbstractLifeCycle.start(AbstractLifeCycle.java:50)  at org.mortbay.jetty.servlet.ServletHandler.initialize(ServletHandler.java:713)  at org.mortbay.jetty.servlet.ServletHandler.updateMappings(ServletHandler.java:1104)  at org.mortbay.jetty.servlet.ServletHandler.setFilterMappings(ServletHandler.java:1140)  at org.mortbay.jetty.servlet.ServletHandler.addFilterWithMapping(ServletHandler.java:940)  at org.mortbay.jetty.servlet.ServletHandler.addFilterWithMapping(ServletHandler.java:895)  at org.mortbay.jetty.servlet.Context.addFilter(Context.java:207)  at org.apache.solr.client.solrj.embedded.JettySolrRunner$1.lifeCycleStarted(JettySolrRunner.java:98)  at org.mortbay.component.AbstractLifeCycle.setStarted(AbstractLifeCycle.java:140)  at org.mortbay.component.AbstractLifeCycle.start(AbstractLifeCycle.java:52)  at org.apache.solr.client.solrj.embedded.JettySolrRunner.start(JettySolrRunner.java:123)  at org.apache.solr.client.solrj.embedded.JettySolrRunner.start(JettySolrRunner.java:118)  at org.apache.solr.handler.TestReplicationHandler.createJetty(TestReplicationHandler.java:110)  at org.apache.solr.handler.TestReplicationHandler.beforeClass(TestReplicationHandler.java:75)  at sun.reflect.NativeMethodAccessorImpl.invoke0(Native Method)  at sun.reflect.NativeMethodAccessorImpl.invoke(NativeMethodAccessorImpl.java:57)  at sun.reflect.DelegatingMethodAccessorImpl.invoke(DelegatingMethodAccessorImpl  Severe errors in solr configuration.  Check your log files for more detailed information on what may be wrong.  ------------------------------------------------------------- org.apache.solr.common.cloud.ZooKeeperException:   at org.apache.solr.core.CoreContainer.initZooKeeper(CoreContainer.java:183)  at org.apache.solr.core.CoreContainer.load(CoreContainer.java:333)  at org.apache.solr.core.CoreContainer$Initializer.initialize(CoreContainer.java:242)  at org.apache.solr.servlet.SolrDispatchFilter.init(SolrDispatchFilter.java:93)  at org.mortbay.jetty.servlet.FilterHolder.doStart(FilterHolder.java:97)  at org.mortbay.component.AbstractLifeCycle.start(AbstractLifeCycle.java:50)  at org.mortbay.jetty.servlet.ServletHandler.initialize(ServletHandler.java:713)  at org.mortbay.jetty.servlet.ServletHandler.updateMappings(ServletHandler.java:1104)  at org.mortbay.jetty.servlet.ServletHandler.setFilterMappings(ServletHandler.java:1140)  at org.mortbay.jetty.servlet.ServletHandler.addFilterWithMapping(ServletHandler.java:940)  at org.mortbay.jetty.servlet.ServletHandler.addFilterWithMapping(ServletHandler.java:895)  at org.mortbay.jetty.servlet.Context.addFilter(Context.java:207)  at org.apache.solr.client.solrj.embedded.JettySolrRunner$1.lifeCycleStarted(JettySolrRunner.java:98)  at org.mortbay.component.AbstractLifeCycle.setStarted(AbstractLifeCycle.java:140)  at org.mortbay.component.AbstractLifeCycle.start(AbstractLifeCycle.java:52)  at org.apache.solr.client.solrj.embedded.JettySolrRunner.start(JettySolrRunner.java:123)  at org.apache.solr.client.solrj.embedded.JettySolrRunner.start(JettySolrRunner.java:118)  at org.apache.solr.handler.TestReplicationHandler.createJetty(TestReplicationHandler.java:110)  at org.apache.solr.handler.TestReplicationHandler.beforeClass(TestReplicationHandler.java:75)  at sun.reflect.NativeMethodAccessorImpl.invoke0(Native Method)  at sun.reflect.NativeMethodAccessorImpl.invoke(NativeMethodAccessorImpl.java:57)  at sun.reflect.DelegatingMethodAccessorImpl.invoke(DelegatingMethodAccessorImpl  request: http://localhost:44427/solr/update?wt=javabin&version=2

Stack Trace:


request: http://localhost:44427/solr/update?wt=javabin&version=2
	at org.apache.solr.client.solrj.impl.CommonsHttpSolrServer.request(CommonsHttpSolrServer.java:436)
	at org.apache.solr.client.solrj.impl.CommonsHttpSolrServer.request(CommonsHttpSolrServer.java:245)
	at org.apache.solr.client.solrj.request.AbstractUpdateRequest.process(AbstractUpdateRequest.java:105)
	at org.apache.solr.client.solrj.SolrServer.deleteByQuery(SolrServer.java:111)
	at org.apache.solr.handler.TestReplicationHandler.testReplicateAfterStartup(TestReplicationHandler.java:480)
	at org.apache.lucene.util.LuceneTestCase$LuceneTestCaseRunner.runChild(LuceneTestCase.java:1232)
	at org.apache.lucene.util.LuceneTestCase$LuceneTestCaseRunner.runChild(LuceneTestCase.java:1160)


REGRESSION:  org.apache.solr.handler.TestReplicationHandler.testIndexAndConfigAliasReplication

Error Message:
Error executing query

Stack Trace:
org.apache.solr.client.solrj.SolrServerException: Error executing query
	at org.apache.solr.client.solrj.request.QueryRequest.process(QueryRequest.java:95)
	at org.apache.solr.client.solrj.SolrServer.query(SolrServer.java:119)
	at org.apache.solr.handler.TestReplicationHandler.query(TestReplicationHandler.java:142)
	at org.apache.solr.handler.TestReplicationHandler.clearIndexWithReplication(TestReplicationHandler.java:85)
	at org.apache.solr.handler.TestReplicationHandler.testIndexAndConfigAliasReplication(TestReplicationHandler.java:534)
	at org.apache.lucene.util.LuceneTestCase$LuceneTestCaseRunner.runChild(LuceneTestCase.java:1232)
	at org.apache.lucene.util.LuceneTestCase$LuceneTestCaseRunner.runChild(LuceneTestCase.java:1160)


request: http://localhost:44427/solr/select?q=*:*&wt=javabin&version=2
	at org.apache.solr.client.solrj.impl.CommonsHttpSolrServer.request(CommonsHttpSolrServer.java:436)
	at org.apache.solr.client.solrj.impl.CommonsHttpSolrServer.request(CommonsHttpSolrServer.java:245)
	at org.apache.solr.client.solrj.request.QueryRequest.process(QueryRequest.java:89)


REGRESSION:  org.apache.solr.handler.TestReplicationHandler.testBackup

Error Message:
Severe errors in solr configuration.  Check your log files for more detailed information on what may be wrong.  ------------------------------------------------------------- org.apache.solr.common.cloud.ZooKeeperException:   at org.apache.solr.core.CoreContainer.initZooKeeper(CoreContainer.java:183)  at org.apache.solr.core.CoreContainer.load(CoreContainer.java:333)  at org.apache.solr.core.CoreContainer$Initializer.initialize(CoreContainer.java:242)  at org.apache.solr.servlet.SolrDispatchFilter.init(SolrDispatchFilter.java:93)  at org.mortbay.jetty.servlet.FilterHolder.doStart(FilterHolder.java:97)  at org.mortbay.component.AbstractLifeCycle.start(AbstractLifeCycle.java:50)  at org.mortbay.jetty.servlet.ServletHandler.initialize(ServletHandler.java:713)  at org.mortbay.jetty.servlet.ServletHandler.updateMappings(ServletHandler.java:1104)  at org.mortbay.jetty.servlet.ServletHandler.setFilterMappings(ServletHandler.java:1140)  at org.mortbay.jetty.servlet.ServletHandler.addFilterWithMapping(ServletHandler.java:940)  at org.mortbay.jetty.servlet.ServletHandler.addFilterWithMapping(ServletHandler.java:895)  at org.mortbay.jetty.servlet.Context.addFilter(Context.java:207)  at org.apache.solr.client.solrj.embedded.JettySolrRunner$1.lifeCycleStarted(JettySolrRunner.java:98)  at org.mortbay.component.AbstractLifeCycle.setStarted(AbstractLifeCycle.java:140)  at org.mortbay.component.AbstractLifeCycle.start(AbstractLifeCycle.java:52)  at org.apache.solr.client.solrj.embedded.JettySolrRunner.start(JettySolrRunner.java:123)  at org.apache.solr.client.solrj.embedded.JettySolrRunner.start(JettySolrRunner.java:118)  at org.apache.solr.handler.TestReplicationHandler.createJetty(TestReplicationHandler.java:110)  at org.apache.solr.handler.TestReplicationHandler.beforeClass(TestReplicationHandler.java:80)  at sun.reflect.NativeMethodAccessorImpl.invoke0(Native Method)  at sun.reflect.NativeMethodAccessorImpl.invoke(NativeMethodAccessorImpl.java:57)  at sun.reflect.DelegatingMethodAccessorImpl.invoke(DelegatingMethodAccessorImpl  Severe errors in solr configuration.  Check your log files for more detailed information on what may be wrong.  ------------------------------------------------------------- org.apache.solr.common.cloud.ZooKeeperException:   at org.apache.solr.core.CoreContainer.initZooKeeper(CoreContainer.java:183)  at org.apache.solr.core.CoreContainer.load(CoreContainer.java:333)  at org.apache.solr.core.CoreContainer$Initializer.initialize(CoreContainer.java:242)  at org.apache.solr.servlet.SolrDispatchFilter.init(SolrDispatchFilter.java:93)  at org.mortbay.jetty.servlet.FilterHolder.doStart(FilterHolder.java:97)  at org.mortbay.component.AbstractLifeCycle.start(AbstractLifeCycle.java:50)  at org.mortbay.jetty.servlet.ServletHandler.initialize(ServletHandler.java:713)  at org.mortbay.jetty.servlet.ServletHandler.updateMappings(ServletHandler.java:1104)  at org.mortbay.jetty.servlet.ServletHandler.setFilterMappings(ServletHandler.java:1140)  at org.mortbay.jetty.servlet.ServletHandler.addFilterWithMapping(ServletHandler.java:940)  at org.mortbay.jetty.servlet.ServletHandler.addFilterWithMapping(ServletHandler.java:895)  at org.mortbay.jetty.servlet.Context.addFilter(Context.java:207)  at org.apache.solr.client.solrj.embedded.JettySolrRunner$1.lifeCycleStarted(JettySolrRunner.java:98)  at org.mortbay.component.AbstractLifeCycle.setStarted(AbstractLifeCycle.java:140)  at org.mortbay.component.AbstractLifeCycle.start(AbstractLifeCycle.java:52)  at org.apache.solr.client.solrj.embedded.JettySolrRunner.start(JettySolrRunner.java:123)  at org.apache.solr.client.solrj.embedded.JettySolrRunner.start(JettySolrRunner.java:118)  at org.apache.solr.handler.TestReplicationHandler.createJetty(TestReplicationHandler.java:110)  at org.apache.solr.handler.TestReplicationHandler.beforeClass(TestReplicationHandler.java:80)  at sun.reflect.NativeMethodAccessorImpl.invoke0(Native Method)  at sun.reflect.NativeMethodAccessorImpl.invoke(NativeMethodAccessorImpl.java:57)  at sun.reflect.DelegatingMethodAccessorImpl.invoke(DelegatingMethodAccessorImpl  request: http://localhost:21782/solr/update?wt=javabin&version=2

Stack Trace:


request: http://localhost:21782/solr/update?wt=javabin&version=2
	at org.apache.solr.client.solrj.impl.CommonsHttpSolrServer.request(CommonsHttpSolrServer.java:436)
	at org.apache.solr.client.solrj.impl.CommonsHttpSolrServer.request(CommonsHttpSolrServer.java:245)
	at org.apache.solr.client.solrj.request.AbstractUpdateRequest.process(AbstractUpdateRequest.java:105)
	at org.apache.solr.client.solrj.SolrServer.deleteByQuery(SolrServer.java:111)
	at org.apache.solr.handler.TestReplicationHandler.testBackup(TestReplicationHandler.java:617)
	at org.apache.lucene.util.LuceneTestCase$LuceneTestCaseRunner.runChild(LuceneTestCase.java:1232)
	at org.apache.lucene.util.LuceneTestCase$LuceneTestCaseRunner.runChild(LuceneTestCase.java:1160)


FAILED:  junit.framework.TestSuite.org.apache.solr.handler.XmlUpdateRequestHandlerTest

Error Message:
org.apache.solr.common.cloud.ZooKeeperException: 

Stack Trace:
java.lang.RuntimeException: org.apache.solr.common.cloud.ZooKeeperException: 
	at org.apache.solr.util.TestHarness.<init>(TestHarness.java:153)
	at org.apache.solr.util.TestHarness.<init>(TestHarness.java:135)
	at org.apache.solr.util.TestHarness.<init>(TestHarness.java:125)
	at org.apache.solr.SolrTestCaseJ4.initCore(SolrTestCaseJ4.java:238)
	at org.apache.solr.SolrTestCaseJ4.initCore(SolrTestCaseJ4.java:101)
	at org.apache.solr.SolrTestCaseJ4.initCore(SolrTestCaseJ4.java:89)
	at org.apache.solr.handler.XmlUpdateRequestHandlerTest.beforeTests(XmlUpdateRequestHandlerTest.java:36)
Caused by: org.apache.solr.common.cloud.ZooKeeperException: 
	at org.apache.solr.core.CoreContainer.initZooKeeper(CoreContainer.java:183)
	at org.apache.solr.util.TestHarness$Initializer$1.<init>(TestHarness.java:184)
	at org.apache.solr.util.TestHarness$Initializer.initialize(TestHarness.java:179)
	at org.apache.solr.util.TestHarness.<init>(TestHarness.java:140)
Caused by: java.util.concurrent.TimeoutException: Could not connect to ZooKeeper 127.0.0.1:54597/solr within 5000 ms
	at org.apache.solr.common.cloud.ConnectionManager.waitForConnected(ConnectionManager.java:124)
	at org.apache.solr.common.cloud.SolrZkClient.<init>(SolrZkClient.java:121)
	at org.apache.solr.common.cloud.SolrZkClient.<init>(SolrZkClient.java:69)
	at org.apache.solr.cloud.ZkController.<init>(ZkController.java:104)
	at org.apache.solr.core.CoreContainer.initZooKeeper(CoreContainer.java:164)


REGRESSION:  org.apache.solr.handler.admin.LukeRequestHandlerTest.testLuke

Error Message:
org.apache.solr.common.cloud.ZooKeeperException: 

Stack Trace:
java.lang.RuntimeException: org.apache.solr.common.cloud.ZooKeeperException: 
	at org.apache.solr.util.TestHarness.<init>(TestHarness.java:153)
	at org.apache.solr.util.TestHarness.<init>(TestHarness.java:135)
	at org.apache.solr.util.TestHarness.<init>(TestHarness.java:125)
	at org.apache.solr.util.AbstractSolrTestCase.setUp(AbstractSolrTestCase.java:132)
	at org.apache.lucene.util.LuceneTestCase$LuceneTestCaseRunner.runChild(LuceneTestCase.java:1232)
	at org.apache.lucene.util.LuceneTestCase$LuceneTestCaseRunner.runChild(LuceneTestCase.java:1160)
Caused by: org.apache.solr.common.cloud.ZooKeeperException: 
	at org.apache.solr.core.CoreContainer.initZooKeeper(CoreContainer.java:183)
	at org.apache.solr.util.TestHarness$Initializer$1.<init>(TestHarness.java:184)
	at org.apache.solr.util.TestHarness$Initializer.initialize(TestHarness.java:179)
	at org.apache.solr.util.TestHarness.<init>(TestHarness.java:140)
Caused by: java.util.concurrent.TimeoutException: Could not connect to ZooKeeper 127.0.0.1:54597/solr within 5000 ms
	at org.apache.solr.common.cloud.ConnectionManager.waitForConnected(ConnectionManager.java:124)
	at org.apache.solr.common.cloud.SolrZkClient.<init>(SolrZkClient.java:121)
	at org.apache.solr.common.cloud.SolrZkClient.<init>(SolrZkClient.java:69)
	at org.apache.solr.cloud.ZkController.<init>(ZkController.java:104)
	at org.apache.solr.core.CoreContainer.initZooKeeper(CoreContainer.java:164)


FAILED:  junit.framework.TestSuite.org.apache.solr.handler.component.DebugComponentTest

Error Message:
org.apache.solr.common.cloud.ZooKeeperException: 

Stack Trace:
java.lang.RuntimeException: org.apache.solr.common.cloud.ZooKeeperException: 
	at org.apache.solr.util.TestHarness.<init>(TestHarness.java:153)
	at org.apache.solr.util.TestHarness.<init>(TestHarness.java:135)
	at org.apache.solr.util.TestHarness.<init>(TestHarness.java:125)
	at org.apache.solr.SolrTestCaseJ4.initCore(SolrTestCaseJ4.java:238)
	at org.apache.solr.SolrTestCaseJ4.initCore(SolrTestCaseJ4.java:101)
	at org.apache.solr.SolrTestCaseJ4.initCore(SolrTestCaseJ4.java:89)
	at org.apache.solr.handler.component.DebugComponentTest.beforeClass(DebugComponentTest.java:32)
Caused by: org.apache.solr.common.cloud.ZooKeeperException: 
	at org.apache.solr.core.CoreContainer.initZooKeeper(CoreContainer.java:183)
	at org.apache.solr.util.TestHarness$Initializer$1.<init>(TestHarness.java:184)
	at org.apache.solr.util.TestHarness$Initializer.initialize(TestHarness.java:179)
	at org.apache.solr.util.TestHarness.<init>(TestHarness.java:140)
Caused by: java.util.concurrent.TimeoutException: Could not connect to ZooKeeper 127.0.0.1:54597/solr within 5000 ms
	at org.apache.solr.common.cloud.ConnectionManager.waitForConnected(ConnectionManager.java:124)
	at org.apache.solr.common.cloud.SolrZkClient.<init>(SolrZkClient.java:121)
	at org.apache.solr.common.cloud.SolrZkClient.<init>(SolrZkClient.java:69)
	at org.apache.solr.cloud.ZkController.<init>(ZkController.java:104)
	at org.apache.solr.core.CoreContainer.initZooKeeper(CoreContainer.java:164)


REGRESSION:  org.apache.solr.handler.component.DistributedSpellCheckComponentTest.testDistribSearch

Error Message:
Severe errors in solr configuration.  Check your log files for more detailed information on what may be wrong.  ------------------------------------------------------------- org.apache.solr.common.cloud.ZooKeeperException:   at org.apache.solr.core.CoreContainer.initZooKeeper(CoreContainer.java:183)  at org.apache.solr.core.CoreContainer.load(CoreContainer.java:333)  at org.apache.solr.core.CoreContainer$Initializer.initialize(CoreContainer.java:242)  at org.apache.solr.servlet.SolrDispatchFilter.init(SolrDispatchFilter.java:93)  at org.mortbay.jetty.servlet.FilterHolder.doStart(FilterHolder.java:97)  at org.mortbay.component.AbstractLifeCycle.start(AbstractLifeCycle.java:50)  at org.mortbay.jetty.servlet.ServletHandler.initialize(ServletHandler.java:713)  at org.mortbay.jetty.servlet.ServletHandler.updateMappings(ServletHandler.java:1104)  at org.mortbay.jetty.servlet.ServletHandler.setFilterMappings(ServletHandler.java:1140)  at org.mortbay.jetty.servlet.ServletHandler.addFilterWithMapping(ServletHandler.java:940)  at org.mortbay.jetty.servlet.ServletHandler.addFilterWithMapping(ServletHandler.java:895)  at org.mortbay.jetty.servlet.Context.addFilter(Context.java:207)  at org.apache.solr.client.solrj.embedded.JettySolrRunner$1.lifeCycleStarted(JettySolrRunner.java:98)  at org.mortbay.component.AbstractLifeCycle.setStarted(AbstractLifeCycle.java:140)  at org.mortbay.component.AbstractLifeCycle.start(AbstractLifeCycle.java:52)  at org.apache.solr.client.solrj.embedded.JettySolrRunner.start(JettySolrRunner.java:123)  at org.apache.solr.client.solrj.embedded.JettySolrRunner.start(JettySolrRunner.java:118)  at org.apache.solr.handler.TestReplicationHandler.createJetty(TestReplicationHandler.java:110)  at org.apache.solr.handler.TestReplicationHandler.beforeClass(TestReplicationHandler.java:80)  at sun.reflect.NativeMethodAccessorImpl.invoke0(Native Method)  at sun.reflect.NativeMethodAccessorImpl.invoke(NativeMethodAccessorImpl.java:57)  at sun.reflect.DelegatingMethodAccessorImpl.invoke(DelegatingMethodAccessorImpl  Severe errors in solr configuration.  Check your log files for more detailed information on what may be wrong.  ------------------------------------------------------------- org.apache.solr.common.cloud.ZooKeeperException:   at org.apache.solr.core.CoreContainer.initZooKeeper(CoreContainer.java:183)  at org.apache.solr.core.CoreContainer.load(CoreContainer.java:333)  at org.apache.solr.core.CoreContainer$Initializer.initialize(CoreContainer.java:242)  at org.apache.solr.servlet.SolrDispatchFilter.init(SolrDispatchFilter.java:93)  at org.mortbay.jetty.servlet.FilterHolder.doStart(FilterHolder.java:97)  at org.mortbay.component.AbstractLifeCycle.start(AbstractLifeCycle.java:50)  at org.mortbay.jetty.servlet.ServletHandler.initialize(ServletHandler.java:713)  at org.mortbay.jetty.servlet.ServletHandler.updateMappings(ServletHandler.java:1104)  at org.mortbay.jetty.servlet.ServletHandler.setFilterMappings(ServletHandler.java:1140)  at org.mortbay.jetty.servlet.ServletHandler.addFilterWithMapping(ServletHandler.java:940)  at org.mortbay.jetty.servlet.ServletHandler.addFilterWithMapping(ServletHandler.java:895)  at org.mortbay.jetty.servlet.Context.addFilter(Context.java:207)  at org.apache.solr.client.solrj.embedded.JettySolrRunner$1.lifeCycleStarted(JettySolrRunner.java:98)  at org.mortbay.component.AbstractLifeCycle.setStarted(AbstractLifeCycle.java:140)  at org.mortbay.component.AbstractLifeCycle.start(AbstractLifeCycle.java:52)  at org.apache.solr.client.solrj.embedded.JettySolrRunner.start(JettySolrRunner.java:123)  at org.apache.solr.client.solrj.embedded.JettySolrRunner.start(JettySolrRunner.java:118)  at org.apache.solr.handler.TestReplicationHandler.createJetty(TestReplicationHandler.java:110)  at org.apache.solr.handler.TestReplicationHandler.beforeClass(TestReplicationHandler.java:80)  at sun.reflect.NativeMethodAccessorImpl.invoke0(Native Method)  at sun.reflect.NativeMethodAccessorImpl.invoke(NativeMethodAccessorImpl.java:57)  at sun.reflect.DelegatingMethodAccessorImpl.invoke(DelegatingMethodAccessorImpl  request: http://localhost:61412/solr/update?wt=javabin&version=2

Stack Trace:


request: http://localhost:61412/solr/update?wt=javabin&version=2
	at org.apache.solr.client.solrj.impl.CommonsHttpSolrServer.request(CommonsHttpSolrServer.java:436)
	at org.apache.solr.client.solrj.impl.CommonsHttpSolrServer.request(CommonsHttpSolrServer.java:245)
	at org.apache.solr.client.solrj.request.AbstractUpdateRequest.process(AbstractUpdateRequest.java:105)
	at org.apache.solr.client.solrj.SolrServer.deleteByQuery(SolrServer.java:111)
	at org.apache.solr.BaseDistributedSearchTestCase.del(BaseDistributedSearchTestCase.java:305)
	at org.apache.solr.handler.component.DistributedSpellCheckComponentTest.doTest(DistributedSpellCheckComponentTest.java:75)
	at org.apache.solr.BaseDistributedSearchTestCase.testDistribSearch(BaseDistributedSearchTestCase.java:599)
	at org.apache.lucene.util.LuceneTestCase$LuceneTestCaseRunner.runChild(LuceneTestCase.java:1232)
	at org.apache.lucene.util.LuceneTestCase$LuceneTestCaseRunner.runChild(LuceneTestCase.java:1160)


REGRESSION:  org.apache.solr.handler.component.DistributedTermsComponentTest.testDistribSearch

Error Message:
Severe errors in solr configuration.  Check your log files for more detailed information on what may be wrong.  ------------------------------------------------------------- org.apache.solr.common.cloud.ZooKeeperException:   at org.apache.solr.core.CoreContainer.initZooKeeper(CoreContainer.java:183)  at org.apache.solr.core.CoreContainer.load(CoreContainer.java:333)  at org.apache.solr.core.CoreContainer.load(CoreContainer.java:290)  at org.apache.solr.core.CoreContainer$Initializer.initialize(CoreContainer.java:239)  at org.apache.solr.servlet.SolrDispatchFilter.init(SolrDispatchFilter.java:93)  at org.mortbay.jetty.servlet.FilterHolder.doStart(FilterHolder.java:97)  at org.mortbay.component.AbstractLifeCycle.start(AbstractLifeCycle.java:50)  at org.mortbay.jetty.servlet.ServletHandler.initialize(ServletHandler.java:713)  at org.mortbay.jetty.servlet.ServletHandler.updateMappings(ServletHandler.java:1104)  at org.mortbay.jetty.servlet.ServletHandler.setFilterMappings(ServletHandler.java:1140)  at org.mortbay.jetty.servlet.ServletHandler.addFilterWithMapping(ServletHandler.java:940)  at org.mortbay.jetty.servlet.ServletHandler.addFilterWithMapping(ServletHandler.java:895)  at org.mortbay.jetty.servlet.Context.addFilter(Context.java:207)  at org.apache.solr.client.solrj.embedded.JettySolrRunner$1.lifeCycleStarted(JettySolrRunner.java:98)  at org.mortbay.component.AbstractLifeCycle.setStarted(AbstractLifeCycle.java:140)  at org.mortbay.component.AbstractLifeCycle.start(AbstractLifeCycle.java:52)  at org.apache.solr.client.solrj.embedded.JettySolrRunner.start(JettySolrRunner.java:123)  at org.apache.solr.client.solrj.embedded.JettySolrRunner.start(JettySolrRunner.java:118)  at org.apache.solr.BaseDistributedSearchTestCase.createJetty(BaseDistributedSearchTestCase.java:245)  at org.apache.solr.BaseDistributedSearchTestCase.createJetty(BaseDistributedSearchTestCase.java:232)  at org.apache.solr.BaseDistributedSearchTestCase.createServers(BaseDistributedSearchTestCase.java:185)  at org.apache.solr.BaseDistributedSearch  Severe errors in solr configuration.  Check your log files for more detailed information on what may be wrong.  ------------------------------------------------------------- org.apache.solr.common.cloud.ZooKeeperException:   at org.apache.solr.core.CoreContainer.initZooKeeper(CoreContainer.java:183)  at org.apache.solr.core.CoreContainer.load(CoreContainer.java:333)  at org.apache.solr.core.CoreContainer.load(CoreContainer.java:290)  at org.apache.solr.core.CoreContainer$Initializer.initialize(CoreContainer.java:239)  at org.apache.solr.servlet.SolrDispatchFilter.init(SolrDispatchFilter.java:93)  at org.mortbay.jetty.servlet.FilterHolder.doStart(FilterHolder.java:97)  at org.mortbay.component.AbstractLifeCycle.start(AbstractLifeCycle.java:50)  at org.mortbay.jetty.servlet.ServletHandler.initialize(ServletHandler.java:713)  at org.mortbay.jetty.servlet.ServletHandler.updateMappings(ServletHandler.java:1104)  at org.mortbay.jetty.servlet.ServletHandler.setFilterMappings(ServletHandler.java:1140)  at org.mortbay.jetty.servlet.ServletHandler.addFilterWithMapping(ServletHandler.java:940)  at org.mortbay.jetty.servlet.ServletHandler.addFilterWithMapping(ServletHandler.java:895)  at org.mortbay.jetty.servlet.Context.addFilter(Context.java:207)  at org.apache.solr.client.solrj.embedded.JettySolrRunner$1.lifeCycleStarted(JettySolrRunner.java:98)  at org.mortbay.component.AbstractLifeCycle.setStarted(AbstractLifeCycle.java:140)  at org.mortbay.component.AbstractLifeCycle.start(AbstractLifeCycle.java:52)  at org.apache.solr.client.solrj.embedded.JettySolrRunner.start(JettySolrRunner.java:123)  at org.apache.solr.client.solrj.embedded.JettySolrRunner.start(JettySolrRunner.java:118)  at org.apache.solr.BaseDistributedSearchTestCase.createJetty(BaseDistributedSearchTestCase.java:245)  at org.apache.solr.BaseDistributedSearchTestCase.createJetty(BaseDistributedSearchTestCase.java:232)  at org.apache.solr.BaseDistributedSearchTestCase.createServers(BaseDistributedSearchTestCase.java:185)  at org.apache.solr.BaseDistributedSearch  request: http://localhost:45677/solr/update?wt=javabin&version=2

Stack Trace:


request: http://localhost:45677/solr/update?wt=javabin&version=2
	at org.apache.solr.client.solrj.impl.CommonsHttpSolrServer.request(CommonsHttpSolrServer.java:436)
	at org.apache.solr.client.solrj.impl.CommonsHttpSolrServer.request(CommonsHttpSolrServer.java:245)
	at org.apache.solr.client.solrj.request.AbstractUpdateRequest.process(AbstractUpdateRequest.java:105)
	at org.apache.solr.client.solrj.SolrServer.deleteByQuery(SolrServer.java:111)
	at org.apache.solr.BaseDistributedSearchTestCase.del(BaseDistributedSearchTestCase.java:305)
	at org.apache.solr.handler.component.DistributedTermsComponentTest.doTest(DistributedTermsComponentTest.java:32)
	at org.apache.solr.BaseDistributedSearchTestCase.testDistribSearch(BaseDistributedSearchTestCase.java:599)
	at org.apache.lucene.util.LuceneTestCase$LuceneTestCaseRunner.runChild(LuceneTestCase.java:1232)
	at org.apache.lucene.util.LuceneTestCase$LuceneTestCaseRunner.runChild(LuceneTestCase.java:1160)


FAILED:  junit.framework.TestSuite.org.apache.solr.handler.component.QueryElevationComponentTest

Error Message:
org.apache.solr.common.cloud.ZooKeeperException: 

Stack Trace:
java.lang.RuntimeException: org.apache.solr.common.cloud.ZooKeeperException: 
	at org.apache.solr.util.TestHarness.<init>(TestHarness.java:153)
	at org.apache.solr.util.TestHarness.<init>(TestHarness.java:135)
	at org.apache.solr.util.TestHarness.<init>(TestHarness.java:125)
	at org.apache.solr.SolrTestCaseJ4.initCore(SolrTestCaseJ4.java:238)
	at org.apache.solr.SolrTestCaseJ4.initCore(SolrTestCaseJ4.java:101)
	at org.apache.solr.SolrTestCaseJ4.initCore(SolrTestCaseJ4.java:89)
	at org.apache.solr.handler.component.QueryElevationComponentTest.beforeClass(QueryElevationComponentTest.java:48)
Caused by: org.apache.solr.common.cloud.ZooKeeperException: 
	at org.apache.solr.core.CoreContainer.initZooKeeper(CoreContainer.java:183)
	at org.apache.solr.util.TestHarness$Initializer$1.<init>(TestHarness.java:184)
	at org.apache.solr.util.TestHarness$Initializer.initialize(TestHarness.java:179)
	at org.apache.solr.util.TestHarness.<init>(TestHarness.java:140)
Caused by: java.util.concurrent.TimeoutException: Could not connect to ZooKeeper 127.0.0.1:54597/solr within 5000 ms
	at org.apache.solr.common.cloud.ConnectionManager.waitForConnected(ConnectionManager.java:124)
	at org.apache.solr.common.cloud.SolrZkClient.<init>(SolrZkClient.java:121)
	at org.apache.solr.common.cloud.SolrZkClient.<init>(SolrZkClient.java:69)
	at org.apache.solr.cloud.ZkController.<init>(ZkController.java:104)
	at org.apache.solr.core.CoreContainer.initZooKeeper(CoreContainer.java:164)


FAILED:  junit.framework.TestSuite.org.apache.solr.handler.component.SearchHandlerTest

Error Message:
org.apache.solr.common.cloud.ZooKeeperException: 

Stack Trace:
java.lang.RuntimeException: org.apache.solr.common.cloud.ZooKeeperException: 
	at org.apache.solr.util.TestHarness.<init>(TestHarness.java:153)
	at org.apache.solr.util.TestHarness.<init>(TestHarness.java:135)
	at org.apache.solr.util.TestHarness.<init>(TestHarness.java:125)
	at org.apache.solr.SolrTestCaseJ4.initCore(SolrTestCaseJ4.java:238)
	at org.apache.solr.SolrTestCaseJ4.initCore(SolrTestCaseJ4.java:101)
	at org.apache.solr.SolrTestCaseJ4.initCore(SolrTestCaseJ4.java:89)
	at org.apache.solr.handler.component.SearchHandlerTest.beforeTests(SearchHandlerTest.java:34)
Caused by: org.apache.solr.common.cloud.ZooKeeperException: 
	at org.apache.solr.core.CoreContainer.initZooKeeper(CoreContainer.java:183)
	at org.apache.solr.util.TestHarness$Initializer$1.<init>(TestHarness.java:184)
	at org.apache.solr.util.TestHarness$Initializer.initialize(TestHarness.java:179)
	at org.apache.solr.util.TestHarness.<init>(TestHarness.java:140)
Caused by: java.util.concurrent.TimeoutException: Could not connect to ZooKeeper 127.0.0.1:54597/solr within 5000 ms
	at org.apache.solr.common.cloud.ConnectionManager.waitForConnected(ConnectionManager.java:124)
	at org.apache.solr.common.cloud.SolrZkClient.<init>(SolrZkClient.java:121)
	at org.apache.solr.common.cloud.SolrZkClient.<init>(SolrZkClient.java:69)
	at org.apache.solr.cloud.ZkController.<init>(ZkController.java:104)
	at org.apache.solr.core.CoreContainer.initZooKeeper(CoreContainer.java:164)


FAILED:  junit.framework.TestSuite.org.apache.solr.handler.component.SpellCheckComponentTest

Error Message:
org.apache.solr.common.cloud.ZooKeeperException: 

Stack Trace:
java.lang.RuntimeException: org.apache.solr.common.cloud.ZooKeeperException: 
	at org.apache.solr.util.TestHarness.<init>(TestHarness.java:153)
	at org.apache.solr.util.TestHarness.<init>(TestHarness.java:135)
	at org.apache.solr.util.TestHarness.<init>(TestHarness.java:125)
	at org.apache.solr.SolrTestCaseJ4.initCore(SolrTestCaseJ4.java:238)
	at org.apache.solr.SolrTestCaseJ4.initCore(SolrTestCaseJ4.java:101)
	at org.apache.solr.SolrTestCaseJ4.initCore(SolrTestCaseJ4.java:89)
	at org.apache.solr.handler.component.SpellCheckComponentTest.beforeClass(SpellCheckComponentTest.java:42)
Caused by: org.apache.solr.common.cloud.ZooKeeperException: 
	at org.apache.solr.core.CoreContainer.initZooKeeper(CoreContainer.java:183)
	at org.apache.solr.util.TestHarness$Initializer$1.<init>(TestHarness.java:184)
	at org.apache.solr.util.TestHarness$Initializer.initialize(TestHarness.java:179)
	at org.apache.solr.util.TestHarness.<init>(TestHarness.java:140)
Caused by: java.util.concurrent.TimeoutException: Could not connect to ZooKeeper 127.0.0.1:54597/solr within 5000 ms
	at org.apache.solr.common.cloud.ConnectionManager.waitForConnected(ConnectionManager.java:124)
	at org.apache.solr.common.cloud.SolrZkClient.<init>(SolrZkClient.java:121)
	at org.apache.solr.common.cloud.SolrZkClient.<init>(SolrZkClient.java:69)
	at org.apache.solr.cloud.ZkController.<init>(ZkController.java:104)
	at org.apache.solr.core.CoreContainer.initZooKeeper(CoreContainer.java:164)


REGRESSION:  org.apache.solr.handler.component.StatsComponentTest.testStats

Error Message:
org.apache.solr.common.cloud.ZooKeeperException: 

Stack Trace:
java.lang.RuntimeException: org.apache.solr.common.cloud.ZooKeeperException: 
	at org.apache.solr.util.TestHarness.<init>(TestHarness.java:153)
	at org.apache.solr.util.TestHarness.<init>(TestHarness.java:135)
	at org.apache.solr.util.TestHarness.<init>(TestHarness.java:125)
	at org.apache.solr.util.AbstractSolrTestCase.setUp(AbstractSolrTestCase.java:132)
	at org.apache.solr.handler.component.StatsComponentTest.setUp(StatsComponentTest.java:38)
	at org.apache.lucene.util.LuceneTestCase$LuceneTestCaseRunner.runChild(LuceneTestCase.java:1232)
	at org.apache.lucene.util.LuceneTestCase$LuceneTestCaseRunner.runChild(LuceneTestCase.java:1160)
Caused by: org.apache.solr.common.cloud.ZooKeeperException: 
	at org.apache.solr.core.CoreContainer.initZooKeeper(CoreContainer.java:183)
	at org.apache.solr.util.TestHarness$Initializer$1.<init>(TestHarness.java:184)
	at org.apache.solr.util.TestHarness$Initializer.initialize(TestHarness.java:179)
	at org.apache.solr.util.TestHarness.<init>(TestHarness.java:140)
Caused by: java.util.concurrent.TimeoutException: Could not connect to ZooKeeper 127.0.0.1:54597/solr within 5000 ms
	at org.apache.solr.common.cloud.ConnectionManager.waitForConnected(ConnectionManager.java:124)
	at org.apache.solr.common.cloud.SolrZkClient.<init>(SolrZkClient.java:121)
	at org.apache.solr.common.cloud.SolrZkClient.<init>(SolrZkClient.java:69)
	at org.apache.solr.cloud.ZkController.<init>(ZkController.java:104)
	at org.apache.solr.core.CoreContainer.initZooKeeper(CoreContainer.java:164)


FAILED:  junit.framework.TestSuite.org.apache.solr.handler.component.TermVectorComponentTest

Error Message:
org.apache.solr.common.cloud.ZooKeeperException: 

Stack Trace:
java.lang.RuntimeException: org.apache.solr.common.cloud.ZooKeeperException: 
	at org.apache.solr.util.TestHarness.<init>(TestHarness.java:153)
	at org.apache.solr.util.TestHarness.<init>(TestHarness.java:135)
	at org.apache.solr.util.TestHarness.<init>(TestHarness.java:125)
	at org.apache.solr.SolrTestCaseJ4.initCore(SolrTestCaseJ4.java:238)
	at org.apache.solr.SolrTestCaseJ4.initCore(SolrTestCaseJ4.java:101)
	at org.apache.solr.SolrTestCaseJ4.initCore(SolrTestCaseJ4.java:89)
	at org.apache.solr.handler.component.TermVectorComponentTest.beforeClass(TermVectorComponentTest.java:42)
Caused by: org.apache.solr.common.cloud.ZooKeeperException: 
	at org.apache.solr.core.CoreContainer.initZooKeeper(CoreContainer.java:183)
	at org.apache.solr.util.TestHarness$Initializer$1.<init>(TestHarness.java:184)
	at org.apache.solr.util.TestHarness$Initializer.initialize(TestHarness.java:179)
	at org.apache.solr.util.TestHarness.<init>(TestHarness.java:140)
Caused by: java.util.concurrent.TimeoutException: Could not connect to ZooKeeper 127.0.0.1:54597/solr within 5000 ms
	at org.apache.solr.common.cloud.ConnectionManager.waitForConnected(ConnectionManager.java:124)
	at org.apache.solr.common.cloud.SolrZkClient.<init>(SolrZkClient.java:121)
	at org.apache.solr.common.cloud.SolrZkClient.<init>(SolrZkClient.java:69)
	at org.apache.solr.cloud.ZkController.<init>(ZkController.java:104)
	at org.apache.solr.core.CoreContainer.initZooKeeper(CoreContainer.java:164)


FAILED:  junit.framework.TestSuite.org.apache.solr.handler.component.TermsComponentTest

Error Message:
org.apache.solr.common.cloud.ZooKeeperException: 

Stack Trace:
java.lang.RuntimeException: org.apache.solr.common.cloud.ZooKeeperException: 
	at org.apache.solr.util.TestHarness.<init>(TestHarness.java:153)
	at org.apache.solr.util.TestHarness.<init>(TestHarness.java:135)
	at org.apache.solr.util.TestHarness.<init>(TestHarness.java:125)
	at org.apache.solr.SolrTestCaseJ4.initCore(SolrTestCaseJ4.java:238)
	at org.apache.solr.SolrTestCaseJ4.initCore(SolrTestCaseJ4.java:101)
	at org.apache.solr.SolrTestCaseJ4.initCore(SolrTestCaseJ4.java:89)
	at org.apache.solr.handler.component.TermsComponentTest.beforeTest(TermsComponentTest.java:35)
Caused by: org.apache.solr.common.cloud.ZooKeeperException: 
	at org.apache.solr.core.CoreContainer.initZooKeeper(CoreContainer.java:183)
	at org.apache.solr.util.TestHarness$Initializer$1.<init>(TestHarness.java:184)
	at org.apache.solr.util.TestHarness$Initializer.initialize(TestHarness.java:179)
	at org.apache.solr.util.TestHarness.<init>(TestHarness.java:140)
Caused by: java.util.concurrent.TimeoutException: Could not connect to ZooKeeper 127.0.0.1:54597/solr within 5000 ms
	at org.apache.solr.common.cloud.ConnectionManager.waitForConnected(ConnectionManager.java:124)
	at org.apache.solr.common.cloud.SolrZkClient.<init>(SolrZkClient.java:121)
	at org.apache.solr.common.cloud.SolrZkClient.<init>(SolrZkClient.java:69)
	at org.apache.solr.cloud.ZkController.<init>(ZkController.java:104)
	at org.apache.solr.core.CoreContainer.initZooKeeper(CoreContainer.java:164)


FAILED:  junit.framework.TestSuite.org.apache.solr.highlight.FastVectorHighlighterTest

Error Message:
org.apache.solr.common.cloud.ZooKeeperException: 

Stack Trace:
java.lang.RuntimeException: org.apache.solr.common.cloud.ZooKeeperException: 
	at org.apache.solr.util.TestHarness.<init>(TestHarness.java:153)
	at org.apache.solr.util.TestHarness.<init>(TestHarness.java:135)
	at org.apache.solr.util.TestHarness.<init>(TestHarness.java:125)
	at org.apache.solr.SolrTestCaseJ4.initCore(SolrTestCaseJ4.java:238)
	at org.apache.solr.SolrTestCaseJ4.initCore(SolrTestCaseJ4.java:101)
	at org.apache.solr.SolrTestCaseJ4.initCore(SolrTestCaseJ4.java:89)
	at org.apache.solr.highlight.FastVectorHighlighterTest.beforeClass(FastVectorHighlighterTest.java:32)
Caused by: org.apache.solr.common.cloud.ZooKeeperException: 
	at org.apache.solr.core.CoreContainer.initZooKeeper(CoreContainer.java:183)
	at org.apache.solr.util.TestHarness$Initializer$1.<init>(TestHarness.java:184)
	at org.apache.solr.util.TestHarness$Initializer.initialize(TestHarness.java:179)
	at org.apache.solr.util.TestHarness.<init>(TestHarness.java:140)
Caused by: java.util.concurrent.TimeoutException: Could not connect to ZooKeeper 127.0.0.1:54597/solr within 5000 ms
	at org.apache.solr.common.cloud.ConnectionManager.waitForConnected(ConnectionManager.java:124)
	at org.apache.solr.common.cloud.SolrZkClient.<init>(SolrZkClient.java:121)
	at org.apache.solr.common.cloud.SolrZkClient.<init>(SolrZkClient.java:69)
	at org.apache.solr.cloud.ZkController.<init>(ZkController.java:104)
	at org.apache.solr.core.CoreContainer.initZooKeeper(CoreContainer.java:164)


REGRESSION:  org.apache.solr.highlight.HighlighterConfigTest.testConfig

Error Message:
org.apache.solr.common.cloud.ZooKeeperException: 

Stack Trace:
java.lang.RuntimeException: org.apache.solr.common.cloud.ZooKeeperException: 
	at org.apache.solr.util.TestHarness.<init>(TestHarness.java:153)
	at org.apache.solr.util.TestHarness.<init>(TestHarness.java:135)
	at org.apache.solr.util.TestHarness.<init>(TestHarness.java:125)
	at org.apache.solr.util.AbstractSolrTestCase.setUp(AbstractSolrTestCase.java:132)
	at org.apache.solr.highlight.HighlighterConfigTest.setUp(HighlighterConfigTest.java:34)
	at org.apache.lucene.util.LuceneTestCase$LuceneTestCaseRunner.runChild(LuceneTestCase.java:1232)
	at org.apache.lucene.util.LuceneTestCase$LuceneTestCaseRunner.runChild(LuceneTestCase.java:1160)
Caused by: org.apache.solr.common.cloud.ZooKeeperException: 
	at org.apache.solr.core.CoreContainer.initZooKeeper(CoreContainer.java:183)
	at org.apache.solr.util.TestHarness$Initializer$1.<init>(TestHarness.java:184)
	at org.apache.solr.util.TestHarness$Initializer.initialize(TestHarness.java:179)
	at org.apache.solr.util.TestHarness.<init>(TestHarness.java:140)
Caused by: java.util.concurrent.TimeoutException: Could not connect to ZooKeeper 127.0.0.1:54597/solr within 5000 ms
	at org.apache.solr.common.cloud.ConnectionManager.waitForConnected(ConnectionManager.java:124)
	at org.apache.solr.common.cloud.SolrZkClient.<init>(SolrZkClient.java:121)
	at org.apache.solr.common.cloud.SolrZkClient.<init>(SolrZkClient.java:69)
	at org.apache.solr.cloud.ZkController.<init>(ZkController.java:104)
	at org.apache.solr.core.CoreContainer.initZooKeeper(CoreContainer.java:164)


FAILED:  junit.framework.TestSuite.org.apache.solr.highlight.HighlighterTest

Error Message:
org.apache.solr.common.cloud.ZooKeeperException: 

Stack Trace:
java.lang.RuntimeException: org.apache.solr.common.cloud.ZooKeeperException: 
	at org.apache.solr.util.TestHarness.<init>(TestHarness.java:153)
	at org.apache.solr.util.TestHarness.<init>(TestHarness.java:135)
	at org.apache.solr.util.TestHarness.<init>(TestHarness.java:125)
	at org.apache.solr.SolrTestCaseJ4.initCore(SolrTestCaseJ4.java:238)
	at org.apache.solr.SolrTestCaseJ4.initCore(SolrTestCaseJ4.java:101)
	at org.apache.solr.SolrTestCaseJ4.initCore(SolrTestCaseJ4.java:89)
	at org.apache.solr.highlight.HighlighterTest.beforeClass(HighlighterTest.java:51)
Caused by: org.apache.solr.common.cloud.ZooKeeperException: 
	at org.apache.solr.core.CoreContainer.initZooKeeper(CoreContainer.java:183)
	at org.apache.solr.util.TestHarness$Initializer$1.<init>(TestHarness.java:184)
	at org.apache.solr.util.TestHarness$Initializer.initialize(TestHarness.java:179)
	at org.apache.solr.util.TestHarness.<init>(TestHarness.java:140)
Caused by: java.util.concurrent.TimeoutException: Could not connect to ZooKeeper 127.0.0.1:54597/solr within 5000 ms
	at org.apache.solr.common.cloud.ConnectionManager.waitForConnected(ConnectionManager.java:124)
	at org.apache.solr.common.cloud.SolrZkClient.<init>(SolrZkClient.java:121)
	at org.apache.solr.common.cloud.SolrZkClient.<init>(SolrZkClient.java:69)
	at org.apache.solr.cloud.ZkController.<init>(ZkController.java:104)
	at org.apache.solr.core.CoreContainer.initZooKeeper(CoreContainer.java:164)


FAILED:  junit.framework.TestSuite.org.apache.solr.request.JSONWriterTest

Error Message:
org.apache.solr.common.cloud.ZooKeeperException: 

Stack Trace:
java.lang.RuntimeException: org.apache.solr.common.cloud.ZooKeeperException: 
	at org.apache.solr.util.TestHarness.<init>(TestHarness.java:153)
	at org.apache.solr.util.TestHarness.<init>(TestHarness.java:135)
	at org.apache.solr.util.TestHarness.<init>(TestHarness.java:125)
	at org.apache.solr.SolrTestCaseJ4.initCore(SolrTestCaseJ4.java:238)
	at org.apache.solr.SolrTestCaseJ4.initCore(SolrTestCaseJ4.java:101)
	at org.apache.solr.SolrTestCaseJ4.initCore(SolrTestCaseJ4.java:89)
	at org.apache.solr.request.JSONWriterTest.beforeClass(JSONWriterTest.java:40)
Caused by: org.apache.solr.common.cloud.ZooKeeperException: 
	at org.apache.solr.core.CoreContainer.initZooKeeper(CoreContainer.java:183)
	at org.apache.solr.util.TestHarness$Initializer$1.<init>(TestHarness.java:184)
	at org.apache.solr.util.TestHarness$Initializer.initialize(TestHarness.java:179)
	at org.apache.solr.util.TestHarness.<init>(TestHarness.java:140)
Caused by: java.util.concurrent.TimeoutException: Could not connect to ZooKeeper 127.0.0.1:54597/solr within 5000 ms
	at org.apache.solr.common.cloud.ConnectionManager.waitForConnected(ConnectionManager.java:124)
	at org.apache.solr.common.cloud.SolrZkClient.<init>(SolrZkClient.java:121)
	at org.apache.solr.common.cloud.SolrZkClient.<init>(SolrZkClient.java:69)
	at org.apache.solr.cloud.ZkController.<init>(ZkController.java:104)
	at org.apache.solr.core.CoreContainer.initZooKeeper(CoreContainer.java:164)


FAILED:  junit.framework.TestSuite.org.apache.solr.request.SimpleFacetsTest

Error Message:
org.apache.solr.common.cloud.ZooKeeperException: 

Stack Trace:
java.lang.RuntimeException: org.apache.solr.common.cloud.ZooKeeperException: 
	at org.apache.solr.util.TestHarness.<init>(TestHarness.java:153)
	at org.apache.solr.util.TestHarness.<init>(TestHarness.java:135)
	at org.apache.solr.util.TestHarness.<init>(TestHarness.java:125)
	at org.apache.solr.SolrTestCaseJ4.initCore(SolrTestCaseJ4.java:238)
	at org.apache.solr.SolrTestCaseJ4.initCore(SolrTestCaseJ4.java:101)
	at org.apache.solr.SolrTestCaseJ4.initCore(SolrTestCaseJ4.java:89)
	at org.apache.solr.request.SimpleFacetsTest.beforeClass(SimpleFacetsTest.java:31)
Caused by: org.apache.solr.common.cloud.ZooKeeperException: 
	at org.apache.solr.core.CoreContainer.initZooKeeper(CoreContainer.java:183)
	at org.apache.solr.util.TestHarness$Initializer$1.<init>(TestHarness.java:184)
	at org.apache.solr.util.TestHarness$Initializer.initialize(TestHarness.java:179)
	at org.apache.solr.util.TestHarness.<init>(TestHarness.java:140)
Caused by: java.util.concurrent.TimeoutException: Could not connect to ZooKeeper 127.0.0.1:54597/solr within 5000 ms
	at org.apache.solr.common.cloud.ConnectionManager.waitForConnected(ConnectionManager.java:124)
	at org.apache.solr.common.cloud.SolrZkClient.<init>(SolrZkClient.java:121)
	at org.apache.solr.common.cloud.SolrZkClient.<init>(SolrZkClient.java:69)
	at org.apache.solr.cloud.ZkController.<init>(ZkController.java:104)
	at org.apache.solr.core.CoreContainer.initZooKeeper(CoreContainer.java:164)


REGRESSION:  org.apache.solr.request.TestBinaryResponseWriter.testUUID

Error Message:
org.apache.solr.common.cloud.ZooKeeperException: 

Stack Trace:
java.lang.RuntimeException: org.apache.solr.common.cloud.ZooKeeperException: 
	at org.apache.solr.util.TestHarness.<init>(TestHarness.java:153)
	at org.apache.solr.util.TestHarness.<init>(TestHarness.java:135)
	at org.apache.solr.util.TestHarness.<init>(TestHarness.java:125)
	at org.apache.solr.util.AbstractSolrTestCase.setUp(AbstractSolrTestCase.java:132)
	at org.apache.lucene.util.LuceneTestCase$LuceneTestCaseRunner.runChild(LuceneTestCase.java:1232)
	at org.apache.lucene.util.LuceneTestCase$LuceneTestCaseRunner.runChild(LuceneTestCase.java:1160)
Caused by: org.apache.solr.common.cloud.ZooKeeperException: 
	at org.apache.solr.core.CoreContainer.initZooKeeper(CoreContainer.java:183)
	at org.apache.solr.util.TestHarness$Initializer$1.<init>(TestHarness.java:184)
	at org.apache.solr.util.TestHarness$Initializer.initialize(TestHarness.java:179)
	at org.apache.solr.util.TestHarness.<init>(TestHarness.java:140)
Caused by: java.util.concurrent.TimeoutException: Could not connect to ZooKeeper 127.0.0.1:54597/solr within 5000 ms
	at org.apache.solr.common.cloud.ConnectionManager.waitForConnected(ConnectionManager.java:124)
	at org.apache.solr.common.cloud.SolrZkClient.<init>(SolrZkClient.java:121)
	at org.apache.solr.common.cloud.SolrZkClient.<init>(SolrZkClient.java:69)
	at org.apache.solr.cloud.ZkController.<init>(ZkController.java:104)
	at org.apache.solr.core.CoreContainer.initZooKeeper(CoreContainer.java:164)


FAILED:  junit.framework.TestSuite.org.apache.solr.request.TestFaceting

Error Message:
org.apache.solr.common.cloud.ZooKeeperException: 

Stack Trace:
java.lang.RuntimeException: org.apache.solr.common.cloud.ZooKeeperException: 
	at org.apache.solr.util.TestHarness.<init>(TestHarness.java:153)
	at org.apache.solr.util.TestHarness.<init>(TestHarness.java:135)
	at org.apache.solr.util.TestHarness.<init>(TestHarness.java:125)
	at org.apache.solr.SolrTestCaseJ4.initCore(SolrTestCaseJ4.java:238)
	at org.apache.solr.SolrTestCaseJ4.initCore(SolrTestCaseJ4.java:101)
	at org.apache.solr.SolrTestCaseJ4.initCore(SolrTestCaseJ4.java:89)
	at org.apache.solr.request.TestFaceting.beforeClass(TestFaceting.java:38)
Caused by: org.apache.solr.common.cloud.ZooKeeperException: 
	at org.apache.solr.core.CoreContainer.initZooKeeper(CoreContainer.java:183)
	at org.apache.solr.util.TestHarness$Initializer$1.<init>(TestHarness.java:184)
	at org.apache.solr.util.TestHarness$Initializer.initialize(TestHarness.java:179)
	at org.apache.solr.util.TestHarness.<init>(TestHarness.java:140)
Caused by: java.util.concurrent.TimeoutException: Could not connect to ZooKeeper 127.0.0.1:54597/solr within 5000 ms
	at org.apache.solr.common.cloud.ConnectionManager.waitForConnected(ConnectionManager.java:124)
	at org.apache.solr.common.cloud.SolrZkClient.<init>(SolrZkClient.java:121)
	at org.apache.solr.common.cloud.SolrZkClient.<init>(SolrZkClient.java:69)
	at org.apache.solr.cloud.ZkController.<init>(ZkController.java:104)
	at org.apache.solr.core.CoreContainer.initZooKeeper(CoreContainer.java:164)


REGRESSION:  org.apache.solr.request.TestWriterPerf.testPerf

Error Message:
org.apache.solr.common.cloud.ZooKeeperException: 

Stack Trace:
java.lang.RuntimeException: org.apache.solr.common.cloud.ZooKeeperException: 
	at org.apache.solr.util.TestHarness.<init>(TestHarness.java:153)
	at org.apache.solr.util.TestHarness.<init>(TestHarness.java:135)
	at org.apache.solr.util.TestHarness.<init>(TestHarness.java:125)
	at org.apache.solr.util.AbstractSolrTestCase.setUp(AbstractSolrTestCase.java:132)
	at org.apache.solr.request.TestWriterPerf.setUp(TestWriterPerf.java:50)
	at org.apache.lucene.util.LuceneTestCase$LuceneTestCaseRunner.runChild(LuceneTestCase.java:1232)
	at org.apache.lucene.util.LuceneTestCase$LuceneTestCaseRunner.runChild(LuceneTestCase.java:1160)
Caused by: org.apache.solr.common.cloud.ZooKeeperException: 
	at org.apache.solr.core.CoreContainer.initZooKeeper(CoreContainer.java:183)
	at org.apache.solr.util.TestHarness$Initializer$1.<init>(TestHarness.java:184)
	at org.apache.solr.util.TestHarness$Initializer.initialize(TestHarness.java:179)
	at org.apache.solr.util.TestHarness.<init>(TestHarness.java:140)
Caused by: java.util.concurrent.TimeoutException: Could not connect to ZooKeeper 127.0.0.1:54597/solr within 5000 ms
	at org.apache.solr.common.cloud.ConnectionManager.waitForConnected(ConnectionManager.java:124)
	at org.apache.solr.common.cloud.SolrZkClient.<init>(SolrZkClient.java:121)
	at org.apache.solr.common.cloud.SolrZkClient.<init>(SolrZkClient.java:69)
	at org.apache.solr.cloud.ZkController.<init>(ZkController.java:104)
	at org.apache.solr.core.CoreContainer.initZooKeeper(CoreContainer.java:164)


FAILED:  junit.framework.TestSuite.org.apache.solr.response.TestCSVResponseWriter

Error Message:
org.apache.solr.common.cloud.ZooKeeperException: 

Stack Trace:
java.lang.RuntimeException: org.apache.solr.common.cloud.ZooKeeperException: 
	at org.apache.solr.util.TestHarness.<init>(TestHarness.java:153)
	at org.apache.solr.util.TestHarness.<init>(TestHarness.java:135)
	at org.apache.solr.util.TestHarness.<init>(TestHarness.java:125)
	at org.apache.solr.SolrTestCaseJ4.initCore(SolrTestCaseJ4.java:238)
	at org.apache.solr.SolrTestCaseJ4.initCore(SolrTestCaseJ4.java:101)
	at org.apache.solr.SolrTestCaseJ4.initCore(SolrTestCaseJ4.java:89)
	at org.apache.solr.response.TestCSVResponseWriter.beforeClass(TestCSVResponseWriter.java:33)
Caused by: org.apache.solr.common.cloud.ZooKeeperException: 
	at org.apache.solr.core.CoreContainer.initZooKeeper(CoreContainer.java:183)
	at org.apache.solr.util.TestHarness$Initializer$1.<init>(TestHarness.java:184)
	at org.apache.solr.util.TestHarness$Initializer.initialize(TestHarness.java:179)
	at org.apache.solr.util.TestHarness.<init>(TestHarness.java:140)
Caused by: java.util.concurrent.TimeoutException: Could not connect to ZooKeeper 127.0.0.1:54597/solr within 5000 ms
	at org.apache.solr.common.cloud.ConnectionManager.waitForConnected(ConnectionManager.java:124)
	at org.apache.solr.common.cloud.SolrZkClient.<init>(SolrZkClient.java:121)
	at org.apache.solr.common.cloud.SolrZkClient.<init>(SolrZkClient.java:69)
	at org.apache.solr.cloud.ZkController.<init>(ZkController.java:104)
	at org.apache.solr.core.CoreContainer.initZooKeeper(CoreContainer.java:164)


FAILED:  junit.framework.TestSuite.org.apache.solr.response.TestPHPSerializedResponseWriter

Error Message:
org.apache.solr.common.cloud.ZooKeeperException: 

Stack Trace:
java.lang.RuntimeException: org.apache.solr.common.cloud.ZooKeeperException: 
	at org.apache.solr.util.TestHarness.<init>(TestHarness.java:153)
	at org.apache.solr.util.TestHarness.<init>(TestHarness.java:135)
	at org.apache.solr.util.TestHarness.<init>(TestHarness.java:125)
	at org.apache.solr.SolrTestCaseJ4.initCore(SolrTestCaseJ4.java:238)
	at org.apache.solr.SolrTestCaseJ4.initCore(SolrTestCaseJ4.java:101)
	at org.apache.solr.SolrTestCaseJ4.initCore(SolrTestCaseJ4.java:89)
	at org.apache.solr.response.TestPHPSerializedResponseWriter.beforeClass(TestPHPSerializedResponseWriter.java:43)
Caused by: org.apache.solr.common.cloud.ZooKeeperException: 
	at org.apache.solr.core.CoreContainer.initZooKeeper(CoreContainer.java:183)
	at org.apache.solr.util.TestHarness$Initializer$1.<init>(TestHarness.java:184)
	at org.apache.solr.util.TestHarness$Initializer.initialize(TestHarness.java:179)
	at org.apache.solr.util.TestHarness.<init>(TestHarness.java:140)
Caused by: java.util.concurrent.TimeoutException: Could not connect to ZooKeeper 127.0.0.1:54597/solr within 5000 ms
	at org.apache.solr.common.cloud.ConnectionManager.waitForConnected(ConnectionManager.java:124)
	at org.apache.solr.common.cloud.SolrZkClient.<init>(SolrZkClient.java:121)
	at org.apache.solr.common.cloud.SolrZkClient.<init>(SolrZkClient.java:69)
	at org.apache.solr.cloud.ZkController.<init>(ZkController.java:104)
	at org.apache.solr.core.CoreContainer.initZooKeeper(CoreContainer.java:164)


FAILED:  junit.framework.TestSuite.org.apache.solr.schema.CopyFieldTest

Error Message:
org.apache.solr.common.cloud.ZooKeeperException: 

Stack Trace:
java.lang.RuntimeException: org.apache.solr.common.cloud.ZooKeeperException: 
	at org.apache.solr.util.TestHarness.<init>(TestHarness.java:153)
	at org.apache.solr.util.TestHarness.<init>(TestHarness.java:135)
	at org.apache.solr.util.TestHarness.<init>(TestHarness.java:125)
	at org.apache.solr.SolrTestCaseJ4.initCore(SolrTestCaseJ4.java:238)
	at org.apache.solr.SolrTestCaseJ4.initCore(SolrTestCaseJ4.java:101)
	at org.apache.solr.SolrTestCaseJ4.initCore(SolrTestCaseJ4.java:89)
	at org.apache.solr.schema.CopyFieldTest.beforeClass(CopyFieldTest.java:41)
Caused by: org.apache.solr.common.cloud.ZooKeeperException: 
	at org.apache.solr.core.CoreContainer.initZooKeeper(CoreContainer.java:183)
	at org.apache.solr.util.TestHarness$Initializer$1.<init>(TestHarness.java:184)
	at org.apache.solr.util.TestHarness$Initializer.initialize(TestHarness.java:179)
	at org.apache.solr.util.TestHarness.<init>(TestHarness.java:140)
Caused by: java.util.concurrent.TimeoutException: Could not connect to ZooKeeper 127.0.0.1:54597/solr within 5000 ms
	at org.apache.solr.common.cloud.ConnectionManager.waitForConnected(ConnectionManager.java:124)
	at org.apache.solr.common.cloud.SolrZkClient.<init>(SolrZkClient.java:121)
	at org.apache.solr.common.cloud.SolrZkClient.<init>(SolrZkClient.java:69)
	at org.apache.solr.cloud.ZkController.<init>(ZkController.java:104)
	at org.apache.solr.core.CoreContainer.initZooKeeper(CoreContainer.java:164)


FAILED:  junit.framework.TestSuite.org.apache.solr.schema.IndexSchemaTest

Error Message:
org.apache.solr.common.cloud.ZooKeeperException: 

Stack Trace:
java.lang.RuntimeException: org.apache.solr.common.cloud.ZooKeeperException: 
	at org.apache.solr.util.TestHarness.<init>(TestHarness.java:153)
	at org.apache.solr.util.TestHarness.<init>(TestHarness.java:135)
	at org.apache.solr.util.TestHarness.<init>(TestHarness.java:125)
	at org.apache.solr.SolrTestCaseJ4.initCore(SolrTestCaseJ4.java:238)
	at org.apache.solr.SolrTestCaseJ4.initCore(SolrTestCaseJ4.java:101)
	at org.apache.solr.SolrTestCaseJ4.initCore(SolrTestCaseJ4.java:89)
	at org.apache.solr.schema.IndexSchemaTest.beforeClass(IndexSchemaTest.java:38)
Caused by: org.apache.solr.common.cloud.ZooKeeperException: 
	at org.apache.solr.core.CoreContainer.initZooKeeper(CoreContainer.java:183)
	at org.apache.solr.util.TestHarness$Initializer$1.<init>(TestHarness.java:184)
	at org.apache.solr.util.TestHarness$Initializer.initialize(TestHarness.java:179)
	at org.apache.solr.util.TestHarness.<init>(TestHarness.java:140)
Caused by: java.util.concurrent.TimeoutException: Could not connect to ZooKeeper 127.0.0.1:54597/solr within 5000 ms
	at org.apache.solr.common.cloud.ConnectionManager.waitForConnected(ConnectionManager.java:124)
	at org.apache.solr.common.cloud.SolrZkClient.<init>(SolrZkClient.java:121)
	at org.apache.solr.common.cloud.SolrZkClient.<init>(SolrZkClient.java:69)
	at org.apache.solr.cloud.ZkController.<init>(ZkController.java:104)
	at org.apache.solr.core.CoreContainer.initZooKeeper(CoreContainer.java:164)


FAILED:  junit.framework.TestSuite.org.apache.solr.schema.NotRequiredUniqueKeyTest

Error Message:
org.apache.solr.common.cloud.ZooKeeperException: 

Stack Trace:
java.lang.RuntimeException: org.apache.solr.common.cloud.ZooKeeperException: 
	at org.apache.solr.util.TestHarness.<init>(TestHarness.java:153)
	at org.apache.solr.util.TestHarness.<init>(TestHarness.java:135)
	at org.apache.solr.util.TestHarness.<init>(TestHarness.java:125)
	at org.apache.solr.SolrTestCaseJ4.initCore(SolrTestCaseJ4.java:238)
	at org.apache.solr.SolrTestCaseJ4.initCore(SolrTestCaseJ4.java:101)
	at org.apache.solr.SolrTestCaseJ4.initCore(SolrTestCaseJ4.java:89)
	at org.apache.solr.schema.NotRequiredUniqueKeyTest.beforeTests(NotRequiredUniqueKeyTest.java:36)
Caused by: org.apache.solr.common.cloud.ZooKeeperException: 
	at org.apache.solr.core.CoreContainer.initZooKeeper(CoreContainer.java:183)
	at org.apache.solr.util.TestHarness$Initializer$1.<init>(TestHarness.java:184)
	at org.apache.solr.util.TestHarness$Initializer.initialize(TestHarness.java:179)
	at org.apache.solr.util.TestHarness.<init>(TestHarness.java:140)
Caused by: java.util.concurrent.TimeoutException: Could not connect to ZooKeeper 127.0.0.1:54597/solr within 5000 ms
	at org.apache.solr.common.cloud.ConnectionManager.waitForConnected(ConnectionManager.java:124)
	at org.apache.solr.common.cloud.SolrZkClient.<init>(SolrZkClient.java:121)
	at org.apache.solr.common.cloud.SolrZkClient.<init>(SolrZkClient.java:69)
	at org.apache.solr.cloud.ZkController.<init>(ZkController.java:104)
	at org.apache.solr.core.CoreContainer.initZooKeeper(CoreContainer.java:164)


FAILED:  junit.framework.TestSuite.org.apache.solr.schema.NumericFieldsTest

Error Message:
org.apache.solr.common.cloud.ZooKeeperException: 

Stack Trace:
java.lang.RuntimeException: org.apache.solr.common.cloud.ZooKeeperException: 
	at org.apache.solr.util.TestHarness.<init>(TestHarness.java:153)
	at org.apache.solr.util.TestHarness.<init>(TestHarness.java:135)
	at org.apache.solr.util.TestHarness.<init>(TestHarness.java:125)
	at org.apache.solr.SolrTestCaseJ4.initCore(SolrTestCaseJ4.java:238)
	at org.apache.solr.SolrTestCaseJ4.initCore(SolrTestCaseJ4.java:101)
	at org.apache.solr.SolrTestCaseJ4.initCore(SolrTestCaseJ4.java:89)
	at org.apache.solr.schema.NumericFieldsTest.beforeClass(NumericFieldsTest.java:29)
Caused by: org.apache.solr.common.cloud.ZooKeeperException: 
	at org.apache.solr.core.CoreContainer.initZooKeeper(CoreContainer.java:183)
	at org.apache.solr.util.TestHarness$Initializer$1.<init>(TestHarness.java:184)
	at org.apache.solr.util.TestHarness$Initializer.initialize(TestHarness.java:179)
	at org.apache.solr.util.TestHarness.<init>(TestHarness.java:140)
Caused by: java.util.concurrent.TimeoutException: Could not connect to ZooKeeper 127.0.0.1:54597/solr within 5000 ms
	at org.apache.solr.common.cloud.ConnectionManager.waitForConnected(ConnectionManager.java:124)
	at org.apache.solr.common.cloud.SolrZkClient.<init>(SolrZkClient.java:121)
	at org.apache.solr.common.cloud.SolrZkClient.<init>(SolrZkClient.java:69)
	at org.apache.solr.cloud.ZkController.<init>(ZkController.java:104)
	at org.apache.solr.core.CoreContainer.initZooKeeper(CoreContainer.java:164)


FAILED:  junit.framework.TestSuite.org.apache.solr.schema.PolyFieldTest

Error Message:
org.apache.solr.common.cloud.ZooKeeperException: 

Stack Trace:
java.lang.RuntimeException: org.apache.solr.common.cloud.ZooKeeperException: 
	at org.apache.solr.util.TestHarness.<init>(TestHarness.java:153)
	at org.apache.solr.util.TestHarness.<init>(TestHarness.java:135)
	at org.apache.solr.util.TestHarness.<init>(TestHarness.java:125)
	at org.apache.solr.SolrTestCaseJ4.initCore(SolrTestCaseJ4.java:238)
	at org.apache.solr.SolrTestCaseJ4.initCore(SolrTestCaseJ4.java:101)
	at org.apache.solr.SolrTestCaseJ4.initCore(SolrTestCaseJ4.java:89)
	at org.apache.solr.schema.PolyFieldTest.beforeClass(PolyFieldTest.java:37)
Caused by: org.apache.solr.common.cloud.ZooKeeperException: 
	at org.apache.solr.core.CoreContainer.initZooKeeper(CoreContainer.java:183)
	at org.apache.solr.util.TestHarness$Initializer$1.<init>(TestHarness.java:184)
	at org.apache.solr.util.TestHarness$Initializer.initialize(TestHarness.java:179)
	at org.apache.solr.util.TestHarness.<init>(TestHarness.java:140)
Caused by: java.util.concurrent.TimeoutException: Could not connect to ZooKeeper 127.0.0.1:54597/solr within 5000 ms
	at org.apache.solr.common.cloud.ConnectionManager.waitForConnected(ConnectionManager.java:124)
	at org.apache.solr.common.cloud.SolrZkClient.<init>(SolrZkClient.java:121)
	at org.apache.solr.common.cloud.SolrZkClient.<init>(SolrZkClient.java:69)
	at org.apache.solr.cloud.ZkController.<init>(ZkController.java:104)
	at org.apache.solr.core.CoreContainer.initZooKeeper(CoreContainer.java:164)


FAILED:  junit.framework.TestSuite.org.apache.solr.schema.RequiredFieldsTest

Error Message:
org.apache.solr.common.cloud.ZooKeeperException: 

Stack Trace:
java.lang.RuntimeException: org.apache.solr.common.cloud.ZooKeeperException: 
	at org.apache.solr.util.TestHarness.<init>(TestHarness.java:153)
	at org.apache.solr.util.TestHarness.<init>(TestHarness.java:135)
	at org.apache.solr.util.TestHarness.<init>(TestHarness.java:125)
	at org.apache.solr.SolrTestCaseJ4.initCore(SolrTestCaseJ4.java:238)
	at org.apache.solr.SolrTestCaseJ4.initCore(SolrTestCaseJ4.java:101)
	at org.apache.solr.SolrTestCaseJ4.initCore(SolrTestCaseJ4.java:89)
	at org.apache.solr.schema.RequiredFieldsTest.beforeClass(RequiredFieldsTest.java:33)
Caused by: org.apache.solr.common.cloud.ZooKeeperException: 
	at org.apache.solr.core.CoreContainer.initZooKeeper(CoreContainer.java:183)
	at org.apache.solr.util.TestHarness$Initializer$1.<init>(TestHarness.java:184)
	at org.apache.solr.util.TestHarness$Initializer.initialize(TestHarness.java:179)
	at org.apache.solr.util.TestHarness.<init>(TestHarness.java:140)
Caused by: java.util.concurrent.TimeoutException: Could not connect to ZooKeeper 127.0.0.1:54597/solr within 5000 ms
	at org.apache.solr.common.cloud.ConnectionManager.waitForConnected(ConnectionManager.java:124)
	at org.apache.solr.common.cloud.SolrZkClient.<init>(SolrZkClient.java:121)
	at org.apache.solr.common.cloud.SolrZkClient.<init>(SolrZkClient.java:69)
	at org.apache.solr.cloud.ZkController.<init>(ZkController.java:104)
	at org.apache.solr.core.CoreContainer.initZooKeeper(CoreContainer.java:164)


REGRESSION:  org.apache.solr.schema.TestBinaryField.testSimple

Error Message:
Severe errors in solr configuration.  Check your log files for more detailed information on what may be wrong.  ------------------------------------------------------------- org.apache.solr.common.cloud.ZooKeeperException:   at org.apache.solr.core.CoreContainer.initZooKeeper(CoreContainer.java:183)  at org.apache.solr.core.CoreContainer.load(CoreContainer.java:333)  at org.apache.solr.core.CoreContainer$Initializer.initialize(CoreContainer.java:242)  at org.apache.solr.servlet.SolrDispatchFilter.init(SolrDispatchFilter.java:93)  at org.mortbay.jetty.servlet.FilterHolder.doStart(FilterHolder.java:97)  at org.mortbay.component.AbstractLifeCycle.start(AbstractLifeCycle.java:50)  at org.mortbay.jetty.servlet.ServletHandler.initialize(ServletHandler.java:713)  at org.mortbay.jetty.servlet.ServletHandler.updateMappings(ServletHandler.java:1104)  at org.mortbay.jetty.servlet.ServletHandler.setFilterMappings(ServletHandler.java:1140)  at org.mortbay.jetty.servlet.ServletHandler.addFilterWithMapping(ServletHandler.java:940)  at org.mortbay.jetty.servlet.ServletHandler.addFilterWithMapping(ServletHandler.java:895)  at org.mortbay.jetty.servlet.Context.addFilter(Context.java:207)  at org.apache.solr.client.solrj.embedded.JettySolrRunner$1.lifeCycleStarted(JettySolrRunner.java:98)  at org.mortbay.component.AbstractLifeCycle.setStarted(AbstractLifeCycle.java:140)  at org.mortbay.component.AbstractLifeCycle.start(AbstractLifeCycle.java:52)  at org.apache.solr.client.solrj.embedded.JettySolrRunner.start(JettySolrRunner.java:123)  at org.apache.solr.client.solrj.embedded.JettySolrRunner.start(JettySolrRunner.java:118)  at org.apache.solr.schema.TestBinaryField.setUp(TestBinaryField.java:76)  at sun.reflect.GeneratedMethodAccessor1.invoke(Unknown Source)  at sun.reflect.DelegatingMethodAccessorImpl.invoke(DelegatingMethodAccessorImpl.java:43)  at java.lang.reflect.Method.invoke(Method.java:616)  at org.junit.runners.model.FrameworkMethod$1.runReflectiveCall(FrameworkMethod.java:44)  at org.junit.internal.runners.model.Reflective  Severe errors in solr configuration.  Check your log files for more detailed information on what may be wrong.  ------------------------------------------------------------- org.apache.solr.common.cloud.ZooKeeperException:   at org.apache.solr.core.CoreContainer.initZooKeeper(CoreContainer.java:183)  at org.apache.solr.core.CoreContainer.load(CoreContainer.java:333)  at org.apache.solr.core.CoreContainer$Initializer.initialize(CoreContainer.java:242)  at org.apache.solr.servlet.SolrDispatchFilter.init(SolrDispatchFilter.java:93)  at org.mortbay.jetty.servlet.FilterHolder.doStart(FilterHolder.java:97)  at org.mortbay.component.AbstractLifeCycle.start(AbstractLifeCycle.java:50)  at org.mortbay.jetty.servlet.ServletHandler.initialize(ServletHandler.java:713)  at org.mortbay.jetty.servlet.ServletHandler.updateMappings(ServletHandler.java:1104)  at org.mortbay.jetty.servlet.ServletHandler.setFilterMappings(ServletHandler.java:1140)  at org.mortbay.jetty.servlet.ServletHandler.addFilterWithMapping(ServletHandler.java:940)  at org.mortbay.jetty.servlet.ServletHandler.addFilterWithMapping(ServletHandler.java:895)  at org.mortbay.jetty.servlet.Context.addFilter(Context.java:207)  at org.apache.solr.client.solrj.embedded.JettySolrRunner$1.lifeCycleStarted(JettySolrRunner.java:98)  at org.mortbay.component.AbstractLifeCycle.setStarted(AbstractLifeCycle.java:140)  at org.mortbay.component.AbstractLifeCycle.start(AbstractLifeCycle.java:52)  at org.apache.solr.client.solrj.embedded.JettySolrRunner.start(JettySolrRunner.java:123)  at org.apache.solr.client.solrj.embedded.JettySolrRunner.start(JettySolrRunner.java:118)  at org.apache.solr.schema.TestBinaryField.setUp(TestBinaryField.java:76)  at sun.reflect.GeneratedMethodAccessor1.invoke(Unknown Source)  at sun.reflect.DelegatingMethodAccessorImpl.invoke(DelegatingMethodAccessorImpl.java:43)  at java.lang.reflect.Method.invoke(Method.java:616)  at org.junit.runners.model.FrameworkMethod$1.runReflectiveCall(FrameworkMethod.java:44)  at org.junit.internal.runners.model.Reflective  request: http://localhost:35059/example/update?wt=javabin&version=2

Stack Trace:


request: http://localhost:35059/example/update?wt=javabin&version=2
	at org.apache.solr.client.solrj.impl.CommonsHttpSolrServer.request(CommonsHttpSolrServer.java:436)
	at org.apache.solr.client.solrj.impl.CommonsHttpSolrServer.request(CommonsHttpSolrServer.java:245)
	at org.apache.solr.client.solrj.request.AbstractUpdateRequest.process(AbstractUpdateRequest.java:105)
	at org.apache.solr.client.solrj.SolrServer.add(SolrServer.java:65)
	at org.apache.solr.schema.TestBinaryField.testSimple(TestBinaryField.java:92)
	at org.apache.lucene.util.LuceneTestCase$LuceneTestCaseRunner.runChild(LuceneTestCase.java:1232)
	at org.apache.lucene.util.LuceneTestCase$LuceneTestCaseRunner.runChild(LuceneTestCase.java:1160)


FAILED:  junit.framework.TestSuite.org.apache.solr.schema.TestCollationField

Error Message:
org.apache.solr.common.cloud.ZooKeeperException: 

Stack Trace:
java.lang.RuntimeException: org.apache.solr.common.cloud.ZooKeeperException: 
	at org.apache.solr.util.TestHarness.<init>(TestHarness.java:153)
	at org.apache.solr.util.TestHarness.<init>(TestHarness.java:135)
	at org.apache.solr.util.TestHarness.<init>(TestHarness.java:125)
	at org.apache.solr.SolrTestCaseJ4.initCore(SolrTestCaseJ4.java:238)
	at org.apache.solr.SolrTestCaseJ4.initCore(SolrTestCaseJ4.java:101)
	at org.apache.solr.schema.TestCollationField.beforeClass(TestCollationField.java:41)
Caused by: org.apache.solr.common.cloud.ZooKeeperException: 
	at org.apache.solr.core.CoreContainer.initZooKeeper(CoreContainer.java:183)
	at org.apache.solr.util.TestHarness$Initializer$1.<init>(TestHarness.java:184)
	at org.apache.solr.util.TestHarness$Initializer.initialize(TestHarness.java:179)
	at org.apache.solr.util.TestHarness.<init>(TestHarness.java:140)
Caused by: java.util.concurrent.TimeoutException: Could not connect to ZooKeeper 127.0.0.1:54597/solr within 5000 ms
	at org.apache.solr.common.cloud.ConnectionManager.waitForConnected(ConnectionManager.java:124)
	at org.apache.solr.common.cloud.SolrZkClient.<init>(SolrZkClient.java:121)
	at org.apache.solr.common.cloud.SolrZkClient.<init>(SolrZkClient.java:69)
	at org.apache.solr.cloud.ZkController.<init>(ZkController.java:104)
	at org.apache.solr.core.CoreContainer.initZooKeeper(CoreContainer.java:164)


FAILED:  junit.framework.TestSuite.org.apache.solr.schema.TestPerFieldSimilarity

Error Message:
org.apache.solr.common.cloud.ZooKeeperException: 

Stack Trace:
java.lang.RuntimeException: org.apache.solr.common.cloud.ZooKeeperException: 
	at org.apache.solr.util.TestHarness.<init>(TestHarness.java:153)
	at org.apache.solr.util.TestHarness.<init>(TestHarness.java:135)
	at org.apache.solr.util.TestHarness.<init>(TestHarness.java:125)
	at org.apache.solr.SolrTestCaseJ4.initCore(SolrTestCaseJ4.java:238)
	at org.apache.solr.SolrTestCaseJ4.initCore(SolrTestCaseJ4.java:101)
	at org.apache.solr.SolrTestCaseJ4.initCore(SolrTestCaseJ4.java:89)
	at org.apache.solr.schema.TestPerFieldSimilarity.beforeClass(TestPerFieldSimilarity.java:36)
Caused by: org.apache.solr.common.cloud.ZooKeeperException: 
	at org.apache.solr.core.CoreContainer.initZooKeeper(CoreContainer.java:183)
	at org.apache.solr.util.TestHarness$Initializer$1.<init>(TestHarness.java:184)
	at org.apache.solr.util.TestHarness$Initializer.initialize(TestHarness.java:179)
	at org.apache.solr.util.TestHarness.<init>(TestHarness.java:140)
Caused by: java.util.concurrent.TimeoutException: Could not connect to ZooKeeper 127.0.0.1:54597/solr within 5000 ms
	at org.apache.solr.common.cloud.ConnectionManager.waitForConnected(ConnectionManager.java:124)
	at org.apache.solr.common.cloud.SolrZkClient.<init>(SolrZkClient.java:121)
	at org.apache.solr.common.cloud.SolrZkClient.<init>(SolrZkClient.java:69)
	at org.apache.solr.cloud.ZkController.<init>(ZkController.java:104)
	at org.apache.solr.core.CoreContainer.initZooKeeper(CoreContainer.java:164)


FAILED:  junit.framework.TestSuite.org.apache.solr.search.QueryParsingTest

Error Message:
org.apache.solr.common.cloud.ZooKeeperException: 

Stack Trace:
java.lang.RuntimeException: org.apache.solr.common.cloud.ZooKeeperException: 
	at org.apache.solr.util.TestHarness.<init>(TestHarness.java:153)
	at org.apache.solr.util.TestHarness.<init>(TestHarness.java:135)
	at org.apache.solr.util.TestHarness.<init>(TestHarness.java:125)
	at org.apache.solr.SolrTestCaseJ4.initCore(SolrTestCaseJ4.java:238)
	at org.apache.solr.SolrTestCaseJ4.initCore(SolrTestCaseJ4.java:101)
	at org.apache.solr.SolrTestCaseJ4.initCore(SolrTestCaseJ4.java:89)
	at org.apache.solr.search.QueryParsingTest.beforeClass(QueryParsingTest.java:35)
Caused by: org.apache.solr.common.cloud.ZooKeeperException: 
	at org.apache.solr.core.CoreContainer.initZooKeeper(CoreContainer.java:183)
	at org.apache.solr.util.TestHarness$Initializer$1.<init>(TestHarness.java:184)
	at org.apache.solr.util.TestHarness$Initializer.initialize(TestHarness.java:179)
	at org.apache.solr.util.TestHarness.<init>(TestHarness.java:140)
Caused by: java.util.concurrent.TimeoutException: Could not connect to ZooKeeper 127.0.0.1:54597/solr within 5000 ms
	at org.apache.solr.common.cloud.ConnectionManager.waitForConnected(ConnectionManager.java:124)
	at org.apache.solr.common.cloud.SolrZkClient.<init>(SolrZkClient.java:121)
	at org.apache.solr.common.cloud.SolrZkClient.<init>(SolrZkClient.java:69)
	at org.apache.solr.cloud.ZkController.<init>(ZkController.java:104)
	at org.apache.solr.core.CoreContainer.initZooKeeper(CoreContainer.java:164)


FAILED:  junit.framework.TestSuite.org.apache.solr.search.SpatialFilterTest

Error Message:
org.apache.solr.common.cloud.ZooKeeperException: 

Stack Trace:
java.lang.RuntimeException: org.apache.solr.common.cloud.ZooKeeperException: 
	at org.apache.solr.util.TestHarness.<init>(TestHarness.java:153)
	at org.apache.solr.util.TestHarness.<init>(TestHarness.java:135)
	at org.apache.solr.util.TestHarness.<init>(TestHarness.java:125)
	at org.apache.solr.SolrTestCaseJ4.initCore(SolrTestCaseJ4.java:238)
	at org.apache.solr.SolrTestCaseJ4.initCore(SolrTestCaseJ4.java:101)
	at org.apache.solr.SolrTestCaseJ4.initCore(SolrTestCaseJ4.java:89)
	at org.apache.solr.search.SpatialFilterTest.beforeClass(SpatialFilterTest.java:32)
Caused by: org.apache.solr.common.cloud.ZooKeeperException: 
	at org.apache.solr.core.CoreContainer.initZooKeeper(CoreContainer.java:183)
	at org.apache.solr.util.TestHarness$Initializer$1.<init>(TestHarness.java:184)
	at org.apache.solr.util.TestHarness$Initializer.initialize(TestHarness.java:179)
	at org.apache.solr.util.TestHarness.<init>(TestHarness.java:140)
Caused by: java.util.concurrent.TimeoutException: Could not connect to ZooKeeper 127.0.0.1:54597/solr within 5000 ms
	at org.apache.solr.common.cloud.ConnectionManager.waitForConnected(ConnectionManager.java:124)
	at org.apache.solr.common.cloud.SolrZkClient.<init>(SolrZkClient.java:121)
	at org.apache.solr.common.cloud.SolrZkClient.<init>(SolrZkClient.java:69)
	at org.apache.solr.cloud.ZkController.<init>(ZkController.java:104)
	at org.apache.solr.core.CoreContainer.initZooKeeper(CoreContainer.java:164)


REGRESSION:  org.apache.solr.search.TestExtendedDismaxParser.testFocusQueryParser

Error Message:
org.apache.solr.common.cloud.ZooKeeperException: 

Stack Trace:
java.lang.RuntimeException: org.apache.solr.common.cloud.ZooKeeperException: 
	at org.apache.solr.util.TestHarness.<init>(TestHarness.java:153)
	at org.apache.solr.util.TestHarness.<init>(TestHarness.java:135)
	at org.apache.solr.util.TestHarness.<init>(TestHarness.java:125)
	at org.apache.solr.util.AbstractSolrTestCase.setUp(AbstractSolrTestCase.java:132)
	at org.apache.solr.search.TestExtendedDismaxParser.setUp(TestExtendedDismaxParser.java:33)
	at org.apache.lucene.util.LuceneTestCase$LuceneTestCaseRunner.runChild(LuceneTestCase.java:1232)
	at org.apache.lucene.util.LuceneTestCase$LuceneTestCaseRunner.runChild(LuceneTestCase.java:1160)
Caused by: org.apache.solr.common.cloud.ZooKeeperException: 
	at org.apache.solr.core.CoreContainer.initZooKeeper(CoreContainer.java:183)
	at org.apache.solr.util.TestHarness$Initializer$1.<init>(TestHarness.java:184)
	at org.apache.solr.util.TestHarness$Initializer.initialize(TestHarness.java:179)
	at org.apache.solr.util.TestHarness.<init>(TestHarness.java:140)
Caused by: java.util.concurrent.TimeoutException: Could not connect to ZooKeeper 127.0.0.1:54597/solr within 5000 ms
	at org.apache.solr.common.cloud.ConnectionManager.waitForConnected(ConnectionManager.java:124)
	at org.apache.solr.common.cloud.SolrZkClient.<init>(SolrZkClient.java:121)
	at org.apache.solr.common.cloud.SolrZkClient.<init>(SolrZkClient.java:69)
	at org.apache.solr.cloud.ZkController.<init>(ZkController.java:104)
	at org.apache.solr.core.CoreContainer.initZooKeeper(CoreContainer.java:164)


FAILED:  junit.framework.TestSuite.org.apache.solr.search.TestIndexSearcher

Error Message:
org.apache.solr.common.cloud.ZooKeeperException: 

Stack Trace:
java.lang.RuntimeException: org.apache.solr.common.cloud.ZooKeeperException: 
	at org.apache.solr.util.TestHarness.<init>(TestHarness.java:153)
	at org.apache.solr.util.TestHarness.<init>(TestHarness.java:135)
	at org.apache.solr.util.TestHarness.<init>(TestHarness.java:125)
	at org.apache.solr.SolrTestCaseJ4.initCore(SolrTestCaseJ4.java:238)
	at org.apache.solr.SolrTestCaseJ4.initCore(SolrTestCaseJ4.java:101)
	at org.apache.solr.SolrTestCaseJ4.initCore(SolrTestCaseJ4.java:89)
	at org.apache.solr.search.TestIndexSearcher.beforeClass(TestIndexSearcher.java:36)
Caused by: org.apache.solr.common.cloud.ZooKeeperException: 
	at org.apache.solr.core.CoreContainer.initZooKeeper(CoreContainer.java:183)
	at org.apache.solr.util.TestHarness$Initializer$1.<init>(TestHarness.java:184)
	at org.apache.solr.util.TestHarness$Initializer.initialize(TestHarness.java:179)
	at org.apache.solr.util.TestHarness.<init>(TestHarness.java:140)
Caused by: java.util.concurrent.TimeoutException: Could not connect to ZooKeeper 127.0.0.1:54597/solr within 5000 ms
	at org.apache.solr.common.cloud.ConnectionManager.waitForConnected(ConnectionManager.java:124)
	at org.apache.solr.common.cloud.SolrZkClient.<init>(SolrZkClient.java:121)
	at org.apache.solr.common.cloud.SolrZkClient.<init>(SolrZkClient.java:69)
	at org.apache.solr.cloud.ZkController.<init>(ZkController.java:104)
	at org.apache.solr.core.CoreContainer.initZooKeeper(CoreContainer.java:164)


REGRESSION:  org.apache.solr.search.TestQueryTypes.testQueryTypes

Error Message:
org.apache.solr.common.cloud.ZooKeeperException: 

Stack Trace:
java.lang.RuntimeException: org.apache.solr.common.cloud.ZooKeeperException: 
	at org.apache.solr.util.TestHarness.<init>(TestHarness.java:153)
	at org.apache.solr.util.TestHarness.<init>(TestHarness.java:135)
	at org.apache.solr.util.TestHarness.<init>(TestHarness.java:125)
	at org.apache.solr.util.AbstractSolrTestCase.setUp(AbstractSolrTestCase.java:132)
	at org.apache.solr.search.TestQueryTypes.setUp(TestQueryTypes.java:35)
	at org.apache.lucene.util.LuceneTestCase$LuceneTestCaseRunner.runChild(LuceneTestCase.java:1232)
	at org.apache.lucene.util.LuceneTestCase$LuceneTestCaseRunner.runChild(LuceneTestCase.java:1160)
Caused by: org.apache.solr.common.cloud.ZooKeeperException: 
	at org.apache.solr.core.CoreContainer.initZooKeeper(CoreContainer.java:183)
	at org.apache.solr.util.TestHarness$Initializer$1.<init>(TestHarness.java:184)
	at org.apache.solr.util.TestHarness$Initializer.initialize(TestHarness.java:179)
	at org.apache.solr.util.TestHarness.<init>(TestHarness.java:140)
Caused by: java.util.concurrent.TimeoutException: Could not connect to ZooKeeper 127.0.0.1:54597/solr within 5000 ms
	at org.apache.solr.common.cloud.ConnectionManager.waitForConnected(ConnectionManager.java:124)
	at org.apache.solr.common.cloud.SolrZkClient.<init>(SolrZkClient.java:121)
	at org.apache.solr.common.cloud.SolrZkClient.<init>(SolrZkClient.java:69)
	at org.apache.solr.cloud.ZkController.<init>(ZkController.java:104)
	at org.apache.solr.core.CoreContainer.initZooKeeper(CoreContainer.java:164)


REGRESSION:  org.apache.solr.search.TestQueryUtils.testNegativeQueries

Error Message:
org.apache.solr.common.cloud.ZooKeeperException: 

Stack Trace:
java.lang.RuntimeException: org.apache.solr.common.cloud.ZooKeeperException: 
	at org.apache.solr.util.TestHarness.<init>(TestHarness.java:153)
	at org.apache.solr.util.TestHarness.<init>(TestHarness.java:135)
	at org.apache.solr.util.TestHarness.<init>(TestHarness.java:125)
	at org.apache.solr.util.AbstractSolrTestCase.setUp(AbstractSolrTestCase.java:132)
	at org.apache.solr.search.TestQueryUtils.setUp(TestQueryUtils.java:41)
	at org.apache.lucene.util.LuceneTestCase$LuceneTestCaseRunner.runChild(LuceneTestCase.java:1232)
	at org.apache.lucene.util.LuceneTestCase$LuceneTestCaseRunner.runChild(LuceneTestCase.java:1160)
Caused by: org.apache.solr.common.cloud.ZooKeeperException: 
	at org.apache.solr.core.CoreContainer.initZooKeeper(CoreContainer.java:183)
	at org.apache.solr.util.TestHarness$Initializer$1.<init>(TestHarness.java:184)
	at org.apache.solr.util.TestHarness$Initializer.initialize(TestHarness.java:179)
	at org.apache.solr.util.TestHarness.<init>(TestHarness.java:140)
Caused by: java.util.concurrent.TimeoutException: Could not connect to ZooKeeper 127.0.0.1:54597/solr within 5000 ms
	at org.apache.solr.common.cloud.ConnectionManager.waitForConnected(ConnectionManager.java:124)
	at org.apache.solr.common.cloud.SolrZkClient.<init>(SolrZkClient.java:121)
	at org.apache.solr.common.cloud.SolrZkClient.<init>(SolrZkClient.java:69)
	at org.apache.solr.cloud.ZkController.<init>(ZkController.java:104)
	at org.apache.solr.core.CoreContainer.initZooKeeper(CoreContainer.java:164)


FAILED:  junit.framework.TestSuite.org.apache.solr.search.TestRangeQuery

Error Message:
org.apache.solr.common.cloud.ZooKeeperException: 

Stack Trace:
java.lang.RuntimeException: org.apache.solr.common.cloud.ZooKeeperException: 
	at org.apache.solr.util.TestHarness.<init>(TestHarness.java:153)
	at org.apache.solr.util.TestHarness.<init>(TestHarness.java:135)
	at org.apache.solr.util.TestHarness.<init>(TestHarness.java:125)
	at org.apache.solr.SolrTestCaseJ4.initCore(SolrTestCaseJ4.java:238)
	at org.apache.solr.SolrTestCaseJ4.initCore(SolrTestCaseJ4.java:101)
	at org.apache.solr.SolrTestCaseJ4.initCore(SolrTestCaseJ4.java:89)
	at org.apache.solr.search.TestRangeQuery.beforeClass(TestRangeQuery.java:34)
Caused by: org.apache.solr.common.cloud.ZooKeeperException: 
	at org.apache.solr.core.CoreContainer.initZooKeeper(CoreContainer.java:183)
	at org.apache.solr.util.TestHarness$Initializer$1.<init>(TestHarness.java:184)
	at org.apache.solr.util.TestHarness$Initializer.initialize(TestHarness.java:179)
	at org.apache.solr.util.TestHarness.<init>(TestHarness.java:140)
Caused by: java.util.concurrent.TimeoutException: Could not connect to ZooKeeper 127.0.0.1:54597/solr within 5000 ms
	at org.apache.solr.common.cloud.ConnectionManager.waitForConnected(ConnectionManager.java:124)
	at org.apache.solr.common.cloud.SolrZkClient.<init>(SolrZkClient.java:121)
	at org.apache.solr.common.cloud.SolrZkClient.<init>(SolrZkClient.java:69)
	at org.apache.solr.cloud.ZkController.<init>(ZkController.java:104)
	at org.apache.solr.core.CoreContainer.initZooKeeper(CoreContainer.java:164)


REGRESSION:  org.apache.solr.search.TestSearchPerf.testEmpty

Error Message:
org.apache.solr.common.cloud.ZooKeeperException: 

Stack Trace:
java.lang.RuntimeException: org.apache.solr.common.cloud.ZooKeeperException: 
	at org.apache.solr.util.TestHarness.<init>(TestHarness.java:153)
	at org.apache.solr.util.TestHarness.<init>(TestHarness.java:135)
	at org.apache.solr.util.TestHarness.<init>(TestHarness.java:125)
	at org.apache.solr.util.AbstractSolrTestCase.setUp(AbstractSolrTestCase.java:132)
	at org.apache.solr.search.TestSearchPerf.setUp(TestSearchPerf.java:45)
	at org.apache.lucene.util.LuceneTestCase$LuceneTestCaseRunner.runChild(LuceneTestCase.java:1232)
	at org.apache.lucene.util.LuceneTestCase$LuceneTestCaseRunner.runChild(LuceneTestCase.java:1160)
Caused by: org.apache.solr.common.cloud.ZooKeeperException: 
	at org.apache.solr.core.CoreContainer.initZooKeeper(CoreContainer.java:183)
	at org.apache.solr.util.TestHarness$Initializer$1.<init>(TestHarness.java:184)
	at org.apache.solr.util.TestHarness$Initializer.initialize(TestHarness.java:179)
	at org.apache.solr.util.TestHarness.<init>(TestHarness.java:140)
Caused by: java.util.concurrent.TimeoutException: Could not connect to ZooKeeper 127.0.0.1:54597/solr within 5000 ms
	at org.apache.solr.common.cloud.ConnectionManager.waitForConnected(ConnectionManager.java:124)
	at org.apache.solr.common.cloud.SolrZkClient.<init>(SolrZkClient.java:121)
	at org.apache.solr.common.cloud.SolrZkClient.<init>(SolrZkClient.java:69)
	at org.apache.solr.cloud.ZkController.<init>(ZkController.java:104)
	at org.apache.solr.core.CoreContainer.initZooKeeper(CoreContainer.java:164)


FAILED:  junit.framework.TestSuite.org.apache.solr.search.TestSolrQueryParser

Error Message:
org.apache.solr.common.cloud.ZooKeeperException: 

Stack Trace:
java.lang.RuntimeException: org.apache.solr.common.cloud.ZooKeeperException: 
	at org.apache.solr.util.TestHarness.<init>(TestHarness.java:153)
	at org.apache.solr.util.TestHarness.<init>(TestHarness.java:135)
	at org.apache.solr.util.TestHarness.<init>(TestHarness.java:125)
	at org.apache.solr.SolrTestCaseJ4.initCore(SolrTestCaseJ4.java:238)
	at org.apache.solr.SolrTestCaseJ4.initCore(SolrTestCaseJ4.java:101)
	at org.apache.solr.SolrTestCaseJ4.initCore(SolrTestCaseJ4.java:89)
	at org.apache.solr.search.TestSolrQueryParser.beforeClass(TestSolrQueryParser.java:28)
Caused by: org.apache.solr.common.cloud.ZooKeeperException: 
	at org.apache.solr.core.CoreContainer.initZooKeeper(CoreContainer.java:183)
	at org.apache.solr.util.TestHarness$Initializer$1.<init>(TestHarness.java:184)
	at org.apache.solr.util.TestHarness$Initializer.initialize(TestHarness.java:179)
	at org.apache.solr.util.TestHarness.<init>(TestHarness.java:140)
Caused by: java.util.concurrent.TimeoutException: Could not connect to ZooKeeper 127.0.0.1:54597/solr within 5000 ms
	at org.apache.solr.common.cloud.ConnectionManager.waitForConnected(ConnectionManager.java:124)
	at org.apache.solr.common.cloud.SolrZkClient.<init>(SolrZkClient.java:121)
	at org.apache.solr.common.cloud.SolrZkClient.<init>(SolrZkClient.java:69)
	at org.apache.solr.cloud.ZkController.<init>(ZkController.java:104)
	at org.apache.solr.core.CoreContainer.initZooKeeper(CoreContainer.java:164)


REGRESSION:  org.apache.solr.search.function.SortByFunctionTest.test

Error Message:
org.apache.solr.common.cloud.ZooKeeperException: 

Stack Trace:
java.lang.RuntimeException: org.apache.solr.common.cloud.ZooKeeperException: 
	at org.apache.solr.util.TestHarness.<init>(TestHarness.java:153)
	at org.apache.solr.util.TestHarness.<init>(TestHarness.java:135)
	at org.apache.solr.util.TestHarness.<init>(TestHarness.java:125)
	at org.apache.solr.util.AbstractSolrTestCase.setUp(AbstractSolrTestCase.java:132)
	at org.apache.lucene.util.LuceneTestCase$LuceneTestCaseRunner.runChild(LuceneTestCase.java:1232)
	at org.apache.lucene.util.LuceneTestCase$LuceneTestCaseRunner.runChild(LuceneTestCase.java:1160)
Caused by: org.apache.solr.common.cloud.ZooKeeperException: 
	at org.apache.solr.core.CoreContainer.initZooKeeper(CoreContainer.java:183)
	at org.apache.solr.util.TestHarness$Initializer$1.<init>(TestHarness.java:184)
	at org.apache.solr.util.TestHarness$Initializer.initialize(TestHarness.java:179)
	at org.apache.solr.util.TestHarness.<init>(TestHarness.java:140)
Caused by: java.util.concurrent.TimeoutException: Could not connect to ZooKeeper 127.0.0.1:54597/solr within 5000 ms
	at org.apache.solr.common.cloud.ConnectionManager.waitForConnected(ConnectionManager.java:124)
	at org.apache.solr.common.cloud.SolrZkClient.<init>(SolrZkClient.java:121)
	at org.apache.solr.common.cloud.SolrZkClient.<init>(SolrZkClient.java:69)
	at org.apache.solr.cloud.ZkController.<init>(ZkController.java:104)
	at org.apache.solr.core.CoreContainer.initZooKeeper(CoreContainer.java:164)


REGRESSION:  org.apache.solr.search.function.SortByFunctionTest.testSortJoinDocFreq

Error Message:
org.apache.solr.common.cloud.ZooKeeperException: 

Stack Trace:
java.lang.RuntimeException: org.apache.solr.common.cloud.ZooKeeperException: 
	at org.apache.solr.util.TestHarness.<init>(TestHarness.java:153)
	at org.apache.solr.util.TestHarness.<init>(TestHarness.java:135)
	at org.apache.solr.util.TestHarness.<init>(TestHarness.java:125)
	at org.apache.solr.util.AbstractSolrTestCase.setUp(AbstractSolrTestCase.java:132)
	at org.apache.lucene.util.LuceneTestCase$LuceneTestCaseRunner.runChild(LuceneTestCase.java:1232)
	at org.apache.lucene.util.LuceneTestCase$LuceneTestCaseRunner.runChild(LuceneTestCase.java:1160)
Caused by: org.apache.solr.common.cloud.ZooKeeperException: 
	at org.apache.solr.core.CoreContainer.initZooKeeper(CoreContainer.java:183)
	at org.apache.solr.util.TestHarness$Initializer$1.<init>(TestHarness.java:184)
	at org.apache.solr.util.TestHarness$Initializer.initialize(TestHarness.java:179)
	at org.apache.solr.util.TestHarness.<init>(TestHarness.java:140)
Caused by: java.util.concurrent.TimeoutException: Could not connect to ZooKeeper 127.0.0.1:54597/solr within 5000 ms
	at org.apache.solr.common.cloud.ConnectionManager.waitForConnected(ConnectionManager.java:124)
	at org.apache.solr.common.cloud.SolrZkClient.<init>(SolrZkClient.java:121)
	at org.apache.solr.common.cloud.SolrZkClient.<init>(SolrZkClient.java:69)
	at org.apache.solr.cloud.ZkController.<init>(ZkController.java:104)
	at org.apache.solr.core.CoreContainer.initZooKeeper(CoreContainer.java:164)


FAILED:  junit.framework.TestSuite.org.apache.solr.search.function.TestFunctionQuery

Error Message:
org.apache.solr.common.cloud.ZooKeeperException: 

Stack Trace:
java.lang.RuntimeException: org.apache.solr.common.cloud.ZooKeeperException: 
	at org.apache.solr.util.TestHarness.<init>(TestHarness.java:153)
	at org.apache.solr.util.TestHarness.<init>(TestHarness.java:135)
	at org.apache.solr.util.TestHarness.<init>(TestHarness.java:125)
	at org.apache.solr.SolrTestCaseJ4.initCore(SolrTestCaseJ4.java:238)
	at org.apache.solr.SolrTestCaseJ4.initCore(SolrTestCaseJ4.java:101)
	at org.apache.solr.SolrTestCaseJ4.initCore(SolrTestCaseJ4.java:89)
	at org.apache.solr.search.function.TestFunctionQuery.beforeClass(TestFunctionQuery.java:42)
Caused by: org.apache.solr.common.cloud.ZooKeeperException: 
	at org.apache.solr.core.CoreContainer.initZooKeeper(CoreContainer.java:183)
	at org.apache.solr.util.TestHarness$Initializer$1.<init>(TestHarness.java:184)
	at org.apache.solr.util.TestHarness$Initializer.initialize(TestHarness.java:179)
	at org.apache.solr.util.TestHarness.<init>(TestHarness.java:140)
Caused by: java.util.concurrent.TimeoutException: Could not connect to ZooKeeper 127.0.0.1:54597/solr within 5000 ms
	at org.apache.solr.common.cloud.ConnectionManager.waitForConnected(ConnectionManager.java:124)
	at org.apache.solr.common.cloud.SolrZkClient.<init>(SolrZkClient.java:121)
	at org.apache.solr.common.cloud.SolrZkClient.<init>(SolrZkClient.java:69)
	at org.apache.solr.cloud.ZkController.<init>(ZkController.java:104)
	at org.apache.solr.core.CoreContainer.initZooKeeper(CoreContainer.java:164)


FAILED:  junit.framework.TestSuite.org.apache.solr.search.function.distance.DistanceFunctionTest

Error Message:
org.apache.solr.common.cloud.ZooKeeperException: 

Stack Trace:
java.lang.RuntimeException: org.apache.solr.common.cloud.ZooKeeperException: 
	at org.apache.solr.util.TestHarness.<init>(TestHarness.java:153)
	at org.apache.solr.util.TestHarness.<init>(TestHarness.java:135)
	at org.apache.solr.util.TestHarness.<init>(TestHarness.java:125)
	at org.apache.solr.SolrTestCaseJ4.initCore(SolrTestCaseJ4.java:238)
	at org.apache.solr.SolrTestCaseJ4.initCore(SolrTestCaseJ4.java:101)
	at org.apache.solr.SolrTestCaseJ4.initCore(SolrTestCaseJ4.java:89)
	at org.apache.solr.search.function.distance.DistanceFunctionTest.beforeClass(DistanceFunctionTest.java:33)
Caused by: org.apache.solr.common.cloud.ZooKeeperException: 
	at org.apache.solr.core.CoreContainer.initZooKeeper(CoreContainer.java:183)
	at org.apache.solr.util.TestHarness$Initializer$1.<init>(TestHarness.java:184)
	at org.apache.solr.util.TestHarness$Initializer.initialize(TestHarness.java:179)
	at org.apache.solr.util.TestHarness.<init>(TestHarness.java:140)
Caused by: java.util.concurrent.TimeoutException: Could not connect to ZooKeeper 127.0.0.1:54597/solr within 5000 ms
	at org.apache.solr.common.cloud.ConnectionManager.waitForConnected(ConnectionManager.java:124)
	at org.apache.solr.common.cloud.SolrZkClient.<init>(SolrZkClient.java:121)
	at org.apache.solr.common.cloud.SolrZkClient.<init>(SolrZkClient.java:69)
	at org.apache.solr.cloud.ZkController.<init>(ZkController.java:104)
	at org.apache.solr.core.CoreContainer.initZooKeeper(CoreContainer.java:164)


REGRESSION:  org.apache.solr.servlet.CacheHeaderTest.testCacheVetoHandler

Error Message:
expected:<200> but was:<500>

Stack Trace:
junit.framework.AssertionFailedError: expected:<200> but was:<500>
	at org.apache.lucene.util.LuceneTestCase$LuceneTestCaseRunner.runChild(LuceneTestCase.java:1232)
	at org.apache.lucene.util.LuceneTestCase$LuceneTestCaseRunner.runChild(LuceneTestCase.java:1160)
	at org.apache.solr.servlet.CacheHeaderTest.testCacheVetoHandler(CacheHeaderTest.java:52)


REGRESSION:  org.apache.solr.servlet.CacheHeaderTest.testCacheVetoException

Error Message:
We got no Pragma header

Stack Trace:
junit.framework.AssertionFailedError: We got no Pragma header
	at org.apache.lucene.util.LuceneTestCase$LuceneTestCaseRunner.runChild(LuceneTestCase.java:1232)
	at org.apache.lucene.util.LuceneTestCase$LuceneTestCaseRunner.runChild(LuceneTestCase.java:1160)
	at org.apache.solr.servlet.CacheHeaderTest.checkVetoHeaders(CacheHeaderTest.java:75)
	at org.apache.solr.servlet.CacheHeaderTest.testCacheVetoException(CacheHeaderTest.java:64)


REGRESSION:  org.apache.solr.servlet.CacheHeaderTest.testLastModified

Error Message:
Unknown request response expected:<0> but was:<500>

Stack Trace:
junit.framework.AssertionFailedError: Unknown request response expected:<0> but was:<500>
	at org.apache.lucene.util.LuceneTestCase$LuceneTestCaseRunner.runChild(LuceneTestCase.java:1232)
	at org.apache.lucene.util.LuceneTestCase$LuceneTestCaseRunner.runChild(LuceneTestCase.java:1160)
	at org.apache.solr.servlet.CacheHeaderTestBase.checkResponseBody(CacheHeaderTestBase.java:85)
	at org.apache.solr.servlet.CacheHeaderTest.doLastModified(CacheHeaderTest.java:94)
	at org.apache.solr.servlet.CacheHeaderTestBase.testLastModified(CacheHeaderTestBase.java:97)


REGRESSION:  org.apache.solr.servlet.CacheHeaderTest.testEtag

Error Message:
Unknown request response expected:<0> but was:<500>

Stack Trace:
junit.framework.AssertionFailedError: Unknown request response expected:<0> but was:<500>
	at org.apache.lucene.util.LuceneTestCase$LuceneTestCaseRunner.runChild(LuceneTestCase.java:1232)
	at org.apache.lucene.util.LuceneTestCase$LuceneTestCaseRunner.runChild(LuceneTestCase.java:1160)
	at org.apache.solr.servlet.CacheHeaderTestBase.checkResponseBody(CacheHeaderTestBase.java:85)
	at org.apache.solr.servlet.CacheHeaderTest.doETag(CacheHeaderTest.java:148)
	at org.apache.solr.servlet.CacheHeaderTestBase.testEtag(CacheHeaderTestBase.java:103)


REGRESSION:  org.apache.solr.servlet.CacheHeaderTest.testCacheControl

Error Message:
Unknown request response expected:<0> but was:<500>

Stack Trace:
junit.framework.AssertionFailedError: Unknown request response expected:<0> but was:<500>
	at org.apache.lucene.util.LuceneTestCase$LuceneTestCaseRunner.runChild(LuceneTestCase.java:1232)
	at org.apache.lucene.util.LuceneTestCase$LuceneTestCaseRunner.runChild(LuceneTestCase.java:1160)
	at org.apache.solr.servlet.CacheHeaderTestBase.checkResponseBody(CacheHeaderTestBase.java:85)
	at org.apache.solr.servlet.CacheHeaderTest.doCacheControl(CacheHeaderTest.java:231)
	at org.apache.solr.servlet.CacheHeaderTestBase.testCacheControl(CacheHeaderTestBase.java:109)


REGRESSION:  org.apache.solr.servlet.DirectSolrConnectionTest.testSimpleRequest

Error Message:
org.apache.solr.common.cloud.ZooKeeperException: 

Stack Trace:
java.lang.RuntimeException: org.apache.solr.common.cloud.ZooKeeperException: 
	at org.apache.solr.util.TestHarness.<init>(TestHarness.java:153)
	at org.apache.solr.util.TestHarness.<init>(TestHarness.java:135)
	at org.apache.solr.util.TestHarness.<init>(TestHarness.java:125)
	at org.apache.solr.util.AbstractSolrTestCase.setUp(AbstractSolrTestCase.java:132)
	at org.apache.solr.servlet.DirectSolrConnectionTest.setUp(DirectSolrConnectionTest.java:37)
	at org.apache.lucene.util.LuceneTestCase$LuceneTestCaseRunner.runChild(LuceneTestCase.java:1232)
	at org.apache.lucene.util.LuceneTestCase$LuceneTestCaseRunner.runChild(LuceneTestCase.java:1160)
Caused by: org.apache.solr.common.cloud.ZooKeeperException: 
	at org.apache.solr.core.CoreContainer.initZooKeeper(CoreContainer.java:183)
	at org.apache.solr.util.TestHarness$Initializer$1.<init>(TestHarness.java:184)
	at org.apache.solr.util.TestHarness$Initializer.initialize(TestHarness.java:179)
	at org.apache.solr.util.TestHarness.<init>(TestHarness.java:140)
Caused by: java.util.concurrent.TimeoutException: Could not connect to ZooKeeper 127.0.0.1:54597/solr within 5000 ms
	at org.apache.solr.common.cloud.ConnectionManager.waitForConnected(ConnectionManager.java:124)
	at org.apache.solr.common.cloud.SolrZkClient.<init>(SolrZkClient.java:121)
	at org.apache.solr.common.cloud.SolrZkClient.<init>(SolrZkClient.java:69)
	at org.apache.solr.cloud.ZkController.<init>(ZkController.java:104)
	at org.apache.solr.core.CoreContainer.initZooKeeper(CoreContainer.java:164)


REGRESSION:  org.apache.solr.servlet.DirectSolrConnectionTest.testInsertThenSelect

Error Message:
org.apache.solr.common.cloud.ZooKeeperException: 

Stack Trace:
java.lang.RuntimeException: org.apache.solr.common.cloud.ZooKeeperException: 
	at org.apache.solr.util.TestHarness.<init>(TestHarness.java:153)
	at org.apache.solr.util.TestHarness.<init>(TestHarness.java:135)
	at org.apache.solr.util.TestHarness.<init>(TestHarness.java:125)
	at org.apache.solr.util.AbstractSolrTestCase.setUp(AbstractSolrTestCase.java:132)
	at org.apache.solr.servlet.DirectSolrConnectionTest.setUp(DirectSolrConnectionTest.java:37)
	at org.apache.lucene.util.LuceneTestCase$LuceneTestCaseRunner.runChild(LuceneTestCase.java:1232)
	at org.apache.lucene.util.LuceneTestCase$LuceneTestCaseRunner.runChild(LuceneTestCase.java:1160)
Caused by: org.apache.solr.common.cloud.ZooKeeperException: 
	at org.apache.solr.core.CoreContainer.initZooKeeper(CoreContainer.java:183)
	at org.apache.solr.util.TestHarness$Initializer$1.<init>(TestHarness.java:184)
	at org.apache.solr.util.TestHarness$Initializer.initialize(TestHarness.java:179)
	at org.apache.solr.util.TestHarness.<init>(TestHarness.java:140)
Caused by: java.util.concurrent.TimeoutException: Could not connect to ZooKeeper 127.0.0.1:54597/solr within 5000 ms
	at org.apache.solr.common.cloud.ConnectionManager.waitForConnected(ConnectionManager.java:124)
	at org.apache.solr.common.cloud.SolrZkClient.<init>(SolrZkClient.java:121)
	at org.apache.solr.common.cloud.SolrZkClient.<init>(SolrZkClient.java:69)
	at org.apache.solr.cloud.ZkController.<init>(ZkController.java:104)
	at org.apache.solr.core.CoreContainer.initZooKeeper(CoreContainer.java:164)


REGRESSION:  org.apache.solr.servlet.NoCacheHeaderTest.testLastModified

Error Message:
Unknown request response expected:<0> but was:<500>

Stack Trace:
junit.framework.AssertionFailedError: Unknown request response expected:<0> but was:<500>
	at org.apache.lucene.util.LuceneTestCase$LuceneTestCaseRunner.runChild(LuceneTestCase.java:1232)
	at org.apache.lucene.util.LuceneTestCase$LuceneTestCaseRunner.runChild(LuceneTestCase.java:1160)
	at org.apache.solr.servlet.CacheHeaderTestBase.checkResponseBody(CacheHeaderTestBase.java:85)
	at org.apache.solr.servlet.NoCacheHeaderTest.doLastModified(NoCacheHeaderTest.java:66)
	at org.apache.solr.servlet.NoCacheHeaderTest.testLastModified(NoCacheHeaderTest.java:41)


REGRESSION:  org.apache.solr.servlet.NoCacheHeaderTest.testEtag

Error Message:
Unknown request response expected:<0> but was:<500>

Stack Trace:
junit.framework.AssertionFailedError: Unknown request response expected:<0> but was:<500>
	at org.apache.lucene.util.LuceneTestCase$LuceneTestCaseRunner.runChild(LuceneTestCase.java:1232)
	at org.apache.lucene.util.LuceneTestCase$LuceneTestCaseRunner.runChild(LuceneTestCase.java:1160)
	at org.apache.solr.servlet.CacheHeaderTestBase.checkResponseBody(CacheHeaderTestBase.java:85)
	at org.apache.solr.servlet.NoCacheHeaderTest.doETag(NoCacheHeaderTest.java:116)
	at org.apache.solr.servlet.NoCacheHeaderTest.testEtag(NoCacheHeaderTest.java:48)


REGRESSION:  org.apache.solr.servlet.NoCacheHeaderTest.testCacheControl

Error Message:
Unknown request response expected:<0> but was:<500>

Stack Trace:
junit.framework.AssertionFailedError: Unknown request response expected:<0> but was:<500>
	at org.apache.lucene.util.LuceneTestCase$LuceneTestCaseRunner.runChild(LuceneTestCase.java:1232)
	at org.apache.lucene.util.LuceneTestCase$LuceneTestCaseRunner.runChild(LuceneTestCase.java:1160)
	at org.apache.solr.servlet.CacheHeaderTestBase.checkResponseBody(CacheHeaderTestBase.java:85)
	at org.apache.solr.servlet.NoCacheHeaderTest.doCacheControl(NoCacheHeaderTest.java:165)
	at org.apache.solr.servlet.NoCacheHeaderTest.testCacheControl(NoCacheHeaderTest.java:55)


FAILED:  junit.framework.TestSuite.org.apache.solr.servlet.SolrRequestParserTest

Error Message:
org.apache.solr.common.cloud.ZooKeeperException: 

Stack Trace:
java.lang.RuntimeException: org.apache.solr.common.cloud.ZooKeeperException: 
	at org.apache.solr.util.TestHarness.<init>(TestHarness.java:153)
	at org.apache.solr.util.TestHarness.<init>(TestHarness.java:135)
	at org.apache.solr.util.TestHarness.<init>(TestHarness.java:125)
	at org.apache.solr.SolrTestCaseJ4.initCore(SolrTestCaseJ4.java:238)
	at org.apache.solr.SolrTestCaseJ4.initCore(SolrTestCaseJ4.java:101)
	at org.apache.solr.SolrTestCaseJ4.initCore(SolrTestCaseJ4.java:89)
	at org.apache.solr.servlet.SolrRequestParserTest.beforeClass(SolrRequestParserTest.java:50)
Caused by: org.apache.solr.common.cloud.ZooKeeperException: 
	at org.apache.solr.core.CoreContainer.initZooKeeper(CoreContainer.java:183)
	at org.apache.solr.util.TestHarness$Initializer$1.<init>(TestHarness.java:184)
	at org.apache.solr.util.TestHarness$Initializer.initialize(TestHarness.java:179)
	at org.apache.solr.util.TestHarness.<init>(TestHarness.java:140)
Caused by: java.util.concurrent.TimeoutException: Could not connect to ZooKeeper 127.0.0.1:54597/solr within 5000 ms
	at org.apache.solr.common.cloud.ConnectionManager.waitForConnected(ConnectionManager.java:124)
	at org.apache.solr.common.cloud.SolrZkClient.<init>(SolrZkClient.java:121)
	at org.apache.solr.common.cloud.SolrZkClient.<init>(SolrZkClient.java:69)
	at org.apache.solr.cloud.ZkController.<init>(ZkController.java:104)
	at org.apache.solr.core.CoreContainer.initZooKeeper(CoreContainer.java:164)


FAILED:  junit.framework.TestSuite.org.apache.solr.spelling.DirectSolrSpellCheckerTest

Error Message:
org.apache.solr.common.cloud.ZooKeeperException: 

Stack Trace:
java.lang.RuntimeException: org.apache.solr.common.cloud.ZooKeeperException: 
	at org.apache.solr.util.TestHarness.<init>(TestHarness.java:153)
	at org.apache.solr.util.TestHarness.<init>(TestHarness.java:135)
	at org.apache.solr.util.TestHarness.<init>(TestHarness.java:125)
	at org.apache.solr.SolrTestCaseJ4.initCore(SolrTestCaseJ4.java:238)
	at org.apache.solr.SolrTestCaseJ4.initCore(SolrTestCaseJ4.java:101)
	at org.apache.solr.SolrTestCaseJ4.initCore(SolrTestCaseJ4.java:89)
	at org.apache.solr.spelling.DirectSolrSpellCheckerTest.beforeClass(DirectSolrSpellCheckerTest.java:41)
Caused by: org.apache.solr.common.cloud.ZooKeeperException: 
	at org.apache.solr.core.CoreContainer.initZooKeeper(CoreContainer.java:183)
	at org.apache.solr.util.TestHarness$Initializer$1.<init>(TestHarness.java:184)
	at org.apache.solr.util.TestHarness$Initializer.initialize(TestHarness.java:179)
	at org.apache.solr.util.TestHarness.<init>(TestHarness.java:140)
Caused by: java.util.concurrent.TimeoutException: Could not connect to ZooKeeper 127.0.0.1:54597/solr within 5000 ms
	at org.apache.solr.common.cloud.ConnectionManager.waitForConnected(ConnectionManager.java:124)
	at org.apache.solr.common.cloud.SolrZkClient.<init>(SolrZkClient.java:121)
	at org.apache.solr.common.cloud.SolrZkClient.<init>(SolrZkClient.java:69)
	at org.apache.solr.cloud.ZkController.<init>(ZkController.java:104)
	at org.apache.solr.core.CoreContainer.initZooKeeper(CoreContainer.java:164)


FAILED:  junit.framework.TestSuite.org.apache.solr.spelling.FileBasedSpellCheckerTest

Error Message:
org.apache.solr.common.cloud.ZooKeeperException: 

Stack Trace:
java.lang.RuntimeException: org.apache.solr.common.cloud.ZooKeeperException: 
	at org.apache.solr.util.TestHarness.<init>(TestHarness.java:153)
	at org.apache.solr.util.TestHarness.<init>(TestHarness.java:135)
	at org.apache.solr.util.TestHarness.<init>(TestHarness.java:125)
	at org.apache.solr.SolrTestCaseJ4.initCore(SolrTestCaseJ4.java:238)
	at org.apache.solr.SolrTestCaseJ4.initCore(SolrTestCaseJ4.java:101)
	at org.apache.solr.SolrTestCaseJ4.initCore(SolrTestCaseJ4.java:89)
	at org.apache.solr.spelling.FileBasedSpellCheckerTest.beforeClass(FileBasedSpellCheckerTest.java:45)
Caused by: org.apache.solr.common.cloud.ZooKeeperException: 
	at org.apache.solr.core.CoreContainer.initZooKeeper(CoreContainer.java:183)
	at org.apache.solr.util.TestHarness$Initializer$1.<init>(TestHarness.java:184)
	at org.apache.solr.util.TestHarness$Initializer.initialize(TestHarness.java:179)
	at org.apache.solr.util.TestHarness.<init>(TestHarness.java:140)
Caused by: java.util.concurrent.TimeoutException: Could not connect to ZooKeeper 127.0.0.1:54597/solr within 5000 ms
	at org.apache.solr.common.cloud.ConnectionManager.waitForConnected(ConnectionManager.java:124)
	at org.apache.solr.common.cloud.SolrZkClient.<init>(SolrZkClient.java:121)
	at org.apache.solr.common.cloud.SolrZkClient.<init>(SolrZkClient.java:69)
	at org.apache.solr.cloud.ZkController.<init>(ZkController.java:104)
	at org.apache.solr.core.CoreContainer.initZooKeeper(CoreContainer.java:164)


FAILED:  junit.framework.TestSuite.org.apache.solr.spelling.IndexBasedSpellCheckerTest

Error Message:
org.apache.solr.common.cloud.ZooKeeperException: 

Stack Trace:
java.lang.RuntimeException: org.apache.solr.common.cloud.ZooKeeperException: 
	at org.apache.solr.util.TestHarness.<init>(TestHarness.java:153)
	at org.apache.solr.util.TestHarness.<init>(TestHarness.java:135)
	at org.apache.solr.util.TestHarness.<init>(TestHarness.java:125)
	at org.apache.solr.SolrTestCaseJ4.initCore(SolrTestCaseJ4.java:238)
	at org.apache.solr.SolrTestCaseJ4.initCore(SolrTestCaseJ4.java:101)
	at org.apache.solr.SolrTestCaseJ4.initCore(SolrTestCaseJ4.java:89)
	at org.apache.solr.spelling.IndexBasedSpellCheckerTest.beforeClass(IndexBasedSpellCheckerTest.java:67)
Caused by: org.apache.solr.common.cloud.ZooKeeperException: 
	at org.apache.solr.core.CoreContainer.initZooKeeper(CoreContainer.java:183)
	at org.apache.solr.util.TestHarness$Initializer$1.<init>(TestHarness.java:184)
	at org.apache.solr.util.TestHarness$Initializer.initialize(TestHarness.java:179)
	at org.apache.solr.util.TestHarness.<init>(TestHarness.java:140)
Caused by: java.util.concurrent.TimeoutException: Could not connect to ZooKeeper 127.0.0.1:54597/solr within 5000 ms
	at org.apache.solr.common.cloud.ConnectionManager.waitForConnected(ConnectionManager.java:124)
	at org.apache.solr.common.cloud.SolrZkClient.<init>(SolrZkClient.java:121)
	at org.apache.solr.common.cloud.SolrZkClient.<init>(SolrZkClient.java:69)
	at org.apache.solr.cloud.ZkController.<init>(ZkController.java:104)
	at org.apache.solr.core.CoreContainer.initZooKeeper(CoreContainer.java:164)


FAILED:  junit.framework.TestSuite.org.apache.solr.spelling.SpellCheckCollatorTest

Error Message:
org.apache.solr.common.cloud.ZooKeeperException: 

Stack Trace:
java.lang.RuntimeException: org.apache.solr.common.cloud.ZooKeeperException: 
	at org.apache.solr.util.TestHarness.<init>(TestHarness.java:153)
	at org.apache.solr.util.TestHarness.<init>(TestHarness.java:135)
	at org.apache.solr.util.TestHarness.<init>(TestHarness.java:125)
	at org.apache.solr.SolrTestCaseJ4.initCore(SolrTestCaseJ4.java:238)
	at org.apache.solr.SolrTestCaseJ4.initCore(SolrTestCaseJ4.java:101)
	at org.apache.solr.SolrTestCaseJ4.initCore(SolrTestCaseJ4.java:89)
	at org.apache.solr.spelling.SpellCheckCollatorTest.beforeClass(SpellCheckCollatorTest.java:41)
Caused by: org.apache.solr.common.cloud.ZooKeeperException: 
	at org.apache.solr.core.CoreContainer.initZooKeeper(CoreContainer.java:183)
	at org.apache.solr.util.TestHarness$Initializer$1.<init>(TestHarness.java:184)
	at org.apache.solr.util.TestHarness$Initializer.initialize(TestHarness.java:179)
	at org.apache.solr.util.TestHarness.<init>(TestHarness.java:140)
Caused by: java.util.concurrent.TimeoutException: Could not connect to ZooKeeper 127.0.0.1:54597/solr within 5000 ms
	at org.apache.solr.common.cloud.ConnectionManager.waitForConnected(ConnectionManager.java:124)
	at org.apache.solr.common.cloud.SolrZkClient.<init>(SolrZkClient.java:121)
	at org.apache.solr.common.cloud.SolrZkClient.<init>(SolrZkClient.java:69)
	at org.apache.solr.cloud.ZkController.<init>(ZkController.java:104)
	at org.apache.solr.core.CoreContainer.initZooKeeper(CoreContainer.java:164)


FAILED:  junit.framework.TestSuite.org.apache.solr.spelling.suggest.SuggesterTest

Error Message:
org.apache.solr.common.cloud.ZooKeeperException: 

Stack Trace:
java.lang.RuntimeException: org.apache.solr.common.cloud.ZooKeeperException: 
	at org.apache.solr.util.TestHarness.<init>(TestHarness.java:153)
	at org.apache.solr.util.TestHarness.<init>(TestHarness.java:135)
	at org.apache.solr.util.TestHarness.<init>(TestHarness.java:125)
	at org.apache.solr.SolrTestCaseJ4.initCore(SolrTestCaseJ4.java:238)
	at org.apache.solr.SolrTestCaseJ4.initCore(SolrTestCaseJ4.java:101)
	at org.apache.solr.SolrTestCaseJ4.initCore(SolrTestCaseJ4.java:89)
	at org.apache.solr.spelling.suggest.SuggesterTest.beforeClass(SuggesterTest.java:44)
Caused by: org.apache.solr.common.cloud.ZooKeeperException: 
	at org.apache.solr.core.CoreContainer.initZooKeeper(CoreContainer.java:183)
	at org.apache.solr.util.TestHarness$Initializer$1.<init>(TestHarness.java:184)
	at org.apache.solr.util.TestHarness$Initializer.initialize(TestHarness.java:179)
	at org.apache.solr.util.TestHarness.<init>(TestHarness.java:140)
Caused by: java.util.concurrent.TimeoutException: Could not connect to ZooKeeper 127.0.0.1:54597/solr within 5000 ms
	at org.apache.solr.common.cloud.ConnectionManager.waitForConnected(ConnectionManager.java:124)
	at org.apache.solr.common.cloud.SolrZkClient.<init>(SolrZkClient.java:121)
	at org.apache.solr.common.cloud.SolrZkClient.<init>(SolrZkClient.java:69)
	at org.apache.solr.cloud.ZkController.<init>(ZkController.java:104)
	at org.apache.solr.core.CoreContainer.initZooKeeper(CoreContainer.java:164)


REGRESSION:  org.apache.solr.update.AutoCommitTest.testMaxTime

Error Message:
org.apache.solr.common.cloud.ZooKeeperException: 

Stack Trace:
java.lang.RuntimeException: org.apache.solr.common.cloud.ZooKeeperException: 
	at org.apache.solr.util.TestHarness.<init>(TestHarness.java:153)
	at org.apache.solr.util.TestHarness.<init>(TestHarness.java:135)
	at org.apache.solr.util.TestHarness.<init>(TestHarness.java:125)
	at org.apache.solr.util.AbstractSolrTestCase.setUp(AbstractSolrTestCase.java:132)
	at org.apache.lucene.util.LuceneTestCase$LuceneTestCaseRunner.runChild(LuceneTestCase.java:1232)
	at org.apache.lucene.util.LuceneTestCase$LuceneTestCaseRunner.runChild(LuceneTestCase.java:1160)
Caused by: org.apache.solr.common.cloud.ZooKeeperException: 
	at org.apache.solr.core.CoreContainer.initZooKeeper(CoreContainer.java:183)
	at org.apache.solr.util.TestHarness$Initializer$1.<init>(TestHarness.java:184)
	at org.apache.solr.util.TestHarness$Initializer.initialize(TestHarness.java:179)
	at org.apache.solr.util.TestHarness.<init>(TestHarness.java:140)
Caused by: java.util.concurrent.TimeoutException: Could not connect to ZooKeeper 127.0.0.1:54597/solr within 5000 ms
	at org.apache.solr.common.cloud.ConnectionManager.waitForConnected(ConnectionManager.java:124)
	at org.apache.solr.common.cloud.SolrZkClient.<init>(SolrZkClient.java:121)
	at org.apache.solr.common.cloud.SolrZkClient.<init>(SolrZkClient.java:69)
	at org.apache.solr.cloud.ZkController.<init>(ZkController.java:104)
	at org.apache.solr.core.CoreContainer.initZooKeeper(CoreContainer.java:164)


REGRESSION:  org.apache.solr.update.DirectUpdateHandlerOptimizeTest.testOptimize

Error Message:
org.apache.solr.common.cloud.ZooKeeperException: 

Stack Trace:
java.lang.RuntimeException: org.apache.solr.common.cloud.ZooKeeperException: 
	at org.apache.solr.util.TestHarness.<init>(TestHarness.java:153)
	at org.apache.solr.util.TestHarness.<init>(TestHarness.java:135)
	at org.apache.solr.util.TestHarness.<init>(TestHarness.java:125)
	at org.apache.solr.util.AbstractSolrTestCase.setUp(AbstractSolrTestCase.java:132)
	at org.apache.lucene.util.LuceneTestCase$LuceneTestCaseRunner.runChild(LuceneTestCase.java:1232)
	at org.apache.lucene.util.LuceneTestCase$LuceneTestCaseRunner.runChild(LuceneTestCase.java:1160)
Caused by: org.apache.solr.common.cloud.ZooKeeperException: 
	at org.apache.solr.core.CoreContainer.initZooKeeper(CoreContainer.java:183)
	at org.apache.solr.util.TestHarness$Initializer$1.<init>(TestHarness.java:184)
	at org.apache.solr.util.TestHarness$Initializer.initialize(TestHarness.java:179)
	at org.apache.solr.util.TestHarness.<init>(TestHarness.java:140)
Caused by: java.util.concurrent.TimeoutException: Could not connect to ZooKeeper 127.0.0.1:54597/solr within 5000 ms
	at org.apache.solr.common.cloud.ConnectionManager.waitForConnected(ConnectionManager.java:124)
	at org.apache.solr.common.cloud.SolrZkClient.<init>(SolrZkClient.java:121)
	at org.apache.solr.common.cloud.SolrZkClient.<init>(SolrZkClient.java:69)
	at org.apache.solr.cloud.ZkController.<init>(ZkController.java:104)
	at org.apache.solr.core.CoreContainer.initZooKeeper(CoreContainer.java:164)


FAILED:  junit.framework.TestSuite.org.apache.solr.update.DirectUpdateHandlerTest

Error Message:
org.apache.solr.common.cloud.ZooKeeperException: 

Stack Trace:
java.lang.RuntimeException: org.apache.solr.common.cloud.ZooKeeperException: 
	at org.apache.solr.util.TestHarness.<init>(TestHarness.java:153)
	at org.apache.solr.util.TestHarness.<init>(TestHarness.java:135)
	at org.apache.solr.util.TestHarness.<init>(TestHarness.java:125)
	at org.apache.solr.SolrTestCaseJ4.initCore(SolrTestCaseJ4.java:238)
	at org.apache.solr.SolrTestCaseJ4.initCore(SolrTestCaseJ4.java:101)
	at org.apache.solr.SolrTestCaseJ4.initCore(SolrTestCaseJ4.java:89)
	at org.apache.solr.update.DirectUpdateHandlerTest.beforeClass(DirectUpdateHandlerTest.java:42)
Caused by: org.apache.solr.common.cloud.ZooKeeperException: 
	at org.apache.solr.core.CoreContainer.initZooKeeper(CoreContainer.java:183)
	at org.apache.solr.util.TestHarness$Initializer$1.<init>(TestHarness.java:184)
	at org.apache.solr.util.TestHarness$Initializer.initialize(TestHarness.java:179)
	at org.apache.solr.util.TestHarness.<init>(TestHarness.java:140)
Caused by: java.util.concurrent.TimeoutException: Could not connect to ZooKeeper 127.0.0.1:54597/solr within 5000 ms
	at org.apache.solr.common.cloud.ConnectionManager.waitForConnected(ConnectionManager.java:124)
	at org.apache.solr.common.cloud.SolrZkClient.<init>(SolrZkClient.java:121)
	at org.apache.solr.common.cloud.SolrZkClient.<init>(SolrZkClient.java:69)
	at org.apache.solr.cloud.ZkController.<init>(ZkController.java:104)
	at org.apache.solr.core.CoreContainer.initZooKeeper(CoreContainer.java:164)


FAILED:  junit.framework.TestSuite.org.apache.solr.update.DocumentBuilderTest

Error Message:
org.apache.solr.common.cloud.ZooKeeperException: 

Stack Trace:
java.lang.RuntimeException: org.apache.solr.common.cloud.ZooKeeperException: 
	at org.apache.solr.util.TestHarness.<init>(TestHarness.java:153)
	at org.apache.solr.util.TestHarness.<init>(TestHarness.java:135)
	at org.apache.solr.util.TestHarness.<init>(TestHarness.java:125)
	at org.apache.solr.SolrTestCaseJ4.initCore(SolrTestCaseJ4.java:238)
	at org.apache.solr.SolrTestCaseJ4.initCore(SolrTestCaseJ4.java:101)
	at org.apache.solr.SolrTestCaseJ4.initCore(SolrTestCaseJ4.java:89)
	at org.apache.solr.update.DocumentBuilderTest.beforeClass(DocumentBuilderTest.java:37)
Caused by: org.apache.solr.common.cloud.ZooKeeperException: 
	at org.apache.solr.core.CoreContainer.initZooKeeper(CoreContainer.java:183)
	at org.apache.solr.util.TestHarness$Initializer$1.<init>(TestHarness.java:184)
	at org.apache.solr.util.TestHarness$Initializer.initialize(TestHarness.java:179)
	at org.apache.solr.util.TestHarness.<init>(TestHarness.java:140)
Caused by: java.util.concurrent.TimeoutException: Could not connect to ZooKeeper 127.0.0.1:54597/solr within 5000 ms
	at org.apache.solr.common.cloud.ConnectionManager.waitForConnected(ConnectionManager.java:124)
	at org.apache.solr.common.cloud.SolrZkClient.<init>(SolrZkClient.java:121)
	at org.apache.solr.common.cloud.SolrZkClient.<init>(SolrZkClient.java:69)
	at org.apache.solr.cloud.ZkController.<init>(ZkController.java:104)
	at org.apache.solr.core.CoreContainer.initZooKeeper(CoreContainer.java:164)


REGRESSION:  org.apache.solr.update.TestIndexingPerformance.testIndexingPerf

Error Message:
org.apache.solr.common.cloud.ZooKeeperException: 

Stack Trace:
java.lang.RuntimeException: org.apache.solr.common.cloud.ZooKeeperException: 
	at org.apache.solr.util.TestHarness.<init>(TestHarness.java:153)
	at org.apache.solr.util.TestHarness.<init>(TestHarness.java:135)
	at org.apache.solr.util.TestHarness.<init>(TestHarness.java:125)
	at org.apache.solr.util.AbstractSolrTestCase.setUp(AbstractSolrTestCase.java:132)
	at org.apache.lucene.util.LuceneTestCase$LuceneTestCaseRunner.runChild(LuceneTestCase.java:1232)
	at org.apache.lucene.util.LuceneTestCase$LuceneTestCaseRunner.runChild(LuceneTestCase.java:1160)
Caused by: org.apache.solr.common.cloud.ZooKeeperException: 
	at org.apache.solr.core.CoreContainer.initZooKeeper(CoreContainer.java:183)
	at org.apache.solr.util.TestHarness$Initializer$1.<init>(TestHarness.java:184)
	at org.apache.solr.util.TestHarness$Initializer.initialize(TestHarness.java:179)
	at org.apache.solr.util.TestHarness.<init>(TestHarness.java:140)
Caused by: java.util.concurrent.TimeoutException: Could not connect to ZooKeeper 127.0.0.1:54597/solr within 5000 ms
	at org.apache.solr.common.cloud.ConnectionManager.waitForConnected(ConnectionManager.java:124)
	at org.apache.solr.common.cloud.SolrZkClient.<init>(SolrZkClient.java:121)
	at org.apache.solr.common.cloud.SolrZkClient.<init>(SolrZkClient.java:69)
	at org.apache.solr.cloud.ZkController.<init>(ZkController.java:104)
	at org.apache.solr.core.CoreContainer.initZooKeeper(CoreContainer.java:164)


FAILED:  junit.framework.TestSuite.org.apache.solr.update.processor.SignatureUpdateProcessorFactoryTest

Error Message:
org.apache.solr.common.cloud.ZooKeeperException: 

Stack Trace:
java.lang.RuntimeException: org.apache.solr.common.cloud.ZooKeeperException: 
	at org.apache.solr.util.TestHarness.<init>(TestHarness.java:153)
	at org.apache.solr.util.TestHarness.<init>(TestHarness.java:135)
	at org.apache.solr.util.TestHarness.<init>(TestHarness.java:125)
	at org.apache.solr.SolrTestCaseJ4.initCore(SolrTestCaseJ4.java:238)
	at org.apache.solr.SolrTestCaseJ4.initCore(SolrTestCaseJ4.java:101)
	at org.apache.solr.SolrTestCaseJ4.initCore(SolrTestCaseJ4.java:89)
	at org.apache.solr.update.processor.SignatureUpdateProcessorFactoryTest.beforeClass(SignatureUpdateProcessorFactoryTest.java:50)
Caused by: org.apache.solr.common.cloud.ZooKeeperException: 
	at org.apache.solr.core.CoreContainer.initZooKeeper(CoreContainer.java:183)
	at org.apache.solr.util.TestHarness$Initializer$1.<init>(TestHarness.java:184)
	at org.apache.solr.util.TestHarness$Initializer.initialize(TestHarness.java:179)
	at org.apache.solr.util.TestHarness.<init>(TestHarness.java:140)
Caused by: java.util.concurrent.TimeoutException: Could not connect to ZooKeeper 127.0.0.1:54597/solr within 5000 ms
	at org.apache.solr.common.cloud.ConnectionManager.waitForConnected(ConnectionManager.java:124)
	at org.apache.solr.common.cloud.SolrZkClient.<init>(SolrZkClient.java:121)
	at org.apache.solr.common.cloud.SolrZkClient.<init>(SolrZkClient.java:69)
	at org.apache.solr.cloud.ZkController.<init>(ZkController.java:104)
	at org.apache.solr.core.CoreContainer.initZooKeeper(CoreContainer.java:164)


REGRESSION:  org.apache.solr.update.processor.UpdateRequestProcessorFactoryTest.testConfiguration

Error Message:
org.apache.solr.common.cloud.ZooKeeperException: 

Stack Trace:
java.lang.RuntimeException: org.apache.solr.common.cloud.ZooKeeperException: 
	at org.apache.solr.util.TestHarness.<init>(TestHarness.java:153)
	at org.apache.solr.util.TestHarness.<init>(TestHarness.java:135)
	at org.apache.solr.util.TestHarness.<init>(TestHarness.java:125)
	at org.apache.solr.util.AbstractSolrTestCase.setUp(AbstractSolrTestCase.java:132)
	at org.apache.lucene.util.LuceneTestCase$LuceneTestCaseRunner.runChild(LuceneTestCase.java:1232)
	at org.apache.lucene.util.LuceneTestCase$LuceneTestCaseRunner.runChild(LuceneTestCase.java:1160)
Caused by: org.apache.solr.common.cloud.ZooKeeperException: 
	at org.apache.solr.core.CoreContainer.initZooKeeper(CoreContainer.java:183)
	at org.apache.solr.util.TestHarness$Initializer$1.<init>(TestHarness.java:184)
	at org.apache.solr.util.TestHarness$Initializer.initialize(TestHarness.java:179)
	at org.apache.solr.util.TestHarness.<init>(TestHarness.java:140)
Caused by: java.util.concurrent.TimeoutException: Could not connect to ZooKeeper 127.0.0.1:54597/solr within 5000 ms
	at org.apache.solr.common.cloud.ConnectionManager.waitForConnected(ConnectionManager.java:124)
	at org.apache.solr.common.cloud.SolrZkClient.<init>(SolrZkClient.java:121)
	at org.apache.solr.common.cloud.SolrZkClient.<init>(SolrZkClient.java:69)
	at org.apache.solr.cloud.ZkController.<init>(ZkController.java:104)
	at org.apache.solr.core.CoreContainer.initZooKeeper(CoreContainer.java:164)


FAILED:  junit.framework.TestSuite.org.apache.solr.util.SolrPluginUtilsTest

Error Message:
org.apache.solr.common.cloud.ZooKeeperException: 

Stack Trace:
java.lang.RuntimeException: org.apache.solr.common.cloud.ZooKeeperException: 
	at org.apache.solr.util.TestHarness.<init>(TestHarness.java:153)
	at org.apache.solr.util.TestHarness.<init>(TestHarness.java:135)
	at org.apache.solr.util.TestHarness.<init>(TestHarness.java:125)
	at org.apache.solr.SolrTestCaseJ4.initCore(SolrTestCaseJ4.java:238)
	at org.apache.solr.SolrTestCaseJ4.initCore(SolrTestCaseJ4.java:101)
	at org.apache.solr.SolrTestCaseJ4.initCore(SolrTestCaseJ4.java:89)
	at org.apache.solr.util.SolrPluginUtilsTest.beforeClass(SolrPluginUtilsTest.java:56)
Caused by: org.apache.solr.common.cloud.ZooKeeperException: 
	at org.apache.solr.core.CoreContainer.initZooKeeper(CoreContainer.java:183)
	at org.apache.solr.util.TestHarness$Initializer$1.<init>(TestHarness.java:184)
	at org.apache.solr.util.TestHarness$Initializer.initialize(TestHarness.java:179)
	at org.apache.solr.util.TestHarness.<init>(TestHarness.java:140)
Caused by: java.util.concurrent.TimeoutException: Could not connect to ZooKeeper 127.0.0.1:54597/solr within 5000 ms
	at org.apache.solr.common.cloud.ConnectionManager.waitForConnected(ConnectionManager.java:124)
	at org.apache.solr.common.cloud.SolrZkClient.<init>(SolrZkClient.java:121)
	at org.apache.solr.common.cloud.SolrZkClient.<init>(SolrZkClient.java:69)
	at org.apache.solr.cloud.ZkController.<init>(ZkController.java:104)
	at org.apache.solr.core.CoreContainer.initZooKeeper(CoreContainer.java:164)


REGRESSION:  org.apache.solr.velocity.VelocityResponseWriterTest.testTemplateName

Error Message:
org.apache.solr.common.cloud.ZooKeeperException: 

Stack Trace:
java.lang.RuntimeException: org.apache.solr.common.cloud.ZooKeeperException: 
	at org.apache.solr.util.TestHarness.<init>(TestHarness.java:153)
	at org.apache.solr.util.TestHarness.<init>(TestHarness.java:135)
	at org.apache.solr.util.TestHarness.<init>(TestHarness.java:125)
	at org.apache.solr.util.AbstractSolrTestCase.setUp(AbstractSolrTestCase.java:132)
	at org.apache.lucene.util.LuceneTestCase$LuceneTestCaseRunner.runChild(LuceneTestCase.java:1232)
	at org.apache.lucene.util.LuceneTestCase$LuceneTestCaseRunner.runChild(LuceneTestCase.java:1160)
Caused by: org.apache.solr.common.cloud.ZooKeeperException: 
	at org.apache.solr.core.CoreContainer.initZooKeeper(CoreContainer.java:183)
	at org.apache.solr.util.TestHarness$Initializer$1.<init>(TestHarness.java:184)
	at org.apache.solr.util.TestHarness$Initializer.initialize(TestHarness.java:179)
	at org.apache.solr.util.TestHarness.<init>(TestHarness.java:140)
Caused by: java.util.concurrent.TimeoutException: Could not connect to ZooKeeper 127.0.0.1:54597/solr within 5000 ms
	at org.apache.solr.common.cloud.ConnectionManager.waitForConnected(ConnectionManager.java:124)
	at org.apache.solr.common.cloud.SolrZkClient.<init>(SolrZkClient.java:121)
	at org.apache.solr.common.cloud.SolrZkClient.<init>(SolrZkClient.java:69)
	at org.apache.solr.cloud.ZkController.<init>(ZkController.java:104)
	at org.apache.solr.core.CoreContainer.initZooKeeper(CoreContainer.java:164)




Build Log (for compile errors):
[...truncated 12889 lines...]



---------------------------------------------------------------------
To unsubscribe, e-mail: dev-unsubscribe@lucene.apache.org
For additional commands, e-mail: dev-help@lucene.apache.org


Mime
View raw message