lucene-dev mailing list archives

Site index · List index
Message view « Date » · « Thread »
Top « Date » · « Thread »
From Apache Hudson Server <hud...@hudson.apache.org>
Subject [HUDSON] Lucene-Solr-tests-only-trunk - Build # 6994 - Failure
Date Mon, 11 Apr 2011 17:45:13 GMT
Build: https://hudson.apache.org/hudson/job/Lucene-Solr-tests-only-trunk/6994/

11 tests failed.
REGRESSION:  org.apache.lucene.benchmark.byTask.TestPerfTasksLogic.testLineDocFile

Error Message:
Error: cannot init PerfRunData!

Stack Trace:
java.lang.Exception: Error: cannot init PerfRunData!
	at org.apache.lucene.benchmark.byTask.Benchmark.<init>(Benchmark.java:56)
	at org.apache.lucene.benchmark.BenchmarkTestCase.execBenchmark(BenchmarkTestCase.java:66)
	at org.apache.lucene.benchmark.byTask.TestPerfTasksLogic.testLineDocFile(TestPerfTasksLogic.java:424)
	at org.apache.lucene.util.LuceneTestCase$LuceneTestCaseRunner.runChild(LuceneTestCase.java:1232)
	at org.apache.lucene.util.LuceneTestCase$LuceneTestCaseRunner.runChild(LuceneTestCase.java:1160)
Caused by: java.lang.InstantiationException: org.apache.lucene.analysis.MockAnalyzer
	at java.lang.Class.newInstance0(Class.java:357)
	at java.lang.Class.newInstance(Class.java:325)
	at org.apache.lucene.benchmark.byTask.tasks.NewAnalyzerTask.createAnalyzer(NewAnalyzerTask.java:47)
	at org.apache.lucene.benchmark.byTask.PerfRunData.<init>(PerfRunData.java:81)
	at org.apache.lucene.benchmark.byTask.Benchmark.<init>(Benchmark.java:53)


REGRESSION:  org.apache.lucene.benchmark.byTask.TestPerfTasksLogic.testReadTokens

Error Message:
Error: cannot init PerfRunData!

Stack Trace:
java.lang.Exception: Error: cannot init PerfRunData!
	at org.apache.lucene.benchmark.byTask.Benchmark.<init>(Benchmark.java:56)
	at org.apache.lucene.benchmark.BenchmarkTestCase.execBenchmark(BenchmarkTestCase.java:66)
	at org.apache.lucene.benchmark.byTask.TestPerfTasksLogic.testReadTokens(TestPerfTasksLogic.java:463)
	at org.apache.lucene.util.LuceneTestCase$LuceneTestCaseRunner.runChild(LuceneTestCase.java:1232)
	at org.apache.lucene.util.LuceneTestCase$LuceneTestCaseRunner.runChild(LuceneTestCase.java:1160)
Caused by: java.lang.InstantiationException: org.apache.lucene.analysis.MockAnalyzer
	at java.lang.Class.newInstance0(Class.java:357)
	at java.lang.Class.newInstance(Class.java:325)
	at org.apache.lucene.benchmark.byTask.tasks.NewAnalyzerTask.createAnalyzer(NewAnalyzerTask.java:47)
	at org.apache.lucene.benchmark.byTask.PerfRunData.<init>(PerfRunData.java:81)
	at org.apache.lucene.benchmark.byTask.Benchmark.<init>(Benchmark.java:53)


REGRESSION:  org.apache.lucene.benchmark.byTask.TestPerfTasksLogic.testShingleAnalyzer

Error Message:
Error creating Analyzer

Stack Trace:
java.lang.RuntimeException: Error creating Analyzer
	at org.apache.lucene.benchmark.byTask.tasks.NewShingleAnalyzerTask.doLogic(NewShingleAnalyzerTask.java:81)
	at org.apache.lucene.benchmark.byTask.tasks.PerfTask.runAndMaybeStats(PerfTask.java:143)
	at org.apache.lucene.benchmark.byTask.tasks.TaskSequence.doSerialTasks(TaskSequence.java:197)
	at org.apache.lucene.benchmark.byTask.tasks.TaskSequence.doLogic(TaskSequence.java:138)
	at org.apache.lucene.benchmark.byTask.tasks.PerfTask.runAndMaybeStats(PerfTask.java:143)
	at org.apache.lucene.benchmark.byTask.utils.Algorithm.execute(Algorithm.java:301)
	at org.apache.lucene.benchmark.byTask.Benchmark.execute(Benchmark.java:76)
	at org.apache.lucene.benchmark.BenchmarkTestCase.execBenchmark(BenchmarkTestCase.java:67)
	at org.apache.lucene.benchmark.byTask.TestPerfTasksLogic.testShingleAnalyzer(TestPerfTasksLogic.java:1025)
	at org.apache.lucene.util.LuceneTestCase$LuceneTestCaseRunner.runChild(LuceneTestCase.java:1232)
	at org.apache.lucene.util.LuceneTestCase$LuceneTestCaseRunner.runChild(LuceneTestCase.java:1160)
Caused by: java.lang.InstantiationException: org.apache.lucene.analysis.MockAnalyzer
	at java.lang.Class.newInstance0(Class.java:357)
	at java.lang.Class.newInstance(Class.java:325)
	at org.apache.lucene.benchmark.byTask.tasks.NewAnalyzerTask.createAnalyzer(NewAnalyzerTask.java:47)
	at org.apache.lucene.benchmark.byTask.tasks.NewShingleAnalyzerTask.setAnalyzer(NewShingleAnalyzerTask.java:59)
	at org.apache.lucene.benchmark.byTask.tasks.NewShingleAnalyzerTask.doLogic(NewShingleAnalyzerTask.java:76)


REGRESSION:  org.apache.lucene.benchmark.byTask.feeds.DocMakerTest.testIndexProperties

Error Message:
org.apache.lucene.analysis.MockAnalyzer

Stack Trace:
java.lang.InstantiationException: org.apache.lucene.analysis.MockAnalyzer
	at java.lang.Class.newInstance0(Class.java:357)
	at java.lang.Class.newInstance(Class.java:325)
	at org.apache.lucene.benchmark.byTask.tasks.NewAnalyzerTask.createAnalyzer(NewAnalyzerTask.java:47)
	at org.apache.lucene.benchmark.byTask.PerfRunData.<init>(PerfRunData.java:81)
	at org.apache.lucene.benchmark.byTask.feeds.DocMakerTest.doTestIndexProperties(DocMakerTest.java:82)
	at org.apache.lucene.benchmark.byTask.feeds.DocMakerTest.testIndexProperties(DocMakerTest.java:123)
	at org.apache.lucene.util.LuceneTestCase$LuceneTestCaseRunner.runChild(LuceneTestCase.java:1232)
	at org.apache.lucene.util.LuceneTestCase$LuceneTestCaseRunner.runChild(LuceneTestCase.java:1160)


REGRESSION:  org.apache.lucene.benchmark.byTask.feeds.LineDocSourceTest.testBZip2

Error Message:
org.apache.lucene.analysis.MockAnalyzer

Stack Trace:
java.lang.InstantiationException: org.apache.lucene.analysis.MockAnalyzer
	at java.lang.Class.newInstance0(Class.java:357)
	at java.lang.Class.newInstance(Class.java:325)
	at org.apache.lucene.benchmark.byTask.tasks.NewAnalyzerTask.createAnalyzer(NewAnalyzerTask.java:47)
	at org.apache.lucene.benchmark.byTask.PerfRunData.<init>(PerfRunData.java:81)
	at org.apache.lucene.benchmark.byTask.feeds.LineDocSourceTest.doIndexAndSearchTestWithRepeats(LineDocSourceTest.java:132)
	at org.apache.lucene.benchmark.byTask.feeds.LineDocSourceTest.doIndexAndSearchTest(LineDocSourceTest.java:107)
	at org.apache.lucene.benchmark.byTask.feeds.LineDocSourceTest.testBZip2(LineDocSourceTest.java:159)
	at org.apache.lucene.util.LuceneTestCase$LuceneTestCaseRunner.runChild(LuceneTestCase.java:1232)
	at org.apache.lucene.util.LuceneTestCase$LuceneTestCaseRunner.runChild(LuceneTestCase.java:1160)


REGRESSION:  org.apache.lucene.benchmark.byTask.feeds.LineDocSourceTest.testBZip2NoHeaderLine

Error Message:
org.apache.lucene.analysis.MockAnalyzer

Stack Trace:
java.lang.InstantiationException: org.apache.lucene.analysis.MockAnalyzer
	at java.lang.Class.newInstance0(Class.java:357)
	at java.lang.Class.newInstance(Class.java:325)
	at org.apache.lucene.benchmark.byTask.tasks.NewAnalyzerTask.createAnalyzer(NewAnalyzerTask.java:47)
	at org.apache.lucene.benchmark.byTask.PerfRunData.<init>(PerfRunData.java:81)
	at org.apache.lucene.benchmark.byTask.feeds.LineDocSourceTest.doIndexAndSearchTestWithRepeats(LineDocSourceTest.java:132)
	at org.apache.lucene.benchmark.byTask.feeds.LineDocSourceTest.doIndexAndSearchTest(LineDocSourceTest.java:107)
	at org.apache.lucene.benchmark.byTask.feeds.LineDocSourceTest.testBZip2NoHeaderLine(LineDocSourceTest.java:165)
	at org.apache.lucene.util.LuceneTestCase$LuceneTestCaseRunner.runChild(LuceneTestCase.java:1232)
	at org.apache.lucene.util.LuceneTestCase$LuceneTestCaseRunner.runChild(LuceneTestCase.java:1160)


REGRESSION:  org.apache.lucene.benchmark.byTask.feeds.LineDocSourceTest.testRegularFile

Error Message:
org.apache.lucene.analysis.MockAnalyzer

Stack Trace:
java.lang.InstantiationException: org.apache.lucene.analysis.MockAnalyzer
	at java.lang.Class.newInstance0(Class.java:357)
	at java.lang.Class.newInstance(Class.java:325)
	at org.apache.lucene.benchmark.byTask.tasks.NewAnalyzerTask.createAnalyzer(NewAnalyzerTask.java:47)
	at org.apache.lucene.benchmark.byTask.PerfRunData.<init>(PerfRunData.java:81)
	at org.apache.lucene.benchmark.byTask.feeds.LineDocSourceTest.doIndexAndSearchTestWithRepeats(LineDocSourceTest.java:132)
	at org.apache.lucene.benchmark.byTask.feeds.LineDocSourceTest.doIndexAndSearchTest(LineDocSourceTest.java:107)
	at org.apache.lucene.benchmark.byTask.feeds.LineDocSourceTest.testRegularFile(LineDocSourceTest.java:171)
	at org.apache.lucene.util.LuceneTestCase$LuceneTestCaseRunner.runChild(LuceneTestCase.java:1232)
	at org.apache.lucene.util.LuceneTestCase$LuceneTestCaseRunner.runChild(LuceneTestCase.java:1160)


REGRESSION:  org.apache.lucene.benchmark.byTask.feeds.LineDocSourceTest.testRegularFileSpecialHeader

Error Message:
org.apache.lucene.analysis.MockAnalyzer

Stack Trace:
java.lang.InstantiationException: org.apache.lucene.analysis.MockAnalyzer
	at java.lang.Class.newInstance0(Class.java:357)
	at java.lang.Class.newInstance(Class.java:325)
	at org.apache.lucene.benchmark.byTask.tasks.NewAnalyzerTask.createAnalyzer(NewAnalyzerTask.java:47)
	at org.apache.lucene.benchmark.byTask.PerfRunData.<init>(PerfRunData.java:81)
	at org.apache.lucene.benchmark.byTask.feeds.LineDocSourceTest.doIndexAndSearchTestWithRepeats(LineDocSourceTest.java:132)
	at org.apache.lucene.benchmark.byTask.feeds.LineDocSourceTest.doIndexAndSearchTest(LineDocSourceTest.java:107)
	at org.apache.lucene.benchmark.byTask.feeds.LineDocSourceTest.testRegularFileSpecialHeader(LineDocSourceTest.java:177)
	at org.apache.lucene.util.LuceneTestCase$LuceneTestCaseRunner.runChild(LuceneTestCase.java:1232)
	at org.apache.lucene.util.LuceneTestCase$LuceneTestCaseRunner.runChild(LuceneTestCase.java:1160)


REGRESSION:  org.apache.lucene.benchmark.byTask.feeds.LineDocSourceTest.testRegularFileNoHeaderLine

Error Message:
org.apache.lucene.analysis.MockAnalyzer

Stack Trace:
java.lang.InstantiationException: org.apache.lucene.analysis.MockAnalyzer
	at java.lang.Class.newInstance0(Class.java:357)
	at java.lang.Class.newInstance(Class.java:325)
	at org.apache.lucene.benchmark.byTask.tasks.NewAnalyzerTask.createAnalyzer(NewAnalyzerTask.java:47)
	at org.apache.lucene.benchmark.byTask.PerfRunData.<init>(PerfRunData.java:81)
	at org.apache.lucene.benchmark.byTask.feeds.LineDocSourceTest.doIndexAndSearchTestWithRepeats(LineDocSourceTest.java:132)
	at org.apache.lucene.benchmark.byTask.feeds.LineDocSourceTest.doIndexAndSearchTest(LineDocSourceTest.java:107)
	at org.apache.lucene.benchmark.byTask.feeds.LineDocSourceTest.testRegularFileNoHeaderLine(LineDocSourceTest.java:183)
	at org.apache.lucene.util.LuceneTestCase$LuceneTestCaseRunner.runChild(LuceneTestCase.java:1232)
	at org.apache.lucene.util.LuceneTestCase$LuceneTestCaseRunner.runChild(LuceneTestCase.java:1160)


REGRESSION:  org.apache.lucene.benchmark.byTask.feeds.LineDocSourceTest.testWithDocsName

Error Message:
org.apache.lucene.analysis.MockAnalyzer

Stack Trace:
java.lang.InstantiationException: org.apache.lucene.analysis.MockAnalyzer
	at java.lang.Class.newInstance0(Class.java:357)
	at java.lang.Class.newInstance(Class.java:325)
	at org.apache.lucene.benchmark.byTask.tasks.NewAnalyzerTask.createAnalyzer(NewAnalyzerTask.java:47)
	at org.apache.lucene.benchmark.byTask.PerfRunData.<init>(PerfRunData.java:81)
	at org.apache.lucene.benchmark.byTask.feeds.LineDocSourceTest.doIndexAndSearchTestWithRepeats(LineDocSourceTest.java:132)
	at org.apache.lucene.benchmark.byTask.feeds.LineDocSourceTest.doIndexAndSearchTest(LineDocSourceTest.java:107)
	at org.apache.lucene.benchmark.byTask.feeds.LineDocSourceTest.testWithDocsName(LineDocSourceTest.java:215)
	at org.apache.lucene.util.LuceneTestCase$LuceneTestCaseRunner.runChild(LuceneTestCase.java:1232)
	at org.apache.lucene.util.LuceneTestCase$LuceneTestCaseRunner.runChild(LuceneTestCase.java:1160)


REGRESSION:  org.apache.lucene.benchmark.byTask.feeds.LineDocSourceTest.testWithProperties

Error Message:
org.apache.lucene.analysis.MockAnalyzer

Stack Trace:
java.lang.InstantiationException: org.apache.lucene.analysis.MockAnalyzer
	at java.lang.Class.newInstance0(Class.java:357)
	at java.lang.Class.newInstance(Class.java:325)
	at org.apache.lucene.benchmark.byTask.tasks.NewAnalyzerTask.createAnalyzer(NewAnalyzerTask.java:47)
	at org.apache.lucene.benchmark.byTask.PerfRunData.<init>(PerfRunData.java:81)
	at org.apache.lucene.benchmark.byTask.feeds.LineDocSourceTest.doIndexAndSearchTestWithRepeats(LineDocSourceTest.java:132)
	at org.apache.lucene.benchmark.byTask.feeds.LineDocSourceTest.doIndexAndSearchTest(LineDocSourceTest.java:107)
	at org.apache.lucene.benchmark.byTask.feeds.LineDocSourceTest.testWithProperties(LineDocSourceTest.java:223)
	at org.apache.lucene.util.LuceneTestCase$LuceneTestCaseRunner.runChild(LuceneTestCase.java:1232)
	at org.apache.lucene.util.LuceneTestCase$LuceneTestCaseRunner.runChild(LuceneTestCase.java:1160)




Build Log (for compile errors):
[...truncated 6826 lines...]



---------------------------------------------------------------------
To unsubscribe, e-mail: dev-unsubscribe@lucene.apache.org
For additional commands, e-mail: dev-help@lucene.apache.org


Mime
View raw message