lucene-dev mailing list archives

Site index · List index
Message view « Date » · « Thread »
Top « Date » · « Thread »
From Apache Jenkins Server <hud...@hudson.apache.org>
Subject [HUDSON] Lucene-trunk - Build # 1537 - Failure
Date Fri, 22 Apr 2011 02:38:29 GMT
Build: https://builds.apache.org/hudson/job/Lucene-trunk/1537/

21 tests failed.
REGRESSION:  org.apache.lucene.index.TestNRTThreads.testNRTThreads

Error Message:
/usr/home/hudson/hudson-slave/workspace/Lucene-trunk/checkout/lucene/build/test/1/nrtopenfiles.4311211294863747903/_bx.tvd
(Too many open files in system)

Stack Trace:
java.io.FileNotFoundException: /usr/home/hudson/hudson-slave/workspace/Lucene-trunk/checkout/lucene/build/test/1/nrtopenfiles.4311211294863747903/_bx.tvd
(Too many open files in system)
	at java.io.RandomAccessFile.open(Native Method)
	at java.io.RandomAccessFile.<init>(RandomAccessFile.java:233)
	at org.apache.lucene.store.SimpleFSDirectory$SimpleFSIndexInput$Descriptor.<init>(SimpleFSDirectory.java:69)
	at org.apache.lucene.store.SimpleFSDirectory$SimpleFSIndexInput.<init>(SimpleFSDirectory.java:90)
	at org.apache.lucene.store.NIOFSDirectory$NIOFSIndexInput.<init>(NIOFSDirectory.java:91)
	at org.apache.lucene.store.NIOFSDirectory.openInput(NIOFSDirectory.java:78)
	at org.apache.lucene.store.FSDirectory.openInput(FSDirectory.java:345)
	at org.apache.lucene.store.MockDirectoryWrapper.openInput(MockDirectoryWrapper.java:374)
	at org.apache.lucene.store.Directory.openInput(Directory.java:122)
	at org.apache.lucene.index.TermVectorsReader.<init>(TermVectorsReader.java:83)
	at org.apache.lucene.index.SegmentReader$CoreReaders.openDocStores(SegmentReader.java:236)
	at org.apache.lucene.index.SegmentReader.openDocStores(SegmentReader.java:515)
	at org.apache.lucene.index.IndexWriter$ReaderPool.get(IndexWriter.java:611)
	at org.apache.lucene.index.IndexWriter$ReaderPool.getReadOnlyClone(IndexWriter.java:560)
	at org.apache.lucene.index.DirectoryReader.<init>(DirectoryReader.java:172)
	at org.apache.lucene.index.IndexWriter.getReader(IndexWriter.java:360)
	at org.apache.lucene.index.DirectoryReader.doReopenFromWriter(DirectoryReader.java:419)
	at org.apache.lucene.index.DirectoryReader.doReopen(DirectoryReader.java:432)
	at org.apache.lucene.index.DirectoryReader.reopen(DirectoryReader.java:392)
	at org.apache.lucene.index.TestNRTThreads.testNRTThreads(TestNRTThreads.java:213)
	at org.apache.lucene.util.LuceneTestCase$LuceneTestCaseRunner.runChild(LuceneTestCase.java:1232)
	at org.apache.lucene.util.LuceneTestCase$LuceneTestCaseRunner.runChild(LuceneTestCase.java:1160)


REGRESSION:  org.apache.lucene.index.TestOmitNorms.testOmitNormsCombos

Error Message:
/usr/home/hudson/hudson-slave/workspace/Lucene-trunk/checkout/lucene/build/test/1/test8730544420518378026tmp/_i_0.skp
(Too many open files in system)

Stack Trace:
java.io.FileNotFoundException: /usr/home/hudson/hudson-slave/workspace/Lucene-trunk/checkout/lucene/build/test/1/test8730544420518378026tmp/_i_0.skp
(Too many open files in system)
	at java.io.RandomAccessFile.open(Native Method)
	at java.io.RandomAccessFile.<init>(RandomAccessFile.java:233)
	at org.apache.lucene.store.FSDirectory$FSIndexOutput.<init>(FSDirectory.java:448)
	at org.apache.lucene.store.FSDirectory.createOutput(FSDirectory.java:312)
	at org.apache.lucene.store.MockDirectoryWrapper.createOutput(MockDirectoryWrapper.java:348)
	at org.apache.lucene.index.codecs.sep.SepPostingsWriterImpl.<init>(SepPostingsWriterImpl.java:139)
	at org.apache.lucene.index.codecs.sep.SepPostingsWriterImpl.<init>(SepPostingsWriterImpl.java:106)
	at org.apache.lucene.index.codecs.mockintblock.MockFixedIntBlockCodec.fieldsConsumer(MockFixedIntBlockCodec.java:114)
	at org.apache.lucene.index.PerFieldCodecWrapper$FieldsWriter.<init>(PerFieldCodecWrapper.java:64)
	at org.apache.lucene.index.PerFieldCodecWrapper.fieldsConsumer(PerFieldCodecWrapper.java:54)
	at org.apache.lucene.index.FreqProxTermsWriter.flush(FreqProxTermsWriter.java:78)
	at org.apache.lucene.index.TermsHash.flush(TermsHash.java:103)
	at org.apache.lucene.index.DocInverter.flush(DocInverter.java:65)
	at org.apache.lucene.index.DocFieldProcessor.flush(DocFieldProcessor.java:55)
	at org.apache.lucene.index.DocumentsWriter.flush(DocumentsWriter.java:567)
	at org.apache.lucene.index.IndexWriter.doFlush(IndexWriter.java:2497)
	at org.apache.lucene.index.IndexWriter.flush(IndexWriter.java:2462)
	at org.apache.lucene.index.IndexWriter.addDocument(IndexWriter.java:1211)
	at org.apache.lucene.index.IndexWriter.addDocument(IndexWriter.java:1180)
	at org.apache.lucene.index.RandomIndexWriter.addDocument(RandomIndexWriter.java:101)
	at org.apache.lucene.index.TestOmitNorms.getNorms(TestOmitNorms.java:285)
	at org.apache.lucene.index.TestOmitNorms.testOmitNormsCombos(TestOmitNorms.java:244)
	at org.apache.lucene.util.LuceneTestCase$LuceneTestCaseRunner.runChild(LuceneTestCase.java:1232)
	at org.apache.lucene.util.LuceneTestCase$LuceneTestCaseRunner.runChild(LuceneTestCase.java:1160)


REGRESSION:  org.apache.lucene.index.TestOmitTf.testOmitTermFreqAndPositions

Error Message:
directory '/usr/home/hudson/hudson-slave/workspace/Lucene-trunk/checkout/lucene/build/test/1/test4121101481548326362tmp'
exists and is a directory, but cannot be listed: list() returned null

Stack Trace:
java.io.IOException: directory '/usr/home/hudson/hudson-slave/workspace/Lucene-trunk/checkout/lucene/build/test/1/test4121101481548326362tmp'
exists and is a directory, but cannot be listed: list() returned null
	at org.apache.lucene.store.FSDirectory.listAll(FSDirectory.java:239)
	at org.apache.lucene.store.FSDirectory.listAll(FSDirectory.java:250)
	at org.apache.lucene.store.MockDirectoryWrapper.listAll(MockDirectoryWrapper.java:519)
	at org.apache.lucene.index.IndexFileDeleter.refresh(IndexFileDeleter.java:320)
	at org.apache.lucene.index.DocumentsWriter.flush(DocumentsWriter.java:644)
	at org.apache.lucene.index.IndexWriter.doFlush(IndexWriter.java:2497)
	at org.apache.lucene.index.IndexWriter.flush(IndexWriter.java:2462)
	at org.apache.lucene.index.IndexWriter.optimize(IndexWriter.java:1543)
	at org.apache.lucene.index.IndexWriter.optimize(IndexWriter.java:1519)
	at org.apache.lucene.index.IndexWriter.optimize(IndexWriter.java:1489)
	at org.apache.lucene.index.TestOmitTf.testOmitTermFreqAndPositions(TestOmitTf.java:82)
	at org.apache.lucene.util.LuceneTestCase$LuceneTestCaseRunner.runChild(LuceneTestCase.java:1232)
	at org.apache.lucene.util.LuceneTestCase$LuceneTestCaseRunner.runChild(LuceneTestCase.java:1160)


REGRESSION:  org.apache.lucene.index.TestSegmentReader.testTermVectors

Error Message:
/usr/home/hudson/hudson-slave/workspace/Lucene-trunk/checkout/lucene/build/test/1/test7957538099393354396tmp/_0_2.tii
(Too many open files in system)

Stack Trace:
java.io.FileNotFoundException: /usr/home/hudson/hudson-slave/workspace/Lucene-trunk/checkout/lucene/build/test/1/test7957538099393354396tmp/_0_2.tii
(Too many open files in system)
	at java.io.RandomAccessFile.open(Native Method)
	at java.io.RandomAccessFile.<init>(RandomAccessFile.java:233)
	at org.apache.lucene.store.FSDirectory$FSIndexOutput.<init>(FSDirectory.java:448)
	at org.apache.lucene.store.FSDirectory.createOutput(FSDirectory.java:312)
	at org.apache.lucene.store.MockDirectoryWrapper.createOutput(MockDirectoryWrapper.java:348)
	at org.apache.lucene.index.codecs.FixedGapTermsIndexWriter.<init>(FixedGapTermsIndexWriter.java:60)
	at org.apache.lucene.index.codecs.mockrandom.MockRandomCodec.fieldsConsumer(MockRandomCodec.java:171)
	at org.apache.lucene.index.PerFieldCodecWrapper$FieldsWriter.<init>(PerFieldCodecWrapper.java:64)
	at org.apache.lucene.index.PerFieldCodecWrapper.fieldsConsumer(PerFieldCodecWrapper.java:54)
	at org.apache.lucene.index.FreqProxTermsWriter.flush(FreqProxTermsWriter.java:78)
	at org.apache.lucene.index.TermsHash.flush(TermsHash.java:103)
	at org.apache.lucene.index.DocInverter.flush(DocInverter.java:65)
	at org.apache.lucene.index.DocFieldProcessor.flush(DocFieldProcessor.java:55)
	at org.apache.lucene.index.DocumentsWriter.flush(DocumentsWriter.java:567)
	at org.apache.lucene.index.IndexWriter.doFlush(IndexWriter.java:2497)
	at org.apache.lucene.index.IndexWriter.flush(IndexWriter.java:2462)
	at org.apache.lucene.index.IndexWriter.prepareCommit(IndexWriter.java:2332)
	at org.apache.lucene.index.IndexWriter.commitInternal(IndexWriter.java:2405)
	at org.apache.lucene.index.IndexWriter.commit(IndexWriter.java:2387)
	at org.apache.lucene.index.IndexWriter.commit(IndexWriter.java:2371)
	at org.apache.lucene.index.DocHelper.writeDoc(DocHelper.java:244)
	at org.apache.lucene.index.DocHelper.writeDoc(DocHelper.java:226)
	at org.apache.lucene.index.TestSegmentReader.setUp(TestSegmentReader.java:43)
	at org.apache.lucene.util.LuceneTestCase$LuceneTestCaseRunner.runChild(LuceneTestCase.java:1232)
	at org.apache.lucene.util.LuceneTestCase$LuceneTestCaseRunner.runChild(LuceneTestCase.java:1160)


REGRESSION:  org.apache.lucene.index.TestSegmentReader.testNorms

Error Message:
/usr/home/hudson/hudson-slave/workspace/Lucene-trunk/checkout/lucene/build/test/1/test8915190504613531668tmp/_0.tvd
(Too many open files in system)

Stack Trace:
java.io.FileNotFoundException: /usr/home/hudson/hudson-slave/workspace/Lucene-trunk/checkout/lucene/build/test/1/test8915190504613531668tmp/_0.tvd
(Too many open files in system)
	at java.io.RandomAccessFile.open(Native Method)
	at java.io.RandomAccessFile.<init>(RandomAccessFile.java:233)
	at org.apache.lucene.store.FSDirectory$FSIndexOutput.<init>(FSDirectory.java:448)
	at org.apache.lucene.store.FSDirectory.createOutput(FSDirectory.java:312)
	at org.apache.lucene.store.MockDirectoryWrapper.createOutput(MockDirectoryWrapper.java:348)
	at org.apache.lucene.index.TermVectorsTermsWriter.initTermVectorsWriter(TermVectorsTermsWriter.java:124)
	at org.apache.lucene.index.TermVectorsTermsWriter.finishDocument(TermVectorsTermsWriter.java:139)
	at org.apache.lucene.index.TermVectorsTermsWriter$PerDoc.finish(TermVectorsTermsWriter.java:240)
	at org.apache.lucene.index.DocFieldProcessorPerThread$PerDoc.finish(DocFieldProcessorPerThread.java:287)
	at org.apache.lucene.index.DocumentsWriter$WaitQueue.writeDocument(DocumentsWriter.java:1123)
	at org.apache.lucene.index.DocumentsWriter$WaitQueue.add(DocumentsWriter.java:1143)
	at org.apache.lucene.index.DocumentsWriter.finishDocument(DocumentsWriter.java:869)
	at org.apache.lucene.index.DocumentsWriter.updateDocument(DocumentsWriter.java:758)
	at org.apache.lucene.index.IndexWriter.addDocument(IndexWriter.java:1204)
	at org.apache.lucene.index.IndexWriter.addDocument(IndexWriter.java:1180)
	at org.apache.lucene.index.DocHelper.writeDoc(DocHelper.java:243)
	at org.apache.lucene.index.DocHelper.writeDoc(DocHelper.java:226)
	at org.apache.lucene.index.TestSegmentReader.setUp(TestSegmentReader.java:43)
	at org.apache.lucene.util.LuceneTestCase$LuceneTestCaseRunner.runChild(LuceneTestCase.java:1232)
	at org.apache.lucene.util.LuceneTestCase$LuceneTestCaseRunner.runChild(LuceneTestCase.java:1160)


FAILED:  junit.framework.TestSuite.org.apache.lucene.index.TestSegmentReader

Error Message:
directory of test was not closed, opened from: org.apache.lucene.index.TestSegmentReader.setUp(TestSegmentReader.java:41)

Stack Trace:
junit.framework.AssertionFailedError: directory of test was not closed, opened from: org.apache.lucene.index.TestSegmentReader.setUp(TestSegmentReader.java:41)
	at org.apache.lucene.util.LuceneTestCase.afterClassLuceneTestCaseJ4(LuceneTestCase.java:391)


REGRESSION:  org.apache.lucene.index.TestSegmentTermDocs.testSkipTo

Error Message:
/usr/home/hudson/hudson-slave/workspace/Lucene-trunk/checkout/lucene/build/test/1/test3173618465884345765tmp/_0.tvx
(Too many open files in system)

Stack Trace:
java.io.FileNotFoundException: /usr/home/hudson/hudson-slave/workspace/Lucene-trunk/checkout/lucene/build/test/1/test3173618465884345765tmp/_0.tvx
(Too many open files in system)
	at java.io.RandomAccessFile.open(Native Method)
	at java.io.RandomAccessFile.<init>(RandomAccessFile.java:233)
	at org.apache.lucene.store.FSDirectory$FSIndexOutput.<init>(FSDirectory.java:448)
	at org.apache.lucene.store.FSDirectory.createOutput(FSDirectory.java:312)
	at org.apache.lucene.store.MockDirectoryWrapper.createOutput(MockDirectoryWrapper.java:348)
	at org.apache.lucene.index.TermVectorsTermsWriter.initTermVectorsWriter(TermVectorsTermsWriter.java:123)
	at org.apache.lucene.index.TermVectorsTermsWriter.finishDocument(TermVectorsTermsWriter.java:139)
	at org.apache.lucene.index.TermVectorsTermsWriter$PerDoc.finish(TermVectorsTermsWriter.java:240)
	at org.apache.lucene.index.DocFieldProcessorPerThread$PerDoc.finish(DocFieldProcessorPerThread.java:287)
	at org.apache.lucene.index.DocumentsWriter$WaitQueue.writeDocument(DocumentsWriter.java:1123)
	at org.apache.lucene.index.DocumentsWriter$WaitQueue.add(DocumentsWriter.java:1143)
	at org.apache.lucene.index.DocumentsWriter.finishDocument(DocumentsWriter.java:869)
	at org.apache.lucene.index.DocumentsWriter.updateDocument(DocumentsWriter.java:758)
	at org.apache.lucene.index.IndexWriter.addDocument(IndexWriter.java:1204)
	at org.apache.lucene.index.IndexWriter.addDocument(IndexWriter.java:1180)
	at org.apache.lucene.index.DocHelper.writeDoc(DocHelper.java:243)
	at org.apache.lucene.index.DocHelper.writeDoc(DocHelper.java:226)
	at org.apache.lucene.index.TestSegmentTermDocs.setUp(TestSegmentTermDocs.java:39)
	at org.apache.lucene.util.LuceneTestCase$LuceneTestCaseRunner.runChild(LuceneTestCase.java:1232)
	at org.apache.lucene.util.LuceneTestCase$LuceneTestCaseRunner.runChild(LuceneTestCase.java:1160)


REGRESSION:  org.apache.lucene.index.TestSnapshotDeletionPolicy.testMultiThreadedSnapshotting

Error Message:
/usr/home/hudson/hudson-slave/workspace/Lucene-trunk/checkout/lucene/build/test/1/test1397788482629122902tmp/_3.fdx
(Too many open files in system)

Stack Trace:
java.io.FileNotFoundException: /usr/home/hudson/hudson-slave/workspace/Lucene-trunk/checkout/lucene/build/test/1/test1397788482629122902tmp/_3.fdx
(Too many open files in system)
	at java.io.RandomAccessFile.open(Native Method)
	at java.io.RandomAccessFile.<init>(RandomAccessFile.java:233)
	at org.apache.lucene.store.FSDirectory$FSIndexOutput.<init>(FSDirectory.java:448)
	at org.apache.lucene.store.FSDirectory.createOutput(FSDirectory.java:312)
	at org.apache.lucene.store.MockDirectoryWrapper.createOutput(MockDirectoryWrapper.java:348)
	at org.apache.lucene.index.FieldsWriter.<init>(FieldsWriter.java:58)
	at org.apache.lucene.index.StoredFieldsWriter.initFieldsWriter(StoredFieldsWriter.java:63)
	at org.apache.lucene.index.StoredFieldsWriter.flush(StoredFieldsWriter.java:45)
	at org.apache.lucene.index.DocFieldProcessor.flush(DocFieldProcessor.java:54)
	at org.apache.lucene.index.DocumentsWriter.flush(DocumentsWriter.java:567)
	at org.apache.lucene.index.IndexWriter.doFlush(IndexWriter.java:2497)
	at org.apache.lucene.index.IndexWriter.flush(IndexWriter.java:2462)
	at org.apache.lucene.index.IndexWriter.prepareCommit(IndexWriter.java:2332)
	at org.apache.lucene.index.IndexWriter.commitInternal(IndexWriter.java:2405)
	at org.apache.lucene.index.IndexWriter.commit(IndexWriter.java:2387)
	at org.apache.lucene.index.IndexWriter.commit(IndexWriter.java:2371)
	at org.apache.lucene.index.TestSnapshotDeletionPolicy.testMultiThreadedSnapshotting(TestSnapshotDeletionPolicy.java:297)
	at org.apache.lucene.util.LuceneTestCase$LuceneTestCaseRunner.runChild(LuceneTestCase.java:1232)
	at org.apache.lucene.util.LuceneTestCase$LuceneTestCaseRunner.runChild(LuceneTestCase.java:1160)


REGRESSION:  org.apache.lucene.index.TestStressIndexing.testStressIndexAndSearching

Error Message:
directory '/usr/home/hudson/hudson-slave/workspace/Lucene-trunk/checkout/lucene/build/test/1/test3830609905074077211tmp'
exists and is a directory, but cannot be listed: list() returned null

Stack Trace:
java.io.IOException: directory '/usr/home/hudson/hudson-slave/workspace/Lucene-trunk/checkout/lucene/build/test/1/test3830609905074077211tmp'
exists and is a directory, but cannot be listed: list() returned null
	at org.apache.lucene.store.FSDirectory.listAll(FSDirectory.java:239)
	at org.apache.lucene.store.FSDirectory.listAll(FSDirectory.java:250)
	at org.apache.lucene.store.MockDirectoryWrapper.listAll(MockDirectoryWrapper.java:519)
	at org.apache.lucene.index.IndexFileDeleter.<init>(IndexFileDeleter.java:146)
	at org.apache.lucene.index.IndexWriter.<init>(IndexWriter.java:799)
	at org.apache.lucene.index.TestStressIndexing.runStressTest(TestStressIndexing.java:116)
	at org.apache.lucene.index.TestStressIndexing.testStressIndexAndSearching(TestStressIndexing.java:165)
	at org.apache.lucene.util.LuceneTestCase$LuceneTestCaseRunner.runChild(LuceneTestCase.java:1232)
	at org.apache.lucene.util.LuceneTestCase$LuceneTestCaseRunner.runChild(LuceneTestCase.java:1160)


REGRESSION:  org.apache.lucene.index.TestStressIndexing2.testMultiConfig

Error Message:
directory '/usr/home/hudson/hudson-slave/workspace/Lucene-trunk/checkout/lucene/build/test/1/test3549578837374278366tmp'
exists and is a directory, but cannot be listed: list() returned null

Stack Trace:
java.io.IOException: directory '/usr/home/hudson/hudson-slave/workspace/Lucene-trunk/checkout/lucene/build/test/1/test3549578837374278366tmp'
exists and is a directory, but cannot be listed: list() returned null
	at org.apache.lucene.store.FSDirectory.listAll(FSDirectory.java:239)
	at org.apache.lucene.store.FSDirectory.listAll(FSDirectory.java:250)
	at org.apache.lucene.store.MockDirectoryWrapper.listAll(MockDirectoryWrapper.java:519)
	at org.apache.lucene.index.IndexFileDeleter.<init>(IndexFileDeleter.java:146)
	at org.apache.lucene.index.IndexWriter.<init>(IndexWriter.java:799)
	at org.apache.lucene.index.TestStressIndexing2$MockIndexWriter.<init>(TestStressIndexing2.java:50)
	at org.apache.lucene.index.TestStressIndexing2.indexRandom(TestStressIndexing2.java:202)
	at org.apache.lucene.index.TestStressIndexing2.testMultiConfig(TestStressIndexing2.java:116)
	at org.apache.lucene.util.LuceneTestCase$LuceneTestCaseRunner.runChild(LuceneTestCase.java:1232)
	at org.apache.lucene.util.LuceneTestCase$LuceneTestCaseRunner.runChild(LuceneTestCase.java:1160)


REGRESSION:  org.apache.lucene.index.TestTermVectorsReader.test

Error Message:
directory '/usr/home/hudson/hudson-slave/workspace/Lucene-trunk/checkout/lucene/build/test/1/test944808210296384697tmp'
exists and is a directory, but cannot be listed: list() returned null

Stack Trace:
java.io.IOException: directory '/usr/home/hudson/hudson-slave/workspace/Lucene-trunk/checkout/lucene/build/test/1/test944808210296384697tmp'
exists and is a directory, but cannot be listed: list() returned null
	at org.apache.lucene.store.FSDirectory.listAll(FSDirectory.java:239)
	at org.apache.lucene.store.FSDirectory.listAll(FSDirectory.java:250)
	at org.apache.lucene.store.MockDirectoryWrapper.listAll(MockDirectoryWrapper.java:519)
	at org.apache.lucene.index.IndexFileDeleter.<init>(IndexFileDeleter.java:146)
	at org.apache.lucene.index.IndexWriter.<init>(IndexWriter.java:799)
	at org.apache.lucene.index.TestTermVectorsReader.setUp(TestTermVectorsReader.java:93)
	at org.apache.lucene.util.LuceneTestCase$LuceneTestCaseRunner.runChild(LuceneTestCase.java:1232)
	at org.apache.lucene.util.LuceneTestCase$LuceneTestCaseRunner.runChild(LuceneTestCase.java:1160)


REGRESSION:  org.apache.lucene.index.TestTermVectorsReader.testReader

Error Message:
directory '/usr/home/hudson/hudson-slave/workspace/Lucene-trunk/checkout/lucene/build/test/1/test7287202819723367093tmp'
exists and is a directory, but cannot be listed: list() returned null

Stack Trace:
java.io.IOException: directory '/usr/home/hudson/hudson-slave/workspace/Lucene-trunk/checkout/lucene/build/test/1/test7287202819723367093tmp'
exists and is a directory, but cannot be listed: list() returned null
	at org.apache.lucene.store.FSDirectory.listAll(FSDirectory.java:239)
	at org.apache.lucene.store.FSDirectory.listAll(FSDirectory.java:250)
	at org.apache.lucene.store.MockDirectoryWrapper.listAll(MockDirectoryWrapper.java:519)
	at org.apache.lucene.index.IndexFileDeleter.<init>(IndexFileDeleter.java:146)
	at org.apache.lucene.index.IndexWriter.<init>(IndexWriter.java:799)
	at org.apache.lucene.index.TestTermVectorsReader.setUp(TestTermVectorsReader.java:93)
	at org.apache.lucene.util.LuceneTestCase$LuceneTestCaseRunner.runChild(LuceneTestCase.java:1232)
	at org.apache.lucene.util.LuceneTestCase$LuceneTestCaseRunner.runChild(LuceneTestCase.java:1160)


REGRESSION:  org.apache.lucene.index.TestTermVectorsWriter.testEndOffsetPositionWithCachingTokenFilter

Error Message:
directory '/usr/home/hudson/hudson-slave/workspace/Lucene-trunk/checkout/lucene/build/test/1/test2308683231633574856tmp'
exists and is a directory, but cannot be listed: list() returned null

Stack Trace:
java.io.IOException: directory '/usr/home/hudson/hudson-slave/workspace/Lucene-trunk/checkout/lucene/build/test/1/test2308683231633574856tmp'
exists and is a directory, but cannot be listed: list() returned null
	at org.apache.lucene.store.FSDirectory.listAll(FSDirectory.java:239)
	at org.apache.lucene.store.FSDirectory.listAll(FSDirectory.java:250)
	at org.apache.lucene.store.MockDirectoryWrapper.listAll(MockDirectoryWrapper.java:519)
	at org.apache.lucene.index.IndexFileDeleter.<init>(IndexFileDeleter.java:146)
	at org.apache.lucene.index.IndexWriter.<init>(IndexWriter.java:799)
	at org.apache.lucene.index.TestTermVectorsWriter.testEndOffsetPositionWithCachingTokenFilter(TestTermVectorsWriter.java:122)
	at org.apache.lucene.util.LuceneTestCase$LuceneTestCaseRunner.runChild(LuceneTestCase.java:1232)
	at org.apache.lucene.util.LuceneTestCase$LuceneTestCaseRunner.runChild(LuceneTestCase.java:1160)


REGRESSION:  org.apache.lucene.index.TestTieredMergePolicy.testPartialOptimize

Error Message:
directory '/usr/home/hudson/hudson-slave/workspace/Lucene-trunk/checkout/lucene/build/test/1/test3093345603118381990tmp'
exists and is a directory, but cannot be listed: list() returned null

Stack Trace:
java.io.IOException: directory '/usr/home/hudson/hudson-slave/workspace/Lucene-trunk/checkout/lucene/build/test/1/test3093345603118381990tmp'
exists and is a directory, but cannot be listed: list() returned null
	at org.apache.lucene.store.FSDirectory.listAll(FSDirectory.java:239)
	at org.apache.lucene.store.FSDirectory.listAll(FSDirectory.java:250)
	at org.apache.lucene.store.MockDirectoryWrapper.listAll(MockDirectoryWrapper.java:519)
	at org.apache.lucene.index.IndexFileDeleter.<init>(IndexFileDeleter.java:146)
	at org.apache.lucene.index.IndexWriter.<init>(IndexWriter.java:799)
	at org.apache.lucene.index.TestTieredMergePolicy.testPartialOptimize(TestTieredMergePolicy.java:82)
	at org.apache.lucene.util.LuceneTestCase$LuceneTestCaseRunner.runChild(LuceneTestCase.java:1232)
	at org.apache.lucene.util.LuceneTestCase$LuceneTestCaseRunner.runChild(LuceneTestCase.java:1160)


REGRESSION:  org.apache.lucene.index.codecs.preflex.TestSurrogates.testSurrogatesOrder

Error Message:
Java heap space

Stack Trace:
java.lang.OutOfMemoryError: Java heap space
	at org.apache.lucene.store.RAMFile.newBuffer(RAMFile.java:85)
	at org.apache.lucene.store.RAMFile.addBuffer(RAMFile.java:58)
	at org.apache.lucene.store.RAMOutputStream.switchCurrentBuffer(RAMOutputStream.java:132)
	at org.apache.lucene.store.RAMOutputStream.copyBytes(RAMOutputStream.java:171)
	at org.apache.lucene.store.MockIndexOutputWrapper.copyBytes(MockIndexOutputWrapper.java:155)
	at org.apache.lucene.index.CompoundFileWriter.copyFile(CompoundFileWriter.java:222)
	at org.apache.lucene.index.CompoundFileWriter.close(CompoundFileWriter.java:188)
	at org.apache.lucene.index.SegmentMerger.createCompoundFile(SegmentMerger.java:140)
	at org.apache.lucene.index.IndexWriter.mergeMiddle(IndexWriter.java:3216)
	at org.apache.lucene.index.IndexWriter.merge(IndexWriter.java:2834)
	at org.apache.lucene.index.SerialMergeScheduler.merge(SerialMergeScheduler.java:37)
	at org.apache.lucene.index.IndexWriter.maybeMerge(IndexWriter.java:1753)
	at org.apache.lucene.index.IndexWriter.maybeMerge(IndexWriter.java:1748)
	at org.apache.lucene.index.IndexWriter.maybeMerge(IndexWriter.java:1744)
	at org.apache.lucene.index.IndexWriter.flush(IndexWriter.java:2463)
	at org.apache.lucene.index.IndexWriter.addDocument(IndexWriter.java:1211)
	at org.apache.lucene.index.IndexWriter.addDocument(IndexWriter.java:1180)
	at org.apache.lucene.index.RandomIndexWriter.addDocument(RandomIndexWriter.java:101)
	at org.apache.lucene.index.codecs.preflex.TestSurrogates.testSurrogatesOrder(TestSurrogates.java:300)
	at org.apache.lucene.util.LuceneTestCase$LuceneTestCaseRunner.runChild(LuceneTestCase.java:1232)


REGRESSION:  org.apache.lucene.search.TestBooleanMinShouldMatch.testSomeReqOneProhibAndSomeOptional

Error Message:
/usr/home/hudson/hudson-slave/workspace/Lucene-trunk/checkout/lucene/build/test/1/test7870516688794667443tmp/_0_1.tii
(Too many open files in system)

Stack Trace:
java.io.FileNotFoundException: /usr/home/hudson/hudson-slave/workspace/Lucene-trunk/checkout/lucene/build/test/1/test7870516688794667443tmp/_0_1.tii
(Too many open files in system)
	at java.io.RandomAccessFile.open(Native Method)
	at java.io.RandomAccessFile.<init>(RandomAccessFile.java:233)
	at org.apache.lucene.store.FSDirectory$FSIndexOutput.<init>(FSDirectory.java:448)
	at org.apache.lucene.store.FSDirectory.createOutput(FSDirectory.java:312)
	at org.apache.lucene.store.MockDirectoryWrapper.createOutput(MockDirectoryWrapper.java:348)
	at org.apache.lucene.index.codecs.FixedGapTermsIndexWriter.<init>(FixedGapTermsIndexWriter.java:60)
	at org.apache.lucene.index.codecs.mockintblock.MockVariableIntBlockCodec.fieldsConsumer(MockVariableIntBlockCodec.java:143)
	at org.apache.lucene.index.PerFieldCodecWrapper$FieldsWriter.<init>(PerFieldCodecWrapper.java:64)
	at org.apache.lucene.index.PerFieldCodecWrapper.fieldsConsumer(PerFieldCodecWrapper.java:54)
	at org.apache.lucene.index.FreqProxTermsWriter.flush(FreqProxTermsWriter.java:78)
	at org.apache.lucene.index.TermsHash.flush(TermsHash.java:103)
	at org.apache.lucene.index.DocInverter.flush(DocInverter.java:65)
	at org.apache.lucene.index.DocFieldProcessor.flush(DocFieldProcessor.java:55)
	at org.apache.lucene.index.DocumentsWriter.flush(DocumentsWriter.java:567)
	at org.apache.lucene.index.IndexWriter.doFlush(IndexWriter.java:2497)
	at org.apache.lucene.index.IndexWriter.flush(IndexWriter.java:2462)
	at org.apache.lucene.index.IndexWriter.getReader(IndexWriter.java:359)
	at org.apache.lucene.index.RandomIndexWriter.getReader(RandomIndexWriter.java:181)
	at org.apache.lucene.index.RandomIndexWriter.getReader(RandomIndexWriter.java:153)
	at org.apache.lucene.search.TestBooleanMinShouldMatch.setUp(TestBooleanMinShouldMatch.java:67)
	at org.apache.lucene.util.LuceneTestCase$LuceneTestCaseRunner.runChild(LuceneTestCase.java:1232)
	at org.apache.lucene.util.LuceneTestCase$LuceneTestCaseRunner.runChild(LuceneTestCase.java:1160)


FAILED:  junit.framework.TestSuite.org.apache.lucene.search.TestBooleanMinShouldMatch

Error Message:
directory of test was not closed, opened from: org.apache.lucene.search.TestBooleanMinShouldMatch.setUp(TestBooleanMinShouldMatch.java:54)

Stack Trace:
junit.framework.AssertionFailedError: directory of test was not closed, opened from: org.apache.lucene.search.TestBooleanMinShouldMatch.setUp(TestBooleanMinShouldMatch.java:54)
	at org.apache.lucene.util.LuceneTestCase.afterClassLuceneTestCaseJ4(LuceneTestCase.java:391)


REGRESSION:  org.apache.lucene.search.TestComplexExplanationsOfNonMatches.testBQ18

Error Message:
directory '/usr/home/hudson/hudson-slave/workspace/Lucene-trunk/checkout/lucene/build/test/1/test7913968612263251294tmp'
exists and is a directory, but cannot be listed: list() returned null

Stack Trace:
java.io.IOException: directory '/usr/home/hudson/hudson-slave/workspace/Lucene-trunk/checkout/lucene/build/test/1/test7913968612263251294tmp'
exists and is a directory, but cannot be listed: list() returned null
	at org.apache.lucene.store.FSDirectory.listAll(FSDirectory.java:239)
	at org.apache.lucene.store.FSDirectory.listAll(FSDirectory.java:250)
	at org.apache.lucene.store.MockDirectoryWrapper.listAll(MockDirectoryWrapper.java:519)
	at org.apache.lucene.index.IndexFileDeleter.refresh(IndexFileDeleter.java:320)
	at org.apache.lucene.index.DocumentsWriter.flush(DocumentsWriter.java:644)
	at org.apache.lucene.index.IndexWriter.doFlush(IndexWriter.java:2497)
	at org.apache.lucene.index.IndexWriter.flush(IndexWriter.java:2462)
	at org.apache.lucene.index.IndexWriter.getReader(IndexWriter.java:359)
	at org.apache.lucene.index.RandomIndexWriter.getReader(RandomIndexWriter.java:181)
	at org.apache.lucene.index.RandomIndexWriter.getReader(RandomIndexWriter.java:153)
	at org.apache.lucene.search.TestExplanations.setUp(TestExplanations.java:84)
	at org.apache.lucene.search.TestComplexExplanations.setUp(TestComplexExplanations.java:36)
	at org.apache.lucene.util.LuceneTestCase$LuceneTestCaseRunner.runChild(LuceneTestCase.java:1232)
	at org.apache.lucene.util.LuceneTestCase$LuceneTestCaseRunner.runChild(LuceneTestCase.java:1160)


REGRESSION:  org.apache.lucene.search.TestComplexExplanationsOfNonMatches.testBQ22

Error Message:
java.io.IOException: Too many open files in system

Stack Trace:
java.lang.RuntimeException: java.io.IOException: Too many open files in system
	at org.apache.lucene.util.LuceneTestCase.newDirectoryImpl(LuceneTestCase.java:1072)
	at org.apache.lucene.util.LuceneTestCase.newDirectory(LuceneTestCase.java:859)
	at org.apache.lucene.util.LuceneTestCase.newDirectory(LuceneTestCase.java:851)
	at org.apache.lucene.search.TestExplanations.setUp(TestExplanations.java:73)
	at org.apache.lucene.search.TestComplexExplanations.setUp(TestComplexExplanations.java:36)
	at org.apache.lucene.util.LuceneTestCase$LuceneTestCaseRunner.runChild(LuceneTestCase.java:1232)
	at org.apache.lucene.util.LuceneTestCase$LuceneTestCaseRunner.runChild(LuceneTestCase.java:1160)
Caused by: java.io.IOException: Too many open files in system
	at java.io.UnixFileSystem.createFileExclusively(Native Method)
	at java.io.File.checkAndCreate(File.java:1716)
	at java.io.File.createTempFile(File.java:1804)
	at org.apache.lucene.util.LuceneTestCase.newDirectoryImpl(LuceneTestCase.java:1063)


REGRESSION:  org.apache.lucene.search.TestComplexExplanationsOfNonMatches.testNoop

Error Message:
java.io.IOException: Too many open files in system

Stack Trace:
java.lang.RuntimeException: java.io.IOException: Too many open files in system
	at org.apache.lucene.util.LuceneTestCase.newDirectoryImpl(LuceneTestCase.java:1072)
	at org.apache.lucene.util.LuceneTestCase.newDirectory(LuceneTestCase.java:859)
	at org.apache.lucene.util.LuceneTestCase.newDirectory(LuceneTestCase.java:851)
	at org.apache.lucene.search.TestExplanations.setUp(TestExplanations.java:73)
	at org.apache.lucene.search.TestComplexExplanations.setUp(TestComplexExplanations.java:36)
	at org.apache.lucene.util.LuceneTestCase$LuceneTestCaseRunner.runChild(LuceneTestCase.java:1232)
	at org.apache.lucene.util.LuceneTestCase$LuceneTestCaseRunner.runChild(LuceneTestCase.java:1160)
Caused by: java.io.IOException: Too many open files in system
	at java.io.UnixFileSystem.createFileExclusively(Native Method)
	at java.io.File.checkAndCreate(File.java:1716)
	at java.io.File.createTempFile(File.java:1804)
	at org.apache.lucene.util.LuceneTestCase.newDirectoryImpl(LuceneTestCase.java:1063)


FAILED:  junit.framework.TestSuite.org.apache.lucene.search.TestComplexExplanationsOfNonMatches

Error Message:
directory of test was not closed, opened from: org.apache.lucene.search.TestExplanations.setUp(TestExplanations.java:73)

Stack Trace:
junit.framework.AssertionFailedError: directory of test was not closed, opened from: org.apache.lucene.search.TestExplanations.setUp(TestExplanations.java:73)
	at org.apache.lucene.util.LuceneTestCase.afterClassLuceneTestCaseJ4(LuceneTestCase.java:391)




Build Log (for compile errors):
[...truncated 15960 lines...]



---------------------------------------------------------------------
To unsubscribe, e-mail: dev-unsubscribe@lucene.apache.org
For additional commands, e-mail: dev-help@lucene.apache.org


Mime
View raw message