lucene-dev mailing list archives

Site index · List index
Message view « Date » · « Thread »
Top « Date » · « Thread »
From Apache Hudson Server <hud...@hudson.apache.org>
Subject [HUDSON] Lucene-Solr-tests-only-trunk - Build # 7061 - Failure
Date Wed, 13 Apr 2011 09:39:32 GMT
Build: https://hudson.apache.org/hudson/job/Lucene-Solr-tests-only-trunk/7061/

14 tests failed.
REGRESSION:  org.apache.lucene.index.TestIndexReaderReopen.testThreadSafety

Error Message:
Error occurred in thread Thread-110: /usr/home/hudson/hudson-slave/workspace/Lucene-Solr-tests-only-trunk/checkout/lucene/build/test/1/test8006296579247039339tmp/_e_2.doc
(Too many open files in system)

Stack Trace:
junit.framework.AssertionFailedError: Error occurred in thread Thread-110:
/usr/home/hudson/hudson-slave/workspace/Lucene-Solr-tests-only-trunk/checkout/lucene/build/test/1/test8006296579247039339tmp/_e_2.doc
(Too many open files in system)
	at org.apache.lucene.util.LuceneTestCase$LuceneTestCaseRunner.runChild(LuceneTestCase.java:1232)
	at org.apache.lucene.util.LuceneTestCase$LuceneTestCaseRunner.runChild(LuceneTestCase.java:1160)
/usr/home/hudson/hudson-slave/workspace/Lucene-Solr-tests-only-trunk/checkout/lucene/build/test/1/test8006296579247039339tmp/_e_2.doc
(Too many open files in system)
	at org.apache.lucene.index.TestIndexReaderReopen.testThreadSafety(TestIndexReaderReopen.java:833)


REGRESSION:  org.apache.lucene.index.TestIndexWriterMergePolicy.testMergeDocCount0

Error Message:
/usr/home/hudson/hudson-slave/workspace/Lucene-Solr-tests-only-trunk/checkout/lucene/build/test/3/test8275723700845306539tmp/_0_0.tiv
(Too many open files in system)

Stack Trace:
java.io.FileNotFoundException: /usr/home/hudson/hudson-slave/workspace/Lucene-Solr-tests-only-trunk/checkout/lucene/build/test/3/test8275723700845306539tmp/_0_0.tiv
(Too many open files in system)
	at java.io.RandomAccessFile.open(Native Method)
	at java.io.RandomAccessFile.<init>(RandomAccessFile.java:233)
	at org.apache.lucene.store.FSDirectory$FSIndexOutput.<init>(FSDirectory.java:448)
	at org.apache.lucene.store.FSDirectory.createOutput(FSDirectory.java:312)
	at org.apache.lucene.store.MockDirectoryWrapper.createOutput(MockDirectoryWrapper.java:348)
	at org.apache.lucene.index.codecs.VariableGapTermsIndexWriter.<init>(VariableGapTermsIndexWriter.java:161)
	at org.apache.lucene.index.codecs.standard.StandardCodec.fieldsConsumer(StandardCodec.java:58)
	at org.apache.lucene.index.PerFieldCodecWrapper$FieldsWriter.<init>(PerFieldCodecWrapper.java:64)
	at org.apache.lucene.index.PerFieldCodecWrapper.fieldsConsumer(PerFieldCodecWrapper.java:54)
	at org.apache.lucene.index.FreqProxTermsWriter.flush(FreqProxTermsWriter.java:78)
	at org.apache.lucene.index.TermsHash.flush(TermsHash.java:103)
	at org.apache.lucene.index.DocInverter.flush(DocInverter.java:65)
	at org.apache.lucene.index.DocFieldProcessor.flush(DocFieldProcessor.java:55)
	at org.apache.lucene.index.DocumentsWriter.flush(DocumentsWriter.java:567)
	at org.apache.lucene.index.IndexWriter.doFlush(IndexWriter.java:2497)
	at org.apache.lucene.index.IndexWriter.flush(IndexWriter.java:2462)
	at org.apache.lucene.index.IndexWriter.addDocument(IndexWriter.java:1211)
	at org.apache.lucene.index.IndexWriter.addDocument(IndexWriter.java:1180)
	at org.apache.lucene.index.TestIndexWriterMergePolicy.addDoc(TestIndexWriterMergePolicy.java:221)
	at org.apache.lucene.index.TestIndexWriterMergePolicy.testMergeDocCount0(TestIndexWriterMergePolicy.java:189)
	at org.apache.lucene.util.LuceneTestCase$LuceneTestCaseRunner.runChild(LuceneTestCase.java:1232)
	at org.apache.lucene.util.LuceneTestCase$LuceneTestCaseRunner.runChild(LuceneTestCase.java:1160)


REGRESSION:  org.apache.lucene.index.TestIndexWriterOnDiskFull.testAddIndexOnDiskFull

Error Message:
addIndexes(Directory[]) + optimize() hit IOException after disk space was freed up

Stack Trace:
junit.framework.AssertionFailedError: addIndexes(Directory[]) + optimize() hit IOException
after disk space was freed up
	at org.apache.lucene.util.LuceneTestCase$LuceneTestCaseRunner.runChild(LuceneTestCase.java:1232)
	at org.apache.lucene.util.LuceneTestCase$LuceneTestCaseRunner.runChild(LuceneTestCase.java:1160)
	at org.apache.lucene.index.TestIndexWriterOnDiskFull.testAddIndexOnDiskFull(TestIndexWriterOnDiskFull.java:327)


REGRESSION:  org.apache.lucene.index.TestLongPostings.testLongPostings

Error Message:
/usr/home/hudson/hudson-slave/workspace/Lucene-Solr-tests-only-trunk/checkout/lucene/build/test/5/longpostings.6978566692871504462/_14_0.tib
(Too many open files in system)

Stack Trace:
java.io.FileNotFoundException: /usr/home/hudson/hudson-slave/workspace/Lucene-Solr-tests-only-trunk/checkout/lucene/build/test/5/longpostings.6978566692871504462/_14_0.tib
(Too many open files in system)
	at java.io.RandomAccessFile.open(Native Method)
	at java.io.RandomAccessFile.<init>(RandomAccessFile.java:233)
	at org.apache.lucene.store.FSDirectory$FSIndexOutput.<init>(FSDirectory.java:448)
	at org.apache.lucene.store.FSDirectory.createOutput(FSDirectory.java:312)
	at org.apache.lucene.store.MockDirectoryWrapper.createOutput(MockDirectoryWrapper.java:348)
	at org.apache.lucene.index.codecs.BlockTermsWriter.<init>(BlockTermsWriter.java:77)
	at org.apache.lucene.index.codecs.standard.StandardCodec.fieldsConsumer(StandardCodec.java:68)
	at org.apache.lucene.index.PerFieldCodecWrapper$FieldsWriter.<init>(PerFieldCodecWrapper.java:64)
	at org.apache.lucene.index.PerFieldCodecWrapper.fieldsConsumer(PerFieldCodecWrapper.java:54)
	at org.apache.lucene.index.FreqProxTermsWriter.flush(FreqProxTermsWriter.java:78)
	at org.apache.lucene.index.TermsHash.flush(TermsHash.java:103)
	at org.apache.lucene.index.DocInverter.flush(DocInverter.java:65)
	at org.apache.lucene.index.DocFieldProcessor.flush(DocFieldProcessor.java:55)
	at org.apache.lucene.index.DocumentsWriter.flush(DocumentsWriter.java:567)
	at org.apache.lucene.index.IndexWriter.doFlush(IndexWriter.java:2497)
	at org.apache.lucene.index.IndexWriter.flush(IndexWriter.java:2462)
	at org.apache.lucene.index.IndexWriter.prepareCommit(IndexWriter.java:2332)
	at org.apache.lucene.index.IndexWriter.commitInternal(IndexWriter.java:2405)
	at org.apache.lucene.index.IndexWriter.commit(IndexWriter.java:2387)
	at org.apache.lucene.index.IndexWriter.commit(IndexWriter.java:2371)
	at org.apache.lucene.index.RandomIndexWriter.maybeCommit(RandomIndexWriter.java:110)
	at org.apache.lucene.index.RandomIndexWriter.addDocument(RandomIndexWriter.java:102)
	at org.apache.lucene.index.TestLongPostings.testLongPostings(TestLongPostings.java:117)
	at org.apache.lucene.util.LuceneTestCase$LuceneTestCaseRunner.runChild(LuceneTestCase.java:1232)
	at org.apache.lucene.util.LuceneTestCase$LuceneTestCaseRunner.runChild(LuceneTestCase.java:1160)


REGRESSION:  org.apache.lucene.index.TestNRTThreads.testNRTThreads

Error Message:
org/apache/lucene/util/LuceneTestCase$TwoLongs

Stack Trace:
java.lang.NoClassDefFoundError: org/apache/lucene/util/LuceneTestCase$TwoLongs
	at org.apache.lucene.util.LuceneTestCase.reportAdditionalFailureInfo(LuceneTestCase.java:1125)
	at org.apache.lucene.util.LuceneTestCase$1.failed(LuceneTestCase.java:441)
	at org.apache.lucene.util.LuceneTestCase$LuceneTestCaseRunner.runChild(LuceneTestCase.java:1232)
	at org.apache.lucene.util.LuceneTestCase$LuceneTestCaseRunner.runChild(LuceneTestCase.java:1160)
Caused by: java.lang.ClassNotFoundException: org.apache.lucene.util.LuceneTestCase$TwoLongs
	at java.net.URLClassLoader$1.run(URLClassLoader.java:214)
	at java.security.AccessController.doPrivileged(Native Method)
	at java.net.URLClassLoader.findClass(URLClassLoader.java:205)
	at java.lang.ClassLoader.loadClass(ClassLoader.java:321)
	at sun.misc.Launcher$AppClassLoader.loadClass(Launcher.java:294)
	at java.lang.ClassLoader.loadClass(ClassLoader.java:266)
Caused by: java.io.FileNotFoundException: /usr/home/hudson/hudson-slave/workspace/Lucene-Solr-tests-only-trunk/checkout/lucene/build/classes/test-framework/org/apache/lucene/util/LuceneTestCase$TwoLongs.class
(Too many open files in system)
	at java.io.FileInputStream.open(Native Method)
	at java.io.FileInputStream.<init>(FileInputStream.java:137)
	at sun.misc.URLClassPath$FileLoader$1.getInputStream(URLClassPath.java:1005)
	at sun.misc.Resource.cachedInputStream(Resource.java:77)
	at sun.misc.Resource.getByteBuffer(Resource.java:160)
	at java.net.URLClassLoader.defineClass(URLClassLoader.java:266)
	at java.net.URLClassLoader.access$000(URLClassLoader.java:73)
	at java.net.URLClassLoader$1.run(URLClassLoader.java:212)


REGRESSION:  org.apache.lucene.index.TestOmitTf.testMixedMerge

Error Message:
CheckIndex failed

Stack Trace:
java.lang.RuntimeException: CheckIndex failed
	at org.apache.lucene.util._TestUtil.checkIndex(_TestUtil.java:152)
	at org.apache.lucene.util._TestUtil.checkIndex(_TestUtil.java:138)
	at org.apache.lucene.index.TestOmitTf.testMixedMerge(TestOmitTf.java:155)
	at org.apache.lucene.util.LuceneTestCase$LuceneTestCaseRunner.runChild(LuceneTestCase.java:1232)
	at org.apache.lucene.util.LuceneTestCase$LuceneTestCaseRunner.runChild(LuceneTestCase.java:1160)


REGRESSION:  org.apache.lucene.index.TestParallelReaderEmptyIndex.testEmptyIndex

Error Message:
/usr/home/hudson/hudson-slave/workspace/Lucene-Solr-tests-only-trunk/checkout/lucene/build/test/2/test5751919599923835792tmp/_0.fdx
(Too many open files in system)

Stack Trace:
java.io.FileNotFoundException: /usr/home/hudson/hudson-slave/workspace/Lucene-Solr-tests-only-trunk/checkout/lucene/build/test/2/test5751919599923835792tmp/_0.fdx
(Too many open files in system)
	at java.io.RandomAccessFile.open(Native Method)
	at java.io.RandomAccessFile.<init>(RandomAccessFile.java:233)
	at org.apache.lucene.store.FSDirectory$FSIndexOutput.<init>(FSDirectory.java:448)
	at org.apache.lucene.store.FSDirectory.createOutput(FSDirectory.java:312)
	at org.apache.lucene.store.MockDirectoryWrapper.createOutput(MockDirectoryWrapper.java:348)
	at org.apache.lucene.index.FieldsWriter.<init>(FieldsWriter.java:58)
	at org.apache.lucene.index.SegmentMerger.mergeFields(SegmentMerger.java:231)
	at org.apache.lucene.index.SegmentMerger.merge(SegmentMerger.java:119)
	at org.apache.lucene.index.IndexWriter.addIndexes(IndexWriter.java:2232)
	at org.apache.lucene.index.TestParallelReaderEmptyIndex.testEmptyIndex(TestParallelReaderEmptyIndex.java:61)
	at org.apache.lucene.util.LuceneTestCase$LuceneTestCaseRunner.runChild(LuceneTestCase.java:1232)
	at org.apache.lucene.util.LuceneTestCase$LuceneTestCaseRunner.runChild(LuceneTestCase.java:1160)


REGRESSION:  org.apache.lucene.index.TestParallelReaderEmptyIndex.testEmptyIndexWithVectors

Error Message:
directory '/usr/home/hudson/hudson-slave/workspace/Lucene-Solr-tests-only-trunk/checkout/lucene/build/test/2/test1428808919186143044tmp'
exists and is a directory, but cannot be listed: list() returned null

Stack Trace:
java.io.IOException: directory '/usr/home/hudson/hudson-slave/workspace/Lucene-Solr-tests-only-trunk/checkout/lucene/build/test/2/test1428808919186143044tmp'
exists and is a directory, but cannot be listed: list() returned null
	at org.apache.lucene.store.FSDirectory.listAll(FSDirectory.java:239)
	at org.apache.lucene.store.FSDirectory.listAll(FSDirectory.java:250)
	at org.apache.lucene.store.MockDirectoryWrapper.listAll(MockDirectoryWrapper.java:519)
	at org.apache.lucene.index.IndexFileDeleter.refresh(IndexFileDeleter.java:320)
	at org.apache.lucene.index.IndexWriter.merge(IndexWriter.java:2848)
	at org.apache.lucene.index.SerialMergeScheduler.merge(SerialMergeScheduler.java:37)
	at org.apache.lucene.index.IndexWriter.maybeMerge(IndexWriter.java:1753)
	at org.apache.lucene.index.IndexWriter.optimize(IndexWriter.java:1563)
	at org.apache.lucene.index.IndexWriter.optimize(IndexWriter.java:1519)
	at org.apache.lucene.index.IndexWriter.optimize(IndexWriter.java:1489)
	at org.apache.lucene.index.TestParallelReaderEmptyIndex.testEmptyIndexWithVectors(TestParallelReaderEmptyIndex.java:94)
	at org.apache.lucene.util.LuceneTestCase$LuceneTestCaseRunner.runChild(LuceneTestCase.java:1232)
	at org.apache.lucene.util.LuceneTestCase$LuceneTestCaseRunner.runChild(LuceneTestCase.java:1160)


REGRESSION:  org.apache.lucene.index.TestPerFieldCodecSupport.testStressPerFieldCodec

Error Message:
Some threads threw uncaught exceptions!

Stack Trace:
junit.framework.AssertionFailedError: Some threads threw uncaught exceptions!
	at org.apache.lucene.util.LuceneTestCase$LuceneTestCaseRunner.runChild(LuceneTestCase.java:1232)
	at org.apache.lucene.util.LuceneTestCase$LuceneTestCaseRunner.runChild(LuceneTestCase.java:1160)
	at org.apache.lucene.util.LuceneTestCase.tearDown(LuceneTestCase.java:521)


FAILED:  <init>.org.apache.lucene.index.TestStressAdvance

Error Message:
org.apache.lucene.index.TestStressAdvance

Stack Trace:
java.lang.ClassNotFoundException: org.apache.lucene.index.TestStressAdvance
	at java.net.URLClassLoader$1.run(URLClassLoader.java:214)
	at java.security.AccessController.doPrivileged(Native Method)
	at java.net.URLClassLoader.findClass(URLClassLoader.java:205)
	at java.lang.ClassLoader.loadClass(ClassLoader.java:321)
	at sun.misc.Launcher$AppClassLoader.loadClass(Launcher.java:294)
	at java.lang.ClassLoader.loadClass(ClassLoader.java:266)
	at java.lang.Class.forName0(Native Method)
	at java.lang.Class.forName(Class.java:186)
Caused by: java.io.FileNotFoundException: /usr/home/hudson/hudson-slave/workspace/Lucene-Solr-tests-only-trunk/checkout/lucene/build/classes/test/org/apache/lucene/index/TestStressAdvance.class
(Too many open files in system)
	at java.io.FileInputStream.open(Native Method)
	at java.io.FileInputStream.<init>(FileInputStream.java:137)
	at sun.misc.URLClassPath$FileLoader$1.getInputStream(URLClassPath.java:1005)
	at sun.misc.Resource.cachedInputStream(Resource.java:77)
	at sun.misc.Resource.getByteBuffer(Resource.java:160)
	at java.net.URLClassLoader.defineClass(URLClassLoader.java:266)
	at java.net.URLClassLoader.access$000(URLClassLoader.java:73)
	at java.net.URLClassLoader$1.run(URLClassLoader.java:212)


REGRESSION:  org.apache.lucene.search.TestComplexExplanationsOfNonMatches.testFQ5

Error Message:
/usr/home/hudson/hudson-slave/workspace/Lucene-Solr-tests-only-trunk/checkout/lucene/build/test/4/test1448441242209746514tmp/_0.tvd
(Too many open files in system)

Stack Trace:
java.io.FileNotFoundException: /usr/home/hudson/hudson-slave/workspace/Lucene-Solr-tests-only-trunk/checkout/lucene/build/test/4/test1448441242209746514tmp/_0.tvd
(Too many open files in system)
	at java.io.RandomAccessFile.open(Native Method)
	at java.io.RandomAccessFile.<init>(RandomAccessFile.java:233)
	at org.apache.lucene.store.FSDirectory$FSIndexOutput.<init>(FSDirectory.java:448)
	at org.apache.lucene.store.FSDirectory.createOutput(FSDirectory.java:312)
	at org.apache.lucene.store.MockDirectoryWrapper.createOutput(MockDirectoryWrapper.java:348)
	at org.apache.lucene.index.TermVectorsTermsWriter.initTermVectorsWriter(TermVectorsTermsWriter.java:124)
	at org.apache.lucene.index.TermVectorsTermsWriter.finishDocument(TermVectorsTermsWriter.java:139)
	at org.apache.lucene.index.TermVectorsTermsWriter$PerDoc.finish(TermVectorsTermsWriter.java:240)
	at org.apache.lucene.index.DocFieldProcessorPerThread$PerDoc.finish(DocFieldProcessorPerThread.java:287)
	at org.apache.lucene.index.DocumentsWriter$WaitQueue.writeDocument(DocumentsWriter.java:1123)
	at org.apache.lucene.index.DocumentsWriter$WaitQueue.add(DocumentsWriter.java:1143)
	at org.apache.lucene.index.DocumentsWriter.finishDocument(DocumentsWriter.java:869)
	at org.apache.lucene.index.DocumentsWriter.updateDocument(DocumentsWriter.java:758)
	at org.apache.lucene.index.IndexWriter.addDocument(IndexWriter.java:1204)
	at org.apache.lucene.index.IndexWriter.addDocument(IndexWriter.java:1180)
	at org.apache.lucene.index.RandomIndexWriter.addDocument(RandomIndexWriter.java:101)
	at org.apache.lucene.search.TestExplanations.setUp(TestExplanations.java:82)
	at org.apache.lucene.search.TestComplexExplanations.setUp(TestComplexExplanations.java:36)
	at org.apache.lucene.util.LuceneTestCase$LuceneTestCaseRunner.runChild(LuceneTestCase.java:1232)
	at org.apache.lucene.util.LuceneTestCase$LuceneTestCaseRunner.runChild(LuceneTestCase.java:1160)


FAILED:  junit.framework.TestSuite.org.apache.lucene.search.TestComplexExplanationsOfNonMatches

Error Message:
directory of test was not closed, opened from: org.apache.lucene.search.TestExplanations.setUp(TestExplanations.java:73)

Stack Trace:
junit.framework.AssertionFailedError: directory of test was not closed, opened from: org.apache.lucene.search.TestExplanations.setUp(TestExplanations.java:73)
	at org.apache.lucene.util.LuceneTestCase.afterClassLuceneTestCaseJ4(LuceneTestCase.java:391)


REGRESSION:  org.apache.lucene.search.TestPrefixInBooleanQuery.testPrefixBooleanQuery

Error Message:
/usr/home/hudson/hudson-slave/workspace/Lucene-Solr-tests-only-trunk/checkout/lucene/build/test/5/test3382176081682253129tmp/_75.tvd
(Too many open files in system)

Stack Trace:
java.io.FileNotFoundException: /usr/home/hudson/hudson-slave/workspace/Lucene-Solr-tests-only-trunk/checkout/lucene/build/test/5/test3382176081682253129tmp/_75.tvd
(Too many open files in system)
	at java.io.RandomAccessFile.open(Native Method)
	at java.io.RandomAccessFile.<init>(RandomAccessFile.java:233)
	at org.apache.lucene.store.SimpleFSDirectory$SimpleFSIndexInput$Descriptor.<init>(SimpleFSDirectory.java:69)
	at org.apache.lucene.store.SimpleFSDirectory$SimpleFSIndexInput.<init>(SimpleFSDirectory.java:90)
	at org.apache.lucene.store.NIOFSDirectory$NIOFSIndexInput.<init>(NIOFSDirectory.java:91)
	at org.apache.lucene.store.NIOFSDirectory.openInput(NIOFSDirectory.java:78)
	at org.apache.lucene.store.FSDirectory.openInput(FSDirectory.java:345)
	at org.apache.lucene.store.MockDirectoryWrapper.openInput(MockDirectoryWrapper.java:374)
	at org.apache.lucene.store.Directory.openInput(Directory.java:122)
	at org.apache.lucene.index.TermVectorsReader.<init>(TermVectorsReader.java:83)
	at org.apache.lucene.index.SegmentReader$CoreReaders.openDocStores(SegmentReader.java:236)
	at org.apache.lucene.index.SegmentReader.get(SegmentReader.java:495)
	at org.apache.lucene.index.SegmentReader.get(SegmentReader.java:470)
	at org.apache.lucene.index.DirectoryReader.<init>(DirectoryReader.java:123)
	at org.apache.lucene.index.DirectoryReader$1.doBody(DirectoryReader.java:89)
	at org.apache.lucene.index.SegmentInfos$FindSegmentsFile.run(SegmentInfos.java:685)
	at org.apache.lucene.index.DirectoryReader.open(DirectoryReader.java:84)
	at org.apache.lucene.index.IndexReader.open(IndexReader.java:500)
	at org.apache.lucene.index.IndexReader.open(IndexReader.java:459)
	at org.apache.lucene.index.RandomIndexWriter.getReader(RandomIndexWriter.java:187)
	at org.apache.lucene.index.RandomIndexWriter.getReader(RandomIndexWriter.java:153)
	at org.apache.lucene.search.TestPrefixInBooleanQuery.setUp(TestPrefixInBooleanQuery.java:77)
	at org.apache.lucene.util.LuceneTestCase$LuceneTestCaseRunner.runChild(LuceneTestCase.java:1232)
	at org.apache.lucene.util.LuceneTestCase$LuceneTestCaseRunner.runChild(LuceneTestCase.java:1160)


FAILED:  junit.framework.TestSuite.org.apache.lucene.search.TestPrefixInBooleanQuery

Error Message:
directory of test was not closed, opened from: org.apache.lucene.search.TestPrefixInBooleanQuery.setUp(TestPrefixInBooleanQuery.java:48)

Stack Trace:
junit.framework.AssertionFailedError: directory of test was not closed, opened from: org.apache.lucene.search.TestPrefixInBooleanQuery.setUp(TestPrefixInBooleanQuery.java:48)
	at org.apache.lucene.util.LuceneTestCase.afterClassLuceneTestCaseJ4(LuceneTestCase.java:391)




Build Log (for compile errors):
[...truncated 3868 lines...]



---------------------------------------------------------------------
To unsubscribe, e-mail: dev-unsubscribe@lucene.apache.org
For additional commands, e-mail: dev-help@lucene.apache.org


Mime
View raw message