lucene-dev mailing list archives

Site index · List index
Message view « Date » · « Thread »
Top « Date » · « Thread »
From Apache Hudson Server <hud...@hudson.apache.org>
Subject [HUDSON] Lucene-Solr-tests-only-3.x - Build # 5767 - Failure
Date Thu, 10 Mar 2011 20:34:19 GMT
Build: https://hudson.apache.org/hudson/job/Lucene-Solr-tests-only-3.x/5767/

10 tests failed.
FAILED:  <init>.org.apache.lucene.search.TestSimilarity

Error Message:
org.apache.lucene.search.TestSimilarity

Stack Trace:
java.lang.ClassNotFoundException: org.apache.lucene.search.TestSimilarity
	at java.net.URLClassLoader$1.run(URLClassLoader.java:217)
	at java.security.AccessController.doPrivileged(Native Method)
	at java.net.URLClassLoader.findClass(URLClassLoader.java:205)
	at java.lang.ClassLoader.loadClass(ClassLoader.java:321)
	at sun.misc.Launcher$AppClassLoader.loadClass(Launcher.java:294)
	at java.lang.ClassLoader.loadClass(ClassLoader.java:266)
	at java.lang.Class.forName0(Native Method)
	at java.lang.Class.forName(Class.java:186)


FAILED:  <init>.org.apache.lucene.search.TestSloppyPhraseQuery

Error Message:
org.apache.lucene.search.TestSloppyPhraseQuery

Stack Trace:
java.lang.ClassNotFoundException: org.apache.lucene.search.TestSloppyPhraseQuery
	at java.net.URLClassLoader$1.run(URLClassLoader.java:217)
	at java.security.AccessController.doPrivileged(Native Method)
	at java.net.URLClassLoader.findClass(URLClassLoader.java:205)
	at java.lang.ClassLoader.loadClass(ClassLoader.java:321)
	at sun.misc.Launcher$AppClassLoader.loadClass(Launcher.java:294)
	at java.lang.ClassLoader.loadClass(ClassLoader.java:266)
	at java.lang.Class.forName0(Native Method)
	at java.lang.Class.forName(Class.java:186)


FAILED:  <init>.org.apache.lucene.search.TestTopDocsCollector

Error Message:
org.apache.lucene.search.TestTopDocsCollector

Stack Trace:
java.lang.ClassNotFoundException: org.apache.lucene.search.TestTopDocsCollector
	at java.net.URLClassLoader$1.run(URLClassLoader.java:217)
	at java.security.AccessController.doPrivileged(Native Method)
	at java.net.URLClassLoader.findClass(URLClassLoader.java:205)
	at java.lang.ClassLoader.loadClass(ClassLoader.java:321)
	at sun.misc.Launcher$AppClassLoader.loadClass(Launcher.java:294)
	at java.lang.ClassLoader.loadClass(ClassLoader.java:266)
	at java.lang.Class.forName0(Native Method)
	at java.lang.Class.forName(Class.java:186)


FAILED:  <init>.org.apache.lucene.search.function.TestCustomScoreQuery

Error Message:
org.apache.lucene.search.function.TestCustomScoreQuery

Stack Trace:
java.lang.ClassNotFoundException: org.apache.lucene.search.function.TestCustomScoreQuery
	at java.net.URLClassLoader$1.run(URLClassLoader.java:217)
	at java.security.AccessController.doPrivileged(Native Method)
	at java.net.URLClassLoader.findClass(URLClassLoader.java:205)
	at java.lang.ClassLoader.loadClass(ClassLoader.java:321)
	at sun.misc.Launcher$AppClassLoader.loadClass(Launcher.java:294)
	at java.lang.ClassLoader.loadClass(ClassLoader.java:266)
	at java.lang.Class.forName0(Native Method)
	at java.lang.Class.forName(Class.java:186)


FAILED:  <init>.org.apache.lucene.search.payloads.TestPayloadNearQuery

Error Message:
org.apache.lucene.search.payloads.TestPayloadNearQuery

Stack Trace:
java.lang.ClassNotFoundException: org.apache.lucene.search.payloads.TestPayloadNearQuery
	at java.net.URLClassLoader$1.run(URLClassLoader.java:217)
	at java.security.AccessController.doPrivileged(Native Method)
	at java.net.URLClassLoader.findClass(URLClassLoader.java:205)
	at java.lang.ClassLoader.loadClass(ClassLoader.java:321)
	at sun.misc.Launcher$AppClassLoader.loadClass(Launcher.java:294)
	at java.lang.ClassLoader.loadClass(ClassLoader.java:266)
	at java.lang.Class.forName0(Native Method)
	at java.lang.Class.forName(Class.java:186)


FAILED:  <init>.org.apache.lucene.search.spans.TestSpansAdvanced2

Error Message:
org.apache.lucene.search.spans.TestSpansAdvanced2

Stack Trace:
java.lang.ClassNotFoundException: org.apache.lucene.search.spans.TestSpansAdvanced2
	at java.net.URLClassLoader$1.run(URLClassLoader.java:217)
	at java.security.AccessController.doPrivileged(Native Method)
	at java.net.URLClassLoader.findClass(URLClassLoader.java:205)
	at java.lang.ClassLoader.loadClass(ClassLoader.java:321)
	at sun.misc.Launcher$AppClassLoader.loadClass(Launcher.java:294)
	at java.lang.ClassLoader.loadClass(ClassLoader.java:266)
	at java.lang.Class.forName0(Native Method)
	at java.lang.Class.forName(Class.java:186)


FAILED:  <init>.org.apache.lucene.store.TestWindowsMMap

Error Message:
org.apache.lucene.store.TestWindowsMMap

Stack Trace:
java.lang.ClassNotFoundException: org.apache.lucene.store.TestWindowsMMap
	at java.net.URLClassLoader$1.run(URLClassLoader.java:217)
	at java.security.AccessController.doPrivileged(Native Method)
	at java.net.URLClassLoader.findClass(URLClassLoader.java:205)
	at java.lang.ClassLoader.loadClass(ClassLoader.java:321)
	at sun.misc.Launcher$AppClassLoader.loadClass(Launcher.java:294)
	at java.lang.ClassLoader.loadClass(ClassLoader.java:266)
	at java.lang.Class.forName0(Native Method)
	at java.lang.Class.forName(Class.java:186)


FAILED:  <init>.org.apache.lucene.util.TestBitVector

Error Message:
org.apache.lucene.util.TestBitVector

Stack Trace:
java.lang.ClassNotFoundException: org.apache.lucene.util.TestBitVector
	at java.net.URLClassLoader$1.run(URLClassLoader.java:217)
	at java.security.AccessController.doPrivileged(Native Method)
	at java.net.URLClassLoader.findClass(URLClassLoader.java:205)
	at java.lang.ClassLoader.loadClass(ClassLoader.java:321)
	at sun.misc.Launcher$AppClassLoader.loadClass(Launcher.java:294)
	at java.lang.ClassLoader.loadClass(ClassLoader.java:266)
	at java.lang.Class.forName0(Native Method)
	at java.lang.Class.forName(Class.java:186)


FAILED:  <init>.org.apache.lucene.util.TestRamUsageEstimator

Error Message:
org.apache.lucene.util.TestRamUsageEstimator

Stack Trace:
java.lang.ClassNotFoundException: org.apache.lucene.util.TestRamUsageEstimator
	at java.net.URLClassLoader$1.run(URLClassLoader.java:217)
	at java.security.AccessController.doPrivileged(Native Method)
	at java.net.URLClassLoader.findClass(URLClassLoader.java:205)
	at java.lang.ClassLoader.loadClass(ClassLoader.java:321)
	at sun.misc.Launcher$AppClassLoader.loadClass(Launcher.java:294)
	at java.lang.ClassLoader.loadClass(ClassLoader.java:266)
	at java.lang.Class.forName0(Native Method)
	at java.lang.Class.forName(Class.java:186)


FAILED:  <init>.org.apache.lucene.util.TestStringIntern

Error Message:
org.apache.lucene.util.TestStringIntern

Stack Trace:
java.lang.ClassNotFoundException: org.apache.lucene.util.TestStringIntern
	at java.net.URLClassLoader$1.run(URLClassLoader.java:217)
	at java.security.AccessController.doPrivileged(Native Method)
	at java.net.URLClassLoader.findClass(URLClassLoader.java:205)
	at java.lang.ClassLoader.loadClass(ClassLoader.java:321)
	at sun.misc.Launcher$AppClassLoader.loadClass(Launcher.java:294)
	at java.lang.ClassLoader.loadClass(ClassLoader.java:266)
	at java.lang.Class.forName0(Native Method)
	at java.lang.Class.forName(Class.java:186)




Build Log (for compile errors):
[...truncated 47 lines...]



---------------------------------------------------------------------
To unsubscribe, e-mail: dev-unsubscribe@lucene.apache.org
For additional commands, e-mail: dev-help@lucene.apache.org


Mime
View raw message