lucene-dev mailing list archives

Site index · List index
Message view « Date » · « Thread »
Top « Date » · « Thread »
From Steven A Rowe <sar...@syr.edu>
Subject RE: [HUDSON] Lucene-Solr-tests-only-3.x - Build # 5964 - Failure
Date Tue, 15 Mar 2011 22:05:14 GMT
The build never made it past the initial pre-build "ant clean":

---------------
clean:
   [delete] Deleting directory /usr/home/hudson/hudson-slave/workspace/Lucene-Solr-tests-only-3.x/checkout/lucene/build

BUILD FAILED
/usr/home/hudson/hudson-slave/workspace/Lucene-Solr-tests-only-3.x/checkout/build.xml:114:
The following error occurred while executing this line:
/usr/home/hudson/hudson-slave/workspace/Lucene-Solr-tests-only-3.x/checkout/lucene/common-build.xml:191:
Unable to delete file /usr/home/hudson/hudson-slave/workspace/Lucene-Solr-tests-only-3.x/checkout/lucene/build/backwards/test/6/index.TestLockFactory6.-6904310916879757798/_2b.fdx
 
---------------


> -----Original Message-----
> From: Apache Hudson Server [mailto:hudson@hudson.apache.org]
> Sent: Tuesday, March 15, 2011 5:56 PM
> To: dev@lucene.apache.org
> Subject: [HUDSON] Lucene-Solr-tests-only-3.x - Build # 5964 - Failure
> 
> Build: https://hudson.apache.org/hudson/job/Lucene-Solr-tests-only-
> 3.x/5964/
> 
> 6 tests failed.
> FAILED:  TEST-org.apache.lucene.index.TestIndexWriter.xml.<init>
> 
> Error Message:
> 
> 
> Stack Trace:
> Test report file /home/hudson/hudson-slave/workspace/Lucene-Solr-tests-
> only-3.x/checkout/lucene/build/backwards/test/TEST-
> org.apache.lucene.index.TestIndexWriter.xml was length 0
> 
> FAILED:  TEST-org.apache.lucene.search.TestBoolean2.xml.<init>
> 
> Error Message:
> 
> 
> Stack Trace:
> Test report file /home/hudson/hudson-slave/workspace/Lucene-Solr-tests-
> only-3.x/checkout/lucene/build/backwards/test/TEST-
> org.apache.lucene.search.TestBoolean2.xml was length 0
> 
> REGRESSION:  org.apache.lucene.store.TestLockFactory.testStressLocks
> 
> Error Message:
> IndexWriter hit unexpected exceptions
> 
> Stack Trace:
> junit.framework.AssertionFailedError: IndexWriter hit unexpected
> exceptions
> 	at
> org.apache.lucene.store.TestLockFactory._testStressLocks(TestLockFactory.j
> ava:172)
> 	at
> org.apache.lucene.store.TestLockFactory.testStressLocks(TestLockFactory.ja
> va:142)
> 	at
> org.apache.lucene.util.LuceneTestCase.runBare(LuceneTestCase.java:255)
> 
> 
> FAILED:  <init>.org.apache.lucene.store.TestRAMDirectory
> 
> Error Message:
> org.apache.lucene.store.TestRAMDirectory
> 
> Stack Trace:
> java.lang.ClassNotFoundException: org.apache.lucene.store.TestRAMDirectory
> 	at java.net.URLClassLoader$1.run(URLClassLoader.java:217)
> 	at java.security.AccessController.doPrivileged(Native Method)
> 	at java.net.URLClassLoader.findClass(URLClassLoader.java:205)
> 	at java.lang.ClassLoader.loadClass(ClassLoader.java:321)
> 	at sun.misc.Launcher$AppClassLoader.loadClass(Launcher.java:294)
> 	at java.lang.ClassLoader.loadClass(ClassLoader.java:266)
> 	at java.lang.Class.forName0(Native Method)
> 	at java.lang.Class.forName(Class.java:186)
> 
> 
> FAILED:  <init>.org.apache.lucene.util.TestNumericUtils
> 
> Error Message:
> org.apache.lucene.util.TestNumericUtils
> 
> Stack Trace:
> java.lang.ClassNotFoundException: org.apache.lucene.util.TestNumericUtils
> 	at java.net.URLClassLoader$1.run(URLClassLoader.java:217)
> 	at java.security.AccessController.doPrivileged(Native Method)
> 	at java.net.URLClassLoader.findClass(URLClassLoader.java:205)
> 	at java.lang.ClassLoader.loadClass(ClassLoader.java:321)
> 	at sun.misc.Launcher$AppClassLoader.loadClass(Launcher.java:294)
> 	at java.lang.ClassLoader.loadClass(ClassLoader.java:266)
> 	at java.lang.Class.forName0(Native Method)
> 	at java.lang.Class.forName(Class.java:186)
> 
> 
> FAILED:  <init>.org.apache.lucene.util.TestSmallFloat
> 
> Error Message:
> org.apache.lucene.util.TestSmallFloat
> 
> Stack Trace:
> java.lang.ClassNotFoundException: org.apache.lucene.util.TestSmallFloat
> 	at java.net.URLClassLoader$1.run(URLClassLoader.java:217)
> 	at java.security.AccessController.doPrivileged(Native Method)
> 	at java.net.URLClassLoader.findClass(URLClassLoader.java:205)
> 	at java.lang.ClassLoader.loadClass(ClassLoader.java:321)
> 	at sun.misc.Launcher$AppClassLoader.loadClass(Launcher.java:294)
> 	at java.lang.ClassLoader.loadClass(ClassLoader.java:266)
> 	at java.lang.Class.forName0(Native Method)
> 	at java.lang.Class.forName(Class.java:186)
> 
> 
> 
> 
> Build Log (for compile errors):
> [...truncated 47 lines...]
> 
> 
> 
> ---------------------------------------------------------------------
> To unsubscribe, e-mail: dev-unsubscribe@lucene.apache.org
> For additional commands, e-mail: dev-help@lucene.apache.org

Mime
View raw message