lucene-dev mailing list archives

Site index · List index
Message view « Date » · « Thread »
Top « Date » · « Thread »
From Apache Hudson Server <hud...@hudson.apache.org>
Subject [HUDSON] Lucene-Solr-tests-only-3.x - Build # 5715 - Failure
Date Wed, 09 Mar 2011 08:31:54 GMT
Build: https://hudson.apache.org/hudson/job/Lucene-Solr-tests-only-3.x/5715/

17 tests failed.
REGRESSION:  org.apache.lucene.queryParser.TestQueryParser.testFarsiRangeCollating

Error Message:
null

Stack Trace:
java.lang.InternalError
	at sun.misc.URLClassPath$JarLoader.getResource(URLClassPath.java:769)
	at sun.misc.URLClassPath.getResource(URLClassPath.java:185)
	at java.net.URLClassLoader$1.run(URLClassLoader.java:209)
	at java.security.AccessController.doPrivileged(Native Method)
	at java.net.URLClassLoader.findClass(URLClassLoader.java:205)
	at java.lang.ClassLoader.loadClass(ClassLoader.java:321)
	at java.lang.ClassLoader.loadClass(ClassLoader.java:314)
	at sun.misc.Launcher$AppClassLoader.loadClass(Launcher.java:294)
	at java.lang.ClassLoader.loadClass(ClassLoader.java:266)
	at java.util.ResourceBundle$RBClassLoader.loadClass(ResourceBundle.java:463)
	at java.util.ResourceBundle$Control.newBundle(ResourceBundle.java:2401)
	at java.util.ResourceBundle.loadBundle(ResourceBundle.java:1424)
	at java.util.ResourceBundle.findBundle(ResourceBundle.java:1383)
	at java.util.ResourceBundle.getBundleImpl(ResourceBundle.java:1252)
	at java.util.ResourceBundle.getBundle(ResourceBundle.java:850)
	at sun.util.resources.LocaleData$1.run(LocaleData.java:142)
	at java.security.AccessController.doPrivileged(Native Method)
	at sun.util.resources.LocaleData.getBundle(LocaleData.java:140)
	at sun.util.resources.LocaleData.getCollationData(LocaleData.java:120)
	at java.text.Collator.getInstance(Collator.java:260)
	at org.apache.lucene.queryParser.TestQueryParser.testFarsiRangeCollating(TestQueryParser.java:489)
	at org.apache.lucene.util.LuceneTestCase.runBare(LuceneTestCase.java:255)
	at org.apache.lucene.util.LocalizedTestCase.runBare(LocalizedTestCase.java:85)
Caused by: java.io.FileNotFoundException: /usr/local/openjdk6/jre/lib/ext/localedata.jar
	at sun.misc.URLClassPath$JarLoader.getJarFile(URLClassPath.java:658)
	at sun.misc.URLClassPath$JarLoader.access$600(URLClassPath.java:555)
	at sun.misc.URLClassPath$JarLoader$1.run(URLClassPath.java:622)
	at java.security.AccessController.doPrivileged(Native Method)
	at sun.misc.URLClassPath$JarLoader.ensureOpen(URLClassPath.java:614)
	at sun.misc.URLClassPath$JarLoader.getResource(URLClassPath.java:767)


REGRESSION:  org.apache.lucene.search.TestMultiTermConstantScore.testBasicsRngCollating

Error Message:
null

Stack Trace:
java.lang.InternalError
	at sun.misc.URLClassPath$JarLoader.getResource(URLClassPath.java:769)
	at sun.misc.URLClassPath.getResource(URLClassPath.java:185)
	at sun.misc.URLClassPath.getResource(URLClassPath.java:237)
	at java.lang.ClassLoader.getBootstrapResource(ClassLoader.java:1113)
	at java.lang.ClassLoader.getResource(ClassLoader.java:974)
	at java.lang.ClassLoader.getResource(ClassLoader.java:972)
	at java.lang.ClassLoader.getSystemResource(ClassLoader.java:1075)
	at java.lang.ClassLoader.getSystemResourceAsStream(ClassLoader.java:1181)
	at java.lang.Class.getResourceAsStream(Class.java:2045)
	at sun.text.normalizer.ICUData.getStream(ICUData.java:61)
	at sun.text.normalizer.ICUData.getRequiredStream(ICUData.java:81)
	at sun.text.normalizer.NormalizerImpl.<init>(NormalizerImpl.java:260)
	at sun.text.normalizer.NormalizerImpl.<clinit>(NormalizerImpl.java:57)
	at java.text.RBTableBuilder.build(RBTableBuilder.java:107)
	at java.text.RBCollationTables.<init>(RBCollationTables.java:83)
	at java.text.RuleBasedCollator.<init>(RuleBasedCollator.java:293)
	at java.text.Collator.getInstance(Collator.java:268)
	at org.apache.lucene.search.TestMultiTermConstantScore.testBasicsRngCollating(TestMultiTermConstantScore.java:140)
	at org.apache.lucene.util.LuceneTestCase.runBare(LuceneTestCase.java:255)
Caused by: java.io.FileNotFoundException: /usr/local/openjdk6/jre/lib/resources.jar
	at sun.misc.URLClassPath$JarLoader.getJarFile(URLClassPath.java:658)
	at sun.misc.URLClassPath$JarLoader.access$600(URLClassPath.java:555)
	at sun.misc.URLClassPath$JarLoader$1.run(URLClassPath.java:622)
	at java.security.AccessController.doPrivileged(Native Method)
	at sun.misc.URLClassPath$JarLoader.ensureOpen(URLClassPath.java:614)
	at sun.misc.URLClassPath$JarLoader.getResource(URLClassPath.java:767)


REGRESSION:  org.apache.lucene.search.TestMultiTermConstantScore.testRangeQueryIdCollating

Error Message:
Could not initialize class sun.text.normalizer.NormalizerImpl

Stack Trace:
java.lang.NoClassDefFoundError: Could not initialize class sun.text.normalizer.NormalizerImpl
	at java.text.RBTableBuilder.build(RBTableBuilder.java:107)
	at java.text.RBCollationTables.<init>(RBCollationTables.java:83)
	at java.text.RuleBasedCollator.<init>(RuleBasedCollator.java:293)
	at java.text.Collator.getInstance(Collator.java:268)
	at org.apache.lucene.search.TestMultiTermConstantScore.testRangeQueryIdCollating(TestMultiTermConstantScore.java:424)
	at org.apache.lucene.util.LuceneTestCase.runBare(LuceneTestCase.java:255)


REGRESSION:  org.apache.lucene.search.TestMultiTermConstantScore.testRangeQueryRandCollating

Error Message:
Could not initialize class sun.text.normalizer.NormalizerImpl

Stack Trace:
java.lang.NoClassDefFoundError: Could not initialize class sun.text.normalizer.NormalizerImpl
	at java.text.RBTableBuilder.build(RBTableBuilder.java:107)
	at java.text.RBCollationTables.<init>(RBCollationTables.java:83)
	at java.text.RuleBasedCollator.<init>(RuleBasedCollator.java:293)
	at java.text.Collator.getInstance(Collator.java:268)
	at org.apache.lucene.search.TestMultiTermConstantScore.testRangeQueryRandCollating(TestMultiTermConstantScore.java:567)
	at org.apache.lucene.util.LuceneTestCase.runBare(LuceneTestCase.java:255)


REGRESSION:  org.apache.lucene.search.TestMultiTermConstantScore.testFarsi

Error Message:
null

Stack Trace:
java.lang.InternalError
	at sun.misc.URLClassPath$JarLoader.getResource(URLClassPath.java:769)
	at sun.misc.URLClassPath.getResource(URLClassPath.java:185)
	at java.net.URLClassLoader$1.run(URLClassLoader.java:209)
	at java.security.AccessController.doPrivileged(Native Method)
	at java.net.URLClassLoader.findClass(URLClassLoader.java:205)
	at java.lang.ClassLoader.loadClass(ClassLoader.java:321)
	at java.lang.ClassLoader.loadClass(ClassLoader.java:314)
	at sun.misc.Launcher$AppClassLoader.loadClass(Launcher.java:294)
	at java.lang.ClassLoader.loadClass(ClassLoader.java:266)
	at java.util.ResourceBundle$RBClassLoader.loadClass(ResourceBundle.java:463)
	at java.util.ResourceBundle$Control.newBundle(ResourceBundle.java:2401)
	at java.util.ResourceBundle.loadBundle(ResourceBundle.java:1424)
	at java.util.ResourceBundle.findBundle(ResourceBundle.java:1383)
	at java.util.ResourceBundle.getBundleImpl(ResourceBundle.java:1252)
	at java.util.ResourceBundle.getBundle(ResourceBundle.java:850)
	at sun.util.resources.LocaleData$1.run(LocaleData.java:142)
	at java.security.AccessController.doPrivileged(Native Method)
	at sun.util.resources.LocaleData.getBundle(LocaleData.java:140)
	at sun.util.resources.LocaleData.getCollationData(LocaleData.java:120)
	at java.text.Collator.getInstance(Collator.java:260)
	at org.apache.lucene.search.TestMultiTermConstantScore.testFarsi(TestMultiTermConstantScore.java:638)
	at org.apache.lucene.util.LuceneTestCase.runBare(LuceneTestCase.java:255)
Caused by: java.io.FileNotFoundException: /usr/local/openjdk6/jre/lib/ext/localedata.jar
	at sun.misc.URLClassPath$JarLoader.getJarFile(URLClassPath.java:658)
	at sun.misc.URLClassPath$JarLoader.access$600(URLClassPath.java:555)
	at sun.misc.URLClassPath$JarLoader$1.run(URLClassPath.java:622)
	at java.security.AccessController.doPrivileged(Native Method)
	at sun.misc.URLClassPath$JarLoader.ensureOpen(URLClassPath.java:614)
	at sun.misc.URLClassPath$JarLoader.getResource(URLClassPath.java:767)


REGRESSION:  org.apache.lucene.search.TestMultiTermConstantScore.testDanish

Error Message:
Could not initialize class sun.text.normalizer.NormalizerImpl

Stack Trace:
java.lang.NoClassDefFoundError: Could not initialize class sun.text.normalizer.NormalizerImpl
	at java.text.RBTableBuilder.build(RBTableBuilder.java:107)
	at java.text.RBCollationTables.<init>(RBCollationTables.java:83)
	at java.text.RuleBasedCollator.<init>(RuleBasedCollator.java:293)
	at java.text.Collator.getInstance(Collator.java:268)
	at org.apache.lucene.search.TestMultiTermConstantScore.testDanish(TestMultiTermConstantScore.java:679)
	at org.apache.lucene.util.LuceneTestCase.runBare(LuceneTestCase.java:255)


REGRESSION:  org.apache.lucene.search.TestSort.testEmptyFieldSort

Error Message:
null

Stack Trace:
java.lang.InternalError
	at sun.misc.URLClassPath$JarLoader.getResource(URLClassPath.java:769)
	at sun.misc.URLClassPath.getResource(URLClassPath.java:185)
	at sun.misc.URLClassPath.getResource(URLClassPath.java:237)
	at java.lang.ClassLoader.getBootstrapResource(ClassLoader.java:1113)
	at java.lang.ClassLoader.getResource(ClassLoader.java:974)
	at java.lang.ClassLoader.getResource(ClassLoader.java:972)
	at java.lang.ClassLoader.getSystemResource(ClassLoader.java:1075)
	at java.lang.ClassLoader.getSystemResourceAsStream(ClassLoader.java:1181)
	at java.lang.Class.getResourceAsStream(Class.java:2045)
	at sun.text.normalizer.ICUData.getStream(ICUData.java:61)
	at sun.text.normalizer.ICUData.getRequiredStream(ICUData.java:81)
	at sun.text.normalizer.NormalizerImpl.<init>(NormalizerImpl.java:260)
	at sun.text.normalizer.NormalizerImpl.<clinit>(NormalizerImpl.java:57)
	at java.text.RBTableBuilder.build(RBTableBuilder.java:107)
	at java.text.RBCollationTables.<init>(RBCollationTables.java:83)
	at java.text.RuleBasedCollator.<init>(RuleBasedCollator.java:293)
	at java.text.Collator.getInstance(Collator.java:268)
	at org.apache.lucene.search.FieldComparator$StringComparatorLocale.<init>(FieldComparator.java:631)
	at org.apache.lucene.search.SortField.getComparator(SortField.java:383)
	at org.apache.lucene.search.FieldValueHitQueue$OneComparatorFieldValueHitQueue.<init>(FieldValueHitQueue.java:64)
	at org.apache.lucene.search.FieldValueHitQueue.create(FieldValueHitQueue.java:172)
	at org.apache.lucene.search.TopFieldCollector.create(TopFieldCollector.java:916)
	at org.apache.lucene.search.IndexSearcher.search(IndexSearcher.java:454)
	at org.apache.lucene.search.IndexSearcher.search(IndexSearcher.java:426)
	at org.apache.lucene.search.IndexSearcher.search(IndexSearcher.java:349)
	at org.apache.lucene.search.TestSort.assertMatches(TestSort.java:965)
	at org.apache.lucene.search.TestSort.testEmptyFieldSort(TestSort.java:499)
	at org.apache.lucene.util.LuceneTestCase.runBare(LuceneTestCase.java:255)
Caused by: java.io.FileNotFoundException: /usr/local/openjdk6/jre/lib/resources.jar
	at sun.misc.URLClassPath$JarLoader.getJarFile(URLClassPath.java:658)
	at sun.misc.URLClassPath$JarLoader.access$600(URLClassPath.java:555)
	at sun.misc.URLClassPath$JarLoader$1.run(URLClassPath.java:622)
	at java.security.AccessController.doPrivileged(Native Method)
	at sun.misc.URLClassPath$JarLoader.ensureOpen(URLClassPath.java:614)
	at sun.misc.URLClassPath$JarLoader.getResource(URLClassPath.java:767)


REGRESSION:  org.apache.lucene.search.TestSort.testLocaleSort

Error Message:
Could not initialize class sun.text.normalizer.NormalizerImpl

Stack Trace:
java.lang.NoClassDefFoundError: Could not initialize class sun.text.normalizer.NormalizerImpl
	at java.text.RBTableBuilder.build(RBTableBuilder.java:107)
	at java.text.RBCollationTables.<init>(RBCollationTables.java:83)
	at java.text.RuleBasedCollator.<init>(RuleBasedCollator.java:293)
	at java.text.Collator.getInstance(Collator.java:268)
	at org.apache.lucene.search.FieldComparator$StringComparatorLocale.<init>(FieldComparator.java:631)
	at org.apache.lucene.search.SortField.getComparator(SortField.java:383)
	at org.apache.lucene.search.FieldValueHitQueue$OneComparatorFieldValueHitQueue.<init>(FieldValueHitQueue.java:64)
	at org.apache.lucene.search.FieldValueHitQueue.create(FieldValueHitQueue.java:172)
	at org.apache.lucene.search.TopFieldCollector.create(TopFieldCollector.java:916)
	at org.apache.lucene.search.IndexSearcher.search(IndexSearcher.java:454)
	at org.apache.lucene.search.IndexSearcher.search(IndexSearcher.java:426)
	at org.apache.lucene.search.IndexSearcher.search(IndexSearcher.java:349)
	at org.apache.lucene.search.TestSort.assertMatches(TestSort.java:965)
	at org.apache.lucene.search.TestSort.testLocaleSort(TestSort.java:578)
	at org.apache.lucene.util.LuceneTestCase.runBare(LuceneTestCase.java:255)


REGRESSION:  org.apache.lucene.search.TestSort.testInternationalSort

Error Message:
Could not initialize class sun.text.normalizer.NormalizerImpl

Stack Trace:
java.lang.NoClassDefFoundError: Could not initialize class sun.text.normalizer.NormalizerImpl
	at java.text.RBTableBuilder.build(RBTableBuilder.java:107)
	at java.text.RBCollationTables.<init>(RBCollationTables.java:83)
	at java.text.RuleBasedCollator.<init>(RuleBasedCollator.java:293)
	at java.text.Collator.getInstance(Collator.java:268)
	at org.apache.lucene.search.FieldComparator$StringComparatorLocale.<init>(FieldComparator.java:631)
	at org.apache.lucene.search.SortField.getComparator(SortField.java:383)
	at org.apache.lucene.search.FieldValueHitQueue$OneComparatorFieldValueHitQueue.<init>(FieldValueHitQueue.java:64)
	at org.apache.lucene.search.FieldValueHitQueue.create(FieldValueHitQueue.java:172)
	at org.apache.lucene.search.TopFieldCollector.create(TopFieldCollector.java:916)
	at org.apache.lucene.search.IndexSearcher.search(IndexSearcher.java:454)
	at org.apache.lucene.search.IndexSearcher.search(IndexSearcher.java:426)
	at org.apache.lucene.search.IndexSearcher.search(IndexSearcher.java:349)
	at org.apache.lucene.search.TestSort.assertMatches(TestSort.java:965)
	at org.apache.lucene.search.TestSort.testInternationalSort(TestSort.java:590)
	at org.apache.lucene.util.LuceneTestCase.runBare(LuceneTestCase.java:255)


REGRESSION:  org.apache.lucene.search.TestSort.testInternationalMultiSearcherSort

Error Message:
Could not initialize class sun.text.normalizer.NormalizerImpl

Stack Trace:
java.lang.NoClassDefFoundError: Could not initialize class sun.text.normalizer.NormalizerImpl
	at java.text.RBTableBuilder.build(RBTableBuilder.java:107)
	at java.text.RBCollationTables.<init>(RBCollationTables.java:83)
	at java.text.RuleBasedCollator.<init>(RuleBasedCollator.java:293)
	at java.text.Collator.getInstance(Collator.java:268)
	at org.apache.lucene.search.FieldComparator$StringComparatorLocale.<init>(FieldComparator.java:631)
	at org.apache.lucene.search.SortField.getComparator(SortField.java:383)
	at org.apache.lucene.search.FieldValueHitQueue$OneComparatorFieldValueHitQueue.<init>(FieldValueHitQueue.java:64)
	at org.apache.lucene.search.FieldValueHitQueue.create(FieldValueHitQueue.java:172)
	at org.apache.lucene.search.TopFieldCollector.create(TopFieldCollector.java:916)
	at org.apache.lucene.search.IndexSearcher.search(IndexSearcher.java:454)
	at org.apache.lucene.search.IndexSearcher.search(IndexSearcher.java:426)
	at org.apache.lucene.search.MultiSearcher$MultiSearcherCallableWithSort.call(MultiSearcher.java:428)
	at org.apache.lucene.search.MultiSearcher.search(MultiSearcher.java:238)
	at org.apache.lucene.search.Searcher.search(Searcher.java:53)
	at org.apache.lucene.search.TestSort.assertMatches(TestSort.java:965)
	at org.apache.lucene.search.TestSort.testInternationalMultiSearcherSort(TestSort.java:611)
	at org.apache.lucene.util.LuceneTestCase.runBare(LuceneTestCase.java:255)


REGRESSION:  org.apache.lucene.search.TestSort.testMultiSort

Error Message:
Could not initialize class sun.text.normalizer.NormalizerImpl

Stack Trace:
java.lang.NoClassDefFoundError: Could not initialize class sun.text.normalizer.NormalizerImpl
	at java.text.RBTableBuilder.build(RBTableBuilder.java:107)
	at java.text.RBCollationTables.<init>(RBCollationTables.java:83)
	at java.text.RuleBasedCollator.<init>(RuleBasedCollator.java:293)
	at java.text.Collator.getInstance(Collator.java:268)
	at org.apache.lucene.search.FieldComparator$StringComparatorLocale.<init>(FieldComparator.java:631)
	at org.apache.lucene.search.SortField.getComparator(SortField.java:383)
	at org.apache.lucene.search.FieldValueHitQueue$OneComparatorFieldValueHitQueue.<init>(FieldValueHitQueue.java:64)
	at org.apache.lucene.search.FieldValueHitQueue.create(FieldValueHitQueue.java:172)
	at org.apache.lucene.search.TopFieldCollector.create(TopFieldCollector.java:916)
	at org.apache.lucene.search.IndexSearcher.search(IndexSearcher.java:454)
	at org.apache.lucene.search.IndexSearcher.search(IndexSearcher.java:426)
	at org.apache.lucene.search.MultiSearcher$MultiSearcherCallableWithSort.call(MultiSearcher.java:428)
	at org.apache.lucene.search.MultiSearcher.search(MultiSearcher.java:238)
	at org.apache.lucene.search.Searcher.search(Searcher.java:53)
	at org.apache.lucene.search.TestSort.assertMatches(TestSort.java:965)
	at org.apache.lucene.search.TestSort.runMultiSorts(TestSort.java:948)
	at org.apache.lucene.search.TestSort.testMultiSort(TestSort.java:623)
	at org.apache.lucene.util.LuceneTestCase.runBare(LuceneTestCase.java:255)


REGRESSION:  org.apache.lucene.search.TestSort.testParallelMultiSort

Error Message:
java.util.concurrent.ExecutionException: java.lang.NoClassDefFoundError: Could not initialize
class sun.text.normalizer.NormalizerImpl

Stack Trace:
java.lang.RuntimeException: java.util.concurrent.ExecutionException: java.lang.NoClassDefFoundError:
Could not initialize class sun.text.normalizer.NormalizerImpl
	at org.apache.lucene.search.ParallelMultiSearcher$ExecutionHelper.next(ParallelMultiSearcher.java:278)
	at org.apache.lucene.search.ParallelMultiSearcher.search(ParallelMultiSearcher.java:139)
	at org.apache.lucene.search.Searcher.search(Searcher.java:53)
	at org.apache.lucene.search.TestSort.assertMatches(TestSort.java:965)
	at org.apache.lucene.search.TestSort.runMultiSorts(TestSort.java:948)
	at org.apache.lucene.search.TestSort.testParallelMultiSort(TestSort.java:629)
	at org.apache.lucene.util.LuceneTestCase.runBare(LuceneTestCase.java:255)
Caused by: java.util.concurrent.ExecutionException: java.lang.NoClassDefFoundError: Could
not initialize class sun.text.normalizer.NormalizerImpl
	at java.util.concurrent.FutureTask$Sync.innerGet(FutureTask.java:252)
	at java.util.concurrent.FutureTask.get(FutureTask.java:111)
	at org.apache.lucene.search.ParallelMultiSearcher$ExecutionHelper.next(ParallelMultiSearcher.java:274)
Caused by: java.lang.NoClassDefFoundError: Could not initialize class sun.text.normalizer.NormalizerImpl
	at java.text.RBTableBuilder.build(RBTableBuilder.java:107)
	at java.text.RBCollationTables.<init>(RBCollationTables.java:83)
	at java.text.RuleBasedCollator.<init>(RuleBasedCollator.java:293)
	at java.text.Collator.getInstance(Collator.java:268)
	at org.apache.lucene.search.FieldComparator$StringComparatorLocale.<init>(FieldComparator.java:631)
	at org.apache.lucene.search.SortField.getComparator(SortField.java:383)
	at org.apache.lucene.search.FieldValueHitQueue$OneComparatorFieldValueHitQueue.<init>(FieldValueHitQueue.java:64)
	at org.apache.lucene.search.FieldValueHitQueue.create(FieldValueHitQueue.java:172)
	at org.apache.lucene.search.TopFieldCollector.create(TopFieldCollector.java:916)
	at org.apache.lucene.search.IndexSearcher.search(IndexSearcher.java:454)
	at org.apache.lucene.search.IndexSearcher.search(IndexSearcher.java:426)
	at org.apache.lucene.search.MultiSearcher$MultiSearcherCallableWithSort.call(MultiSearcher.java:428)
	at org.apache.lucene.search.MultiSearcher$MultiSearcherCallableWithSort.call(MultiSearcher.java:402)
	at java.util.concurrent.FutureTask$Sync.innerRun(FutureTask.java:334)
	at java.util.concurrent.FutureTask.run(FutureTask.java:166)
	at java.util.concurrent.Executors$RunnableAdapter.call(Executors.java:471)
	at java.util.concurrent.FutureTask$Sync.innerRun(FutureTask.java:334)
	at java.util.concurrent.FutureTask.run(FutureTask.java:166)
	at java.util.concurrent.ThreadPoolExecutor.runWorker(ThreadPoolExecutor.java:1110)
	at java.util.concurrent.ThreadPoolExecutor$Worker.run(ThreadPoolExecutor.java:603)
	at java.lang.Thread.run(Thread.java:679)


REGRESSION:  org.apache.lucene.search.TestTermRangeQuery.testEqualsHashcode

Error Message:
null

Stack Trace:
java.lang.InternalError
	at sun.misc.URLClassPath$JarLoader.getResource(URLClassPath.java:769)
	at sun.misc.URLClassPath.getResource(URLClassPath.java:185)
	at sun.misc.URLClassPath.getResource(URLClassPath.java:237)
	at java.lang.ClassLoader.getBootstrapResource(ClassLoader.java:1113)
	at java.lang.ClassLoader.getResource(ClassLoader.java:974)
	at java.lang.ClassLoader.getResource(ClassLoader.java:972)
	at java.lang.ClassLoader.getSystemResource(ClassLoader.java:1075)
	at java.lang.ClassLoader.getSystemResourceAsStream(ClassLoader.java:1181)
	at java.lang.Class.getResourceAsStream(Class.java:2045)
	at sun.text.normalizer.ICUData.getStream(ICUData.java:61)
	at sun.text.normalizer.ICUData.getRequiredStream(ICUData.java:81)
	at sun.text.normalizer.NormalizerImpl.<init>(NormalizerImpl.java:260)
	at sun.text.normalizer.NormalizerImpl.<clinit>(NormalizerImpl.java:57)
	at java.text.RBTableBuilder.build(RBTableBuilder.java:107)
	at java.text.RBCollationTables.<init>(RBCollationTables.java:83)
	at java.text.RuleBasedCollator.<init>(RuleBasedCollator.java:293)
	at java.text.Collator.getInstance(Collator.java:268)
	at java.text.Collator.getInstance(Collator.java:224)
	at org.apache.lucene.search.TestTermRangeQuery.testEqualsHashcode(TestTermRangeQuery.java:134)
	at org.apache.lucene.util.LuceneTestCase.runBare(LuceneTestCase.java:255)
Caused by: java.io.FileNotFoundException: /usr/local/openjdk6/jre/lib/resources.jar
	at sun.misc.URLClassPath$JarLoader.getJarFile(URLClassPath.java:658)
	at sun.misc.URLClassPath$JarLoader.access$600(URLClassPath.java:555)
	at sun.misc.URLClassPath$JarLoader$1.run(URLClassPath.java:622)
	at java.security.AccessController.doPrivileged(Native Method)
	at sun.misc.URLClassPath$JarLoader.ensureOpen(URLClassPath.java:614)
	at sun.misc.URLClassPath$JarLoader.getResource(URLClassPath.java:767)


REGRESSION:  org.apache.lucene.search.TestTermRangeQuery.testExclusiveCollating

Error Message:
Could not initialize class sun.text.normalizer.NormalizerImpl

Stack Trace:
java.lang.NoClassDefFoundError: Could not initialize class sun.text.normalizer.NormalizerImpl
	at java.text.RBTableBuilder.build(RBTableBuilder.java:107)
	at java.text.RBCollationTables.<init>(RBCollationTables.java:83)
	at java.text.RuleBasedCollator.<init>(RuleBasedCollator.java:293)
	at java.text.Collator.getInstance(Collator.java:268)
	at org.apache.lucene.search.TestTermRangeQuery.testExclusiveCollating(TestTermRangeQuery.java:139)
	at org.apache.lucene.util.LuceneTestCase.runBare(LuceneTestCase.java:255)


REGRESSION:  org.apache.lucene.search.TestTermRangeQuery.testInclusiveCollating

Error Message:
Could not initialize class sun.text.normalizer.NormalizerImpl

Stack Trace:
java.lang.NoClassDefFoundError: Could not initialize class sun.text.normalizer.NormalizerImpl
	at java.text.RBTableBuilder.build(RBTableBuilder.java:107)
	at java.text.RBCollationTables.<init>(RBCollationTables.java:83)
	at java.text.RuleBasedCollator.<init>(RuleBasedCollator.java:293)
	at java.text.Collator.getInstance(Collator.java:268)
	at org.apache.lucene.search.TestTermRangeQuery.testInclusiveCollating(TestTermRangeQuery.java:160)
	at org.apache.lucene.util.LuceneTestCase.runBare(LuceneTestCase.java:255)


REGRESSION:  org.apache.lucene.search.TestTermRangeQuery.testFarsi

Error Message:
null

Stack Trace:
java.lang.InternalError
	at sun.misc.URLClassPath$JarLoader.getResource(URLClassPath.java:769)
	at sun.misc.URLClassPath.getResource(URLClassPath.java:185)
	at java.net.URLClassLoader$1.run(URLClassLoader.java:209)
	at java.security.AccessController.doPrivileged(Native Method)
	at java.net.URLClassLoader.findClass(URLClassLoader.java:205)
	at java.lang.ClassLoader.loadClass(ClassLoader.java:321)
	at java.lang.ClassLoader.loadClass(ClassLoader.java:314)
	at sun.misc.Launcher$AppClassLoader.loadClass(Launcher.java:294)
	at java.lang.ClassLoader.loadClass(ClassLoader.java:266)
	at java.util.ResourceBundle$RBClassLoader.loadClass(ResourceBundle.java:463)
	at java.util.ResourceBundle$Control.newBundle(ResourceBundle.java:2401)
	at java.util.ResourceBundle.loadBundle(ResourceBundle.java:1424)
	at java.util.ResourceBundle.findBundle(ResourceBundle.java:1383)
	at java.util.ResourceBundle.getBundleImpl(ResourceBundle.java:1252)
	at java.util.ResourceBundle.getBundle(ResourceBundle.java:850)
	at sun.util.resources.LocaleData$1.run(LocaleData.java:142)
	at java.security.AccessController.doPrivileged(Native Method)
	at sun.util.resources.LocaleData.getBundle(LocaleData.java:140)
	at sun.util.resources.LocaleData.getCollationData(LocaleData.java:120)
	at java.text.Collator.getInstance(Collator.java:260)
	at org.apache.lucene.search.TestTermRangeQuery.testFarsi(TestTermRangeQuery.java:185)
	at org.apache.lucene.util.LuceneTestCase.runBare(LuceneTestCase.java:255)
Caused by: java.io.FileNotFoundException: /usr/local/openjdk6/jre/lib/ext/localedata.jar
	at sun.misc.URLClassPath$JarLoader.getJarFile(URLClassPath.java:658)
	at sun.misc.URLClassPath$JarLoader.access$600(URLClassPath.java:555)
	at sun.misc.URLClassPath$JarLoader$1.run(URLClassPath.java:622)
	at java.security.AccessController.doPrivileged(Native Method)
	at sun.misc.URLClassPath$JarLoader.ensureOpen(URLClassPath.java:614)
	at sun.misc.URLClassPath$JarLoader.getResource(URLClassPath.java:767)


REGRESSION:  org.apache.lucene.search.TestTermRangeQuery.testDanish

Error Message:
Could not initialize class sun.text.normalizer.NormalizerImpl

Stack Trace:
java.lang.NoClassDefFoundError: Could not initialize class sun.text.normalizer.NormalizerImpl
	at java.text.RBTableBuilder.build(RBTableBuilder.java:107)
	at java.text.RBCollationTables.<init>(RBCollationTables.java:83)
	at java.text.RuleBasedCollator.<init>(RuleBasedCollator.java:293)
	at java.text.Collator.getInstance(Collator.java:268)
	at org.apache.lucene.search.TestTermRangeQuery.testDanish(TestTermRangeQuery.java:203)
	at org.apache.lucene.util.LuceneTestCase.runBare(LuceneTestCase.java:255)




Build Log (for compile errors):
[...truncated 9322 lines...]



---------------------------------------------------------------------
To unsubscribe, e-mail: dev-unsubscribe@lucene.apache.org
For additional commands, e-mail: dev-help@lucene.apache.org


Mime
View raw message