lucene-dev mailing list archives

Site index · List index
Message view « Date » · « Thread »
Top « Date » · « Thread »
From Apache Hudson Server <hud...@hudson.apache.org>
Subject [HUDSON] Lucene-Solr-tests-only-3.x - Build # 6568 - Still Failing
Date Thu, 31 Mar 2011 18:09:44 GMT
Build: https://hudson.apache.org/hudson/job/Lucene-Solr-tests-only-3.x/6568/

2 tests failed.
FAILED:  <init>.org.apache.lucene.util.TestBitVector

Error Message:
org.apache.lucene.util.TestBitVector

Stack Trace:
java.lang.ClassNotFoundException: org.apache.lucene.util.TestBitVector
	at java.net.URLClassLoader$1.run(URLClassLoader.java:217)
	at java.security.AccessController.doPrivileged(Native Method)
	at java.net.URLClassLoader.findClass(URLClassLoader.java:205)
	at java.lang.ClassLoader.loadClass(ClassLoader.java:321)
	at sun.misc.Launcher$AppClassLoader.loadClass(Launcher.java:294)
	at java.lang.ClassLoader.loadClass(ClassLoader.java:266)
	at java.lang.Class.forName0(Native Method)
	at java.lang.Class.forName(Class.java:186)


FAILED:  <init>.org.apache.lucene.util.TestFieldCacheSanityChecker

Error Message:
org.apache.lucene.util.TestFieldCacheSanityChecker

Stack Trace:
java.lang.ClassNotFoundException: org.apache.lucene.util.TestFieldCacheSanityChecker
	at java.net.URLClassLoader$1.run(URLClassLoader.java:217)
	at java.security.AccessController.doPrivileged(Native Method)
	at java.net.URLClassLoader.findClass(URLClassLoader.java:205)
	at java.lang.ClassLoader.loadClass(ClassLoader.java:321)
	at sun.misc.Launcher$AppClassLoader.loadClass(Launcher.java:294)
	at java.lang.ClassLoader.loadClass(ClassLoader.java:266)
	at java.lang.Class.forName0(Native Method)
	at java.lang.Class.forName(Class.java:186)




Build Log (for compile errors):
[...truncated 47 lines...]



---------------------------------------------------------------------
To unsubscribe, e-mail: dev-unsubscribe@lucene.apache.org
For additional commands, e-mail: dev-help@lucene.apache.org


Mime
View raw message