lucene-dev mailing list archives

Site index · List index
Message view « Date » · « Thread »
Top « Date » · « Thread »
From Apache Hudson Server <hud...@hudson.apache.org>
Subject [HUDSON] Lucene-Solr-tests-only-trunk - Build # 5620 - Failure
Date Sat, 05 Mar 2011 20:15:15 GMT
Build: https://hudson.apache.org/hudson/job/Lucene-Solr-tests-only-trunk/5620/

2 tests failed.
FAILED:  junit.framework.TestSuite.org.apache.solr.cloud.BasicZkTest

Error Message:
org.apache.solr.common.cloud.ZooKeeperException: 

Stack Trace:
java.lang.RuntimeException: org.apache.solr.common.cloud.ZooKeeperException: 
	at org.apache.solr.util.TestHarness.<init>(TestHarness.java:153)
	at org.apache.solr.util.TestHarness.<init>(TestHarness.java:135)
	at org.apache.solr.util.TestHarness.<init>(TestHarness.java:125)
	at org.apache.solr.SolrTestCaseJ4.initCore(SolrTestCaseJ4.java:237)
	at org.apache.solr.SolrTestCaseJ4.initCore(SolrTestCaseJ4.java:100)
	at org.apache.solr.SolrTestCaseJ4.initCore(SolrTestCaseJ4.java:88)
	at org.apache.solr.cloud.AbstractZkTestCase.azt_beforeClass(AbstractZkTestCase.java:65)
Caused by: org.apache.solr.common.cloud.ZooKeeperException: 
	at org.apache.solr.core.CoreContainer.register(CoreContainer.java:517)
	at org.apache.solr.util.TestHarness$Initializer.initialize(TestHarness.java:192)
	at org.apache.solr.util.TestHarness.<init>(TestHarness.java:140)
Caused by: org.apache.zookeeper.KeeperException$ConnectionLossException: KeeperErrorCode =
ConnectionLoss for /collections
	at org.apache.zookeeper.KeeperException.create(KeeperException.java:90)
	at org.apache.zookeeper.KeeperException.create(KeeperException.java:42)
	at org.apache.zookeeper.ZooKeeper.setData(ZooKeeper.java:1038)
	at org.apache.solr.common.cloud.SolrZkClient.setData(SolrZkClient.java:224)
	at org.apache.solr.common.cloud.SolrZkClient.makePath(SolrZkClient.java:354)
	at org.apache.solr.common.cloud.SolrZkClient.makePath(SolrZkClient.java:308)
	at org.apache.solr.common.cloud.SolrZkClient.makePath(SolrZkClient.java:290)
	at org.apache.solr.common.cloud.SolrZkClient.makePath(SolrZkClient.java:255)
	at org.apache.solr.common.cloud.SolrZkClient.setData(SolrZkClient.java:384)
	at org.apache.solr.cloud.ZkController.addZkShardsNode(ZkController.java:159)
	at org.apache.solr.cloud.ZkController.register(ZkController.java:481)
	at org.apache.solr.core.CoreContainer.register(CoreContainer.java:508)


FAILED:  junit.framework.TestSuite.org.apache.solr.cloud.BasicZkTest

Error Message:
ERROR: SolrIndexSearcher opens=1 closes=0

Stack Trace:
junit.framework.AssertionFailedError: ERROR: SolrIndexSearcher opens=1 closes=0
	at org.apache.solr.SolrTestCaseJ4.endTrackingSearchers(SolrTestCaseJ4.java:118)
	at org.apache.solr.SolrTestCaseJ4.deleteCore(SolrTestCaseJ4.java:292)
	at org.apache.solr.SolrTestCaseJ4.afterClassSolrTestCase(SolrTestCaseJ4.java:69)




Build Log (for compile errors):
[...truncated 8668 lines...]



---------------------------------------------------------------------
To unsubscribe, e-mail: dev-unsubscribe@lucene.apache.org
For additional commands, e-mail: dev-help@lucene.apache.org


Mime
View raw message