lucene-dev mailing list archives

Site index · List index
Message view « Date » · « Thread »
Top « Date » · « Thread »
From Apache Hudson Server <hud...@hudson.apache.org>
Subject [HUDSON] Lucene-Solr-tests-only-trunk - Build # 6584 - Failure
Date Thu, 31 Mar 2011 20:49:58 GMT
Build: https://hudson.apache.org/hudson/job/Lucene-Solr-tests-only-trunk/6584/

3 tests failed.
REGRESSION:  org.apache.solr.client.solrj.embedded.SolrExampleJettyTest.testCommitWithin

Error Message:
expected:<0> but was:<1>

Stack Trace:
junit.framework.AssertionFailedError: expected:<0> but was:<1>
	at org.apache.solr.client.solrj.SolrExampleTests.testCommitWithin(SolrExampleTests.java:365)
	at org.apache.lucene.util.LuceneTestCase$LuceneTestCaseRunner.runChild(LuceneTestCase.java:1221)
	at org.apache.lucene.util.LuceneTestCase$LuceneTestCaseRunner.runChild(LuceneTestCase.java:1149)


REGRESSION:  org.apache.solr.cloud.CloudStateUpdateTest.testCoreRegistration

Error Message:
null

Stack Trace:
org.apache.solr.common.cloud.ZooKeeperException: 
	at org.apache.solr.core.CoreContainer.initZooKeeper(CoreContainer.java:183)
	at org.apache.solr.core.CoreContainer.load(CoreContainer.java:333)
	at org.apache.solr.core.CoreContainer$Initializer.initialize(CoreContainer.java:242)
	at org.apache.solr.cloud.CloudStateUpdateTest.testCoreRegistration(CloudStateUpdateTest.java:216)
	at org.apache.lucene.util.LuceneTestCase$LuceneTestCaseRunner.runChild(LuceneTestCase.java:1221)
	at org.apache.lucene.util.LuceneTestCase$LuceneTestCaseRunner.runChild(LuceneTestCase.java:1149)
Caused by: java.util.concurrent.TimeoutException: Could not connect to ZooKeeper 127.0.0.1:16662/solr
within 5000 ms
	at org.apache.solr.common.cloud.ConnectionManager.waitForConnected(ConnectionManager.java:124)
	at org.apache.solr.common.cloud.SolrZkClient.<init>(SolrZkClient.java:121)
	at org.apache.solr.common.cloud.SolrZkClient.<init>(SolrZkClient.java:69)
	at org.apache.solr.cloud.ZkController.<init>(ZkController.java:104)
	at org.apache.solr.core.CoreContainer.initZooKeeper(CoreContainer.java:164)


REGRESSION:  org.apache.solr.cloud.ZkControllerTest.testUploadToCloud

Error Message:
KeeperErrorCode = ConnectionLoss for /configs/config1/synonyms.txt

Stack Trace:
org.apache.zookeeper.KeeperException$ConnectionLossException: KeeperErrorCode = ConnectionLoss
for /configs/config1/synonyms.txt
	at org.apache.zookeeper.KeeperException.create(KeeperException.java:90)
	at org.apache.zookeeper.KeeperException.create(KeeperException.java:42)
	at org.apache.zookeeper.ZooKeeper.create(ZooKeeper.java:637)
	at org.apache.solr.common.cloud.SolrZkClient.makePath(SolrZkClient.java:347)
	at org.apache.solr.common.cloud.SolrZkClient.makePath(SolrZkClient.java:308)
	at org.apache.solr.common.cloud.SolrZkClient.makePath(SolrZkClient.java:290)
	at org.apache.solr.common.cloud.SolrZkClient.makePath(SolrZkClient.java:255)
	at org.apache.solr.common.cloud.SolrZkClient.setData(SolrZkClient.java:384)
	at org.apache.solr.common.cloud.SolrZkClient.setData(SolrZkClient.java:410)
	at org.apache.solr.cloud.ZkController.uploadToZK(ZkController.java:520)
	at org.apache.solr.cloud.ZkControllerTest.testUploadToCloud(ZkControllerTest.java:191)
	at org.apache.lucene.util.LuceneTestCase$LuceneTestCaseRunner.runChild(LuceneTestCase.java:1221)
	at org.apache.lucene.util.LuceneTestCase$LuceneTestCaseRunner.runChild(LuceneTestCase.java:1149)




Build Log (for compile errors):
[...truncated 8836 lines...]



---------------------------------------------------------------------
To unsubscribe, e-mail: dev-unsubscribe@lucene.apache.org
For additional commands, e-mail: dev-help@lucene.apache.org


Mime
View raw message