lucene-dev mailing list archives

Site index · List index
Message view « Date » · « Thread »
Top « Date » · « Thread »
From "Uwe Schindler" <...@thetaphi.de>
Subject RE: [HUDSON] Lucene-Solr-tests-only-3.x - Build # 6568 - Still Failing
Date Thu, 31 Mar 2011 18:17:52 GMT
I killed hanging java processes!

-----
Uwe Schindler
H.-H.-Meier-Allee 63, D-28213 Bremen
http://www.thetaphi.de
eMail: uwe@thetaphi.de


> -----Original Message-----
> From: Apache Hudson Server [mailto:hudson@hudson.apache.org]
> Sent: Thursday, March 31, 2011 8:10 PM
> To: dev@lucene.apache.org
> Subject: [HUDSON] Lucene-Solr-tests-only-3.x - Build # 6568 - Still Failing
> 
> Build: https://hudson.apache.org/hudson/job/Lucene-Solr-tests-only-
> 3.x/6568/
> 
> 2 tests failed.
> FAILED:  <init>.org.apache.lucene.util.TestBitVector
> 
> Error Message:
> org.apache.lucene.util.TestBitVector
> 
> Stack Trace:
> java.lang.ClassNotFoundException: org.apache.lucene.util.TestBitVector
> 	at java.net.URLClassLoader$1.run(URLClassLoader.java:217)
> 	at java.security.AccessController.doPrivileged(Native Method)
> 	at java.net.URLClassLoader.findClass(URLClassLoader.java:205)
> 	at java.lang.ClassLoader.loadClass(ClassLoader.java:321)
> 	at sun.misc.Launcher$AppClassLoader.loadClass(Launcher.java:294)
> 	at java.lang.ClassLoader.loadClass(ClassLoader.java:266)
> 	at java.lang.Class.forName0(Native Method)
> 	at java.lang.Class.forName(Class.java:186)
> 
> 
> FAILED:  <init>.org.apache.lucene.util.TestFieldCacheSanityChecker
> 
> Error Message:
> org.apache.lucene.util.TestFieldCacheSanityChecker
> 
> Stack Trace:
> java.lang.ClassNotFoundException:
> org.apache.lucene.util.TestFieldCacheSanityChecker
> 	at java.net.URLClassLoader$1.run(URLClassLoader.java:217)
> 	at java.security.AccessController.doPrivileged(Native Method)
> 	at java.net.URLClassLoader.findClass(URLClassLoader.java:205)
> 	at java.lang.ClassLoader.loadClass(ClassLoader.java:321)
> 	at sun.misc.Launcher$AppClassLoader.loadClass(Launcher.java:294)
> 	at java.lang.ClassLoader.loadClass(ClassLoader.java:266)
> 	at java.lang.Class.forName0(Native Method)
> 	at java.lang.Class.forName(Class.java:186)
> 
> 
> 
> 
> Build Log (for compile errors):
> [...truncated 47 lines...]
> 
> 
> 
> ---------------------------------------------------------------------
> To unsubscribe, e-mail: dev-unsubscribe@lucene.apache.org For additional
> commands, e-mail: dev-help@lucene.apache.org



---------------------------------------------------------------------
To unsubscribe, e-mail: dev-unsubscribe@lucene.apache.org
For additional commands, e-mail: dev-help@lucene.apache.org


Mime
View raw message