lucene-dev mailing list archives

Site index · List index
Message view « Date » · « Thread »
Top « Date » · « Thread »
From Michael McCandless <luc...@mikemccandless.com>
Subject Re: [HUDSON] Lucene-trunk - Build # 1451 - Failure
Date Tue, 01 Feb 2011 11:42:10 GMT
I committed a fix here -- the new [very evil] MockRandomMergePolicy
had picked an enormous merge to do.

Mike

On Mon, Jan 31, 2011 at 9:25 PM, Apache Hudson Server
<hudson@hudson.apache.org> wrote:
> Build: https://hudson.apache.org/hudson/job/Lucene-trunk/1451/
>
> 29 tests failed.
> REGRESSION:  org.apache.lucene.index.TestNRTThreads.testNRTThreads
>
> Error Message:
> org/apache/lucene/util/LuceneTestCase$TwoLongs
>
> Stack Trace:
> java.lang.NoClassDefFoundError: org/apache/lucene/util/LuceneTestCase$TwoLongs
>        at org.apache.lucene.util.LuceneTestCase.reportAdditionalFailureInfo(LuceneTestCase.java:1041)
>        at org.apache.lucene.util.LuceneTestCase$1.failed(LuceneTestCase.java:431)
>        at org.apache.lucene.util.LuceneTestCase$LuceneTestCaseRunner.runChild(LuceneTestCase.java:1144)
>        at org.apache.lucene.util.LuceneTestCase$LuceneTestCaseRunner.runChild(LuceneTestCase.java:1076)
> Caused by: java.lang.ClassNotFoundException: org.apache.lucene.util.LuceneTestCase$TwoLongs
>        at java.net.URLClassLoader$1.run(URLClassLoader.java:214)
>        at java.security.AccessController.doPrivileged(Native Method)
>        at java.net.URLClassLoader.findClass(URLClassLoader.java:205)
>        at java.lang.ClassLoader.loadClass(ClassLoader.java:321)
>        at sun.misc.Launcher$AppClassLoader.loadClass(Launcher.java:294)
>        at java.lang.ClassLoader.loadClass(ClassLoader.java:266)
> Caused by: java.io.FileNotFoundException: /usr/home/hudson/hudson-slave/workspace/Lucene-trunk/checkout/lucene/build/classes/test/org/apache/lucene/util/LuceneTestCase$TwoLongs.class
(Too many open files in system)
>        at java.io.FileInputStream.open(Native Method)
>        at java.io.FileInputStream.<init>(FileInputStream.java:137)
>        at sun.misc.URLClassPath$FileLoader$1.getInputStream(URLClassPath.java:1005)
>        at sun.misc.Resource.cachedInputStream(Resource.java:77)
>        at sun.misc.Resource.getByteBuffer(Resource.java:160)
>        at java.net.URLClassLoader.defineClass(URLClassLoader.java:266)
>        at java.net.URLClassLoader.access$000(URLClassLoader.java:73)
>        at java.net.URLClassLoader$1.run(URLClassLoader.java:212)
>
>
> REGRESSION:  org.apache.lucene.search.function.TestFieldScoreQuery.testCachingShort
>
> Error Message:
> /usr/home/hudson/hudson-slave/workspace/Lucene-trunk/checkout/lucene/build/test/1/test5442608586434668126tmp/_3_1.tii
(Too many open files in system)
>
> Stack Trace:
> java.io.FileNotFoundException: /usr/home/hudson/hudson-slave/workspace/Lucene-trunk/checkout/lucene/build/test/1/test5442608586434668126tmp/_3_1.tii
(Too many open files in system)
>        at java.io.RandomAccessFile.open(Native Method)
>        at java.io.RandomAccessFile.<init>(RandomAccessFile.java:233)
>        at org.apache.lucene.store.SimpleFSDirectory$SimpleFSIndexInput$Descriptor.<init>(SimpleFSDirectory.java:69)
>        at org.apache.lucene.store.SimpleFSDirectory$SimpleFSIndexInput.<init>(SimpleFSDirectory.java:90)
>        at org.apache.lucene.store.NIOFSDirectory$NIOFSIndexInput.<init>(NIOFSDirectory.java:91)
>        at org.apache.lucene.store.NIOFSDirectory.openInput(NIOFSDirectory.java:78)
>        at org.apache.lucene.store.FSDirectory.openInput(FSDirectory.java:345)
>        at org.apache.lucene.store.MockDirectoryWrapper.openInput(MockDirectoryWrapper.java:361)
>        at org.apache.lucene.index.codecs.FixedGapTermsIndexReader.<init>(FixedGapTermsIndexReader.java:75)
>        at org.apache.lucene.index.codecs.mockintblock.MockVariableIntBlockCodec.fieldsProducer(MockVariableIntBlockCodec.java:177)
>        at org.apache.lucene.index.PerFieldCodecWrapper$FieldsReader.<init>(PerFieldCodecWrapper.java:113)
>        at org.apache.lucene.index.PerFieldCodecWrapper.fieldsProducer(PerFieldCodecWrapper.java:210)
>        at org.apache.lucene.index.SegmentReader$CoreReaders.<init>(SegmentReader.java:128)
>        at org.apache.lucene.index.SegmentReader.get(SegmentReader.java:491)
>        at org.apache.lucene.index.IndexWriter$ReaderPool.get(IndexWriter.java:588)
>        at org.apache.lucene.index.IndexWriter.mergeMiddle(IndexWriter.java:3124)
>        at org.apache.lucene.index.IndexWriter.merge(IndexWriter.java:2818)
>        at org.apache.lucene.index.SerialMergeScheduler.merge(SerialMergeScheduler.java:37)
>        at org.apache.lucene.index.IndexWriter.maybeMerge(IndexWriter.java:1791)
>        at org.apache.lucene.index.IndexWriter.optimize(IndexWriter.java:1607)
>        at org.apache.lucene.index.IndexWriter.optimize(IndexWriter.java:1563)
>        at org.apache.lucene.index.IndexWriter.optimize(IndexWriter.java:1533)
>        at org.apache.lucene.index.RandomIndexWriter.close(RandomIndexWriter.java:154)
>        at org.apache.lucene.search.function.FunctionTestSetup.setUp(FunctionTestSetup.java:127)
>        at org.apache.lucene.util.LuceneTestCase$LuceneTestCaseRunner.runChild(LuceneTestCase.java:1144)
>        at org.apache.lucene.util.LuceneTestCase$LuceneTestCaseRunner.runChild(LuceneTestCase.java:1076)
>
>
> FAILED:  junit.framework.TestSuite.org.apache.lucene.search.function.TestFieldScoreQuery
>
> Error Message:
> directory of test was not closed, opened from: org.apache.lucene.search.function.FunctionTestSetup.setUp(FunctionTestSetup.java:100)
>
> Stack Trace:
> junit.framework.AssertionFailedError: directory of test was not closed, opened from:
org.apache.lucene.search.function.FunctionTestSetup.setUp(FunctionTestSetup.java:100)
>        at org.apache.lucene.util.LuceneTestCase.afterClassLuceneTestCaseJ4(LuceneTestCase.java:381)
>
>
> FAILED:  <init>.org.apache.lucene.search.payloads.TestPayloadNearQuery
>
> Error Message:
> org.apache.lucene.search.payloads.TestPayloadNearQuery
>
> Stack Trace:
> java.lang.ClassNotFoundException: org.apache.lucene.search.payloads.TestPayloadNearQuery
>        at java.net.URLClassLoader$1.run(URLClassLoader.java:214)
>        at java.security.AccessController.doPrivileged(Native Method)
>        at java.net.URLClassLoader.findClass(URLClassLoader.java:205)
>        at java.lang.ClassLoader.loadClass(ClassLoader.java:321)
>        at sun.misc.Launcher$AppClassLoader.loadClass(Launcher.java:294)
>        at java.lang.ClassLoader.loadClass(ClassLoader.java:266)
>        at java.lang.Class.forName0(Native Method)
>        at java.lang.Class.forName(Class.java:186)
> Caused by: java.io.FileNotFoundException: /usr/home/hudson/hudson-slave/workspace/Lucene-trunk/checkout/lucene/build/classes/test/org/apache/lucene/search/payloads/TestPayloadNearQuery.class
(Too many open files in system)
>        at java.io.FileInputStream.open(Native Method)
>        at java.io.FileInputStream.<init>(FileInputStream.java:137)
>        at sun.misc.URLClassPath$FileLoader$1.getInputStream(URLClassPath.java:1005)
>        at sun.misc.Resource.cachedInputStream(Resource.java:77)
>        at sun.misc.Resource.getByteBuffer(Resource.java:160)
>        at java.net.URLClassLoader.defineClass(URLClassLoader.java:266)
>        at java.net.URLClassLoader.access$000(URLClassLoader.java:73)
>        at java.net.URLClassLoader$1.run(URLClassLoader.java:212)
>
>
> FAILED:  <init>.org.apache.lucene.search.payloads.TestPayloadTermQuery
>
> Error Message:
> org.apache.lucene.search.payloads.TestPayloadTermQuery
>
> Stack Trace:
> java.lang.ClassNotFoundException: org.apache.lucene.search.payloads.TestPayloadTermQuery
>        at java.net.URLClassLoader$1.run(URLClassLoader.java:214)
>        at java.security.AccessController.doPrivileged(Native Method)
>        at java.net.URLClassLoader.findClass(URLClassLoader.java:205)
>        at java.lang.ClassLoader.loadClass(ClassLoader.java:321)
>        at sun.misc.Launcher$AppClassLoader.loadClass(Launcher.java:294)
>        at java.lang.ClassLoader.loadClass(ClassLoader.java:266)
>        at java.lang.Class.forName0(Native Method)
>        at java.lang.Class.forName(Class.java:186)
> Caused by: java.io.FileNotFoundException: /usr/home/hudson/hudson-slave/workspace/Lucene-trunk/checkout/lucene/build/classes/test/org/apache/lucene/search/payloads/TestPayloadTermQuery.class
(Too many open files in system)
>        at java.io.FileInputStream.open(Native Method)
>        at java.io.FileInputStream.<init>(FileInputStream.java:137)
>        at sun.misc.URLClassPath$FileLoader$1.getInputStream(URLClassPath.java:1005)
>        at sun.misc.Resource.cachedInputStream(Resource.java:77)
>        at sun.misc.Resource.getByteBuffer(Resource.java:160)
>        at java.net.URLClassLoader.defineClass(URLClassLoader.java:266)
>        at java.net.URLClassLoader.access$000(URLClassLoader.java:73)
>        at java.net.URLClassLoader$1.run(URLClassLoader.java:212)
>
>
> REGRESSION:  org.apache.lucene.store.TestLockFactory.testStressLocks
>
> Error Message:
> org/apache/lucene/util/LuceneTestCase$TwoLongs
>
> Stack Trace:
> java.lang.NoClassDefFoundError: org/apache/lucene/util/LuceneTestCase$TwoLongs
>        at org.apache.lucene.util.LuceneTestCase.reportAdditionalFailureInfo(LuceneTestCase.java:1041)
>        at org.apache.lucene.util.LuceneTestCase$1.failed(LuceneTestCase.java:431)
>        at org.apache.lucene.util.LuceneTestCase$LuceneTestCaseRunner.runChild(LuceneTestCase.java:1144)
>        at org.apache.lucene.util.LuceneTestCase$LuceneTestCaseRunner.runChild(LuceneTestCase.java:1076)
>
>
> REGRESSION:  org.apache.lucene.util.TestFieldCacheSanityChecker.testInsanity1
>
> Error Message:
> directory '/usr/home/hudson/hudson-slave/workspace/Lucene-trunk/checkout/lucene/build/test/1/test6937065579252383007tmp'
exists and is a directory, but cannot be listed: list() returned null
>
> Stack Trace:
> java.io.IOException: directory '/usr/home/hudson/hudson-slave/workspace/Lucene-trunk/checkout/lucene/build/test/1/test6937065579252383007tmp'
exists and is a directory, but cannot be listed: list() returned null
>        at org.apache.lucene.store.FSDirectory.listAll(FSDirectory.java:239)
>        at org.apache.lucene.store.FSDirectory.listAll(FSDirectory.java:250)
>        at org.apache.lucene.store.MockDirectoryWrapper.listAll(MockDirectoryWrapper.java:488)
>        at org.apache.lucene.index.IndexFileDeleter.refresh(IndexFileDeleter.java:320)
>        at org.apache.lucene.index.DocumentsWriter.flush(DocumentsWriter.java:683)
>        at org.apache.lucene.index.IndexWriter.doFlush(IndexWriter.java:2518)
>        at org.apache.lucene.index.IndexWriter.flush(IndexWriter.java:2483)
>        at org.apache.lucene.index.IndexWriter.closeInternal(IndexWriter.java:1069)
>        at org.apache.lucene.index.IndexWriter.close(IndexWriter.java:1033)
>        at org.apache.lucene.index.IndexWriter.close(IndexWriter.java:997)
>        at org.apache.lucene.util.TestFieldCacheSanityChecker.setUp(TestFieldCacheSanityChecker.java:70)
>        at org.apache.lucene.util.LuceneTestCase$LuceneTestCaseRunner.runChild(LuceneTestCase.java:1144)
>        at org.apache.lucene.util.LuceneTestCase$LuceneTestCaseRunner.runChild(LuceneTestCase.java:1076)
>
>
> FAILED:  junit.framework.TestSuite.org.apache.lucene.util.TestFieldCacheSanityChecker
>
> Error Message:
> directory of test was not closed, opened from: org.apache.lucene.util.TestFieldCacheSanityChecker.setUp(TestFieldCacheSanityChecker.java:43)
>
> Stack Trace:
> junit.framework.AssertionFailedError: directory of test was not closed, opened from:
org.apache.lucene.util.TestFieldCacheSanityChecker.setUp(TestFieldCacheSanityChecker.java:43)
>        at org.apache.lucene.util.LuceneTestCase.afterClassLuceneTestCaseJ4(LuceneTestCase.java:381)
>
>
> FAILED:  <init>.org.apache.lucene.util.TestIndexableBinaryStringTools
>
> Error Message:
> org.apache.lucene.util.TestIndexableBinaryStringTools
>
> Stack Trace:
> java.lang.ClassNotFoundException: org.apache.lucene.util.TestIndexableBinaryStringTools
>        at java.net.URLClassLoader$1.run(URLClassLoader.java:214)
>        at java.security.AccessController.doPrivileged(Native Method)
>        at java.net.URLClassLoader.findClass(URLClassLoader.java:205)
>        at java.lang.ClassLoader.loadClass(ClassLoader.java:321)
>        at sun.misc.Launcher$AppClassLoader.loadClass(Launcher.java:294)
>        at java.lang.ClassLoader.loadClass(ClassLoader.java:266)
>        at java.lang.Class.forName0(Native Method)
>        at java.lang.Class.forName(Class.java:186)
> Caused by: java.io.FileNotFoundException: /usr/home/hudson/hudson-slave/workspace/Lucene-trunk/checkout/lucene/build/classes/test/org/apache/lucene/util/TestIndexableBinaryStringTools.class
(Too many open files in system)
>        at java.io.FileInputStream.open(Native Method)
>        at java.io.FileInputStream.<init>(FileInputStream.java:137)
>        at sun.misc.URLClassPath$FileLoader$1.getInputStream(URLClassPath.java:1005)
>        at sun.misc.Resource.cachedInputStream(Resource.java:77)
>        at sun.misc.Resource.getByteBuffer(Resource.java:160)
>        at java.net.URLClassLoader.defineClass(URLClassLoader.java:266)
>        at java.net.URLClassLoader.access$000(URLClassLoader.java:73)
>        at java.net.URLClassLoader$1.run(URLClassLoader.java:212)
>
>
> FAILED:  <init>.org.apache.lucene.util.TestNumericUtils
>
> Error Message:
> org.apache.lucene.util.TestNumericUtils
>
> Stack Trace:
> java.lang.ClassNotFoundException: org.apache.lucene.util.TestNumericUtils
>        at java.net.URLClassLoader$1.run(URLClassLoader.java:214)
>        at java.security.AccessController.doPrivileged(Native Method)
>        at java.net.URLClassLoader.findClass(URLClassLoader.java:205)
>        at java.lang.ClassLoader.loadClass(ClassLoader.java:321)
>        at sun.misc.Launcher$AppClassLoader.loadClass(Launcher.java:294)
>        at java.lang.ClassLoader.loadClass(ClassLoader.java:266)
>        at java.lang.Class.forName0(Native Method)
>        at java.lang.Class.forName(Class.java:186)
> Caused by: java.io.FileNotFoundException: /usr/home/hudson/hudson-slave/workspace/Lucene-trunk/checkout/lucene/build/classes/test/org/apache/lucene/util/TestNumericUtils.class
(Too many open files in system)
>        at java.io.FileInputStream.open(Native Method)
>        at java.io.FileInputStream.<init>(FileInputStream.java:137)
>        at sun.misc.URLClassPath$FileLoader$1.getInputStream(URLClassPath.java:1005)
>        at sun.misc.Resource.cachedInputStream(Resource.java:77)
>        at sun.misc.Resource.getByteBuffer(Resource.java:160)
>        at java.net.URLClassLoader.defineClass(URLClassLoader.java:266)
>        at java.net.URLClassLoader.access$000(URLClassLoader.java:73)
>        at java.net.URLClassLoader$1.run(URLClassLoader.java:212)
>
>
> FAILED:  <init>.org.apache.lucene.util.TestOpenBitSet
>
> Error Message:
> org.apache.lucene.util.TestOpenBitSet
>
> Stack Trace:
> java.lang.ClassNotFoundException: org.apache.lucene.util.TestOpenBitSet
>        at java.net.URLClassLoader$1.run(URLClassLoader.java:214)
>        at java.security.AccessController.doPrivileged(Native Method)
>        at java.net.URLClassLoader.findClass(URLClassLoader.java:205)
>        at java.lang.ClassLoader.loadClass(ClassLoader.java:321)
>        at sun.misc.Launcher$AppClassLoader.loadClass(Launcher.java:294)
>        at java.lang.ClassLoader.loadClass(ClassLoader.java:266)
>        at java.lang.Class.forName0(Native Method)
>        at java.lang.Class.forName(Class.java:186)
> Caused by: java.io.FileNotFoundException: /usr/home/hudson/hudson-slave/workspace/Lucene-trunk/checkout/lucene/build/classes/test/org/apache/lucene/util/TestOpenBitSet.class
(Too many open files in system)
>        at java.io.FileInputStream.open(Native Method)
>        at java.io.FileInputStream.<init>(FileInputStream.java:137)
>        at sun.misc.URLClassPath$FileLoader$1.getInputStream(URLClassPath.java:1005)
>        at sun.misc.Resource.cachedInputStream(Resource.java:77)
>        at sun.misc.Resource.getByteBuffer(Resource.java:160)
>        at java.net.URLClassLoader.defineClass(URLClassLoader.java:266)
>        at java.net.URLClassLoader.access$000(URLClassLoader.java:73)
>        at java.net.URLClassLoader$1.run(URLClassLoader.java:212)
>
>
> FAILED:  <init>.org.apache.lucene.util.TestPriorityQueue
>
> Error Message:
> org.apache.lucene.util.TestPriorityQueue
>
> Stack Trace:
> java.lang.ClassNotFoundException: org.apache.lucene.util.TestPriorityQueue
>        at java.net.URLClassLoader$1.run(URLClassLoader.java:214)
>        at java.security.AccessController.doPrivileged(Native Method)
>        at java.net.URLClassLoader.findClass(URLClassLoader.java:205)
>        at java.lang.ClassLoader.loadClass(ClassLoader.java:321)
>        at sun.misc.Launcher$AppClassLoader.loadClass(Launcher.java:294)
>        at java.lang.ClassLoader.loadClass(ClassLoader.java:266)
>        at java.lang.Class.forName0(Native Method)
>        at java.lang.Class.forName(Class.java:186)
> Caused by: java.io.FileNotFoundException: /usr/home/hudson/hudson-slave/workspace/Lucene-trunk/checkout/lucene/build/classes/test/org/apache/lucene/util/TestPriorityQueue.class
(Too many open files in system)
>        at java.io.FileInputStream.open(Native Method)
>        at java.io.FileInputStream.<init>(FileInputStream.java:137)
>        at sun.misc.URLClassPath$FileLoader$1.getInputStream(URLClassPath.java:1005)
>        at sun.misc.Resource.cachedInputStream(Resource.java:77)
>        at sun.misc.Resource.getByteBuffer(Resource.java:160)
>        at java.net.URLClassLoader.defineClass(URLClassLoader.java:266)
>        at java.net.URLClassLoader.access$000(URLClassLoader.java:73)
>        at java.net.URLClassLoader$1.run(URLClassLoader.java:212)
>
>
> FAILED:  <init>.org.apache.lucene.util.TestRamUsageEstimator
>
> Error Message:
> org.apache.lucene.util.TestRamUsageEstimator
>
> Stack Trace:
> java.lang.ClassNotFoundException: org.apache.lucene.util.TestRamUsageEstimator
>        at java.net.URLClassLoader$1.run(URLClassLoader.java:214)
>        at java.security.AccessController.doPrivileged(Native Method)
>        at java.net.URLClassLoader.findClass(URLClassLoader.java:205)
>        at java.lang.ClassLoader.loadClass(ClassLoader.java:321)
>        at sun.misc.Launcher$AppClassLoader.loadClass(Launcher.java:294)
>        at java.lang.ClassLoader.loadClass(ClassLoader.java:266)
>        at java.lang.Class.forName0(Native Method)
>        at java.lang.Class.forName(Class.java:186)
> Caused by: java.io.FileNotFoundException: /usr/home/hudson/hudson-slave/workspace/Lucene-trunk/checkout/lucene/build/classes/test/org/apache/lucene/util/TestRamUsageEstimator.class
(Too many open files in system)
>        at java.io.FileInputStream.open(Native Method)
>        at java.io.FileInputStream.<init>(FileInputStream.java:137)
>        at sun.misc.URLClassPath$FileLoader$1.getInputStream(URLClassPath.java:1005)
>        at sun.misc.Resource.cachedInputStream(Resource.java:77)
>        at sun.misc.Resource.getByteBuffer(Resource.java:160)
>        at java.net.URLClassLoader.defineClass(URLClassLoader.java:266)
>        at java.net.URLClassLoader.access$000(URLClassLoader.java:73)
>        at java.net.URLClassLoader$1.run(URLClassLoader.java:212)
>
>
> FAILED:  <init>.org.apache.lucene.util.TestRecyclingByteBlockAllocator
>
> Error Message:
> org.apache.lucene.util.TestRecyclingByteBlockAllocator
>
> Stack Trace:
> java.lang.ClassNotFoundException: org.apache.lucene.util.TestRecyclingByteBlockAllocator
>        at java.net.URLClassLoader$1.run(URLClassLoader.java:214)
>        at java.security.AccessController.doPrivileged(Native Method)
>        at java.net.URLClassLoader.findClass(URLClassLoader.java:205)
>        at java.lang.ClassLoader.loadClass(ClassLoader.java:321)
>        at sun.misc.Launcher$AppClassLoader.loadClass(Launcher.java:294)
>        at java.lang.ClassLoader.loadClass(ClassLoader.java:266)
>        at java.lang.Class.forName0(Native Method)
>        at java.lang.Class.forName(Class.java:186)
> Caused by: java.io.FileNotFoundException: /usr/home/hudson/hudson-slave/workspace/Lucene-trunk/checkout/lucene/build/classes/test/org/apache/lucene/util/TestRecyclingByteBlockAllocator.class
(Too many open files in system)
>        at java.io.FileInputStream.open(Native Method)
>        at java.io.FileInputStream.<init>(FileInputStream.java:137)
>        at sun.misc.URLClassPath$FileLoader$1.getInputStream(URLClassPath.java:1005)
>        at sun.misc.Resource.cachedInputStream(Resource.java:77)
>        at sun.misc.Resource.getByteBuffer(Resource.java:160)
>        at java.net.URLClassLoader.defineClass(URLClassLoader.java:266)
>        at java.net.URLClassLoader.access$000(URLClassLoader.java:73)
>        at java.net.URLClassLoader$1.run(URLClassLoader.java:212)
>
>
> FAILED:  <init>.org.apache.lucene.util.TestSetOnce
>
> Error Message:
> org.apache.lucene.util.TestSetOnce
>
> Stack Trace:
> java.lang.ClassNotFoundException: org.apache.lucene.util.TestSetOnce
>        at java.net.URLClassLoader$1.run(URLClassLoader.java:214)
>        at java.security.AccessController.doPrivileged(Native Method)
>        at java.net.URLClassLoader.findClass(URLClassLoader.java:205)
>        at java.lang.ClassLoader.loadClass(ClassLoader.java:321)
>        at sun.misc.Launcher$AppClassLoader.loadClass(Launcher.java:294)
>        at java.lang.ClassLoader.loadClass(ClassLoader.java:266)
>        at java.lang.Class.forName0(Native Method)
>        at java.lang.Class.forName(Class.java:186)
> Caused by: java.io.FileNotFoundException: /usr/home/hudson/hudson-slave/workspace/Lucene-trunk/checkout/lucene/build/classes/test/org/apache/lucene/util/TestSetOnce.class
(Too many open files in system)
>        at java.io.FileInputStream.open(Native Method)
>        at java.io.FileInputStream.<init>(FileInputStream.java:137)
>        at sun.misc.URLClassPath$FileLoader$1.getInputStream(URLClassPath.java:1005)
>        at sun.misc.Resource.cachedInputStream(Resource.java:77)
>        at sun.misc.Resource.getByteBuffer(Resource.java:160)
>        at java.net.URLClassLoader.defineClass(URLClassLoader.java:266)
>        at java.net.URLClassLoader.access$000(URLClassLoader.java:73)
>        at java.net.URLClassLoader$1.run(URLClassLoader.java:212)
>
>
> FAILED:  <init>.org.apache.lucene.util.TestSmallFloat
>
> Error Message:
> org.apache.lucene.util.TestSmallFloat
>
> Stack Trace:
> java.lang.ClassNotFoundException: org.apache.lucene.util.TestSmallFloat
>        at java.net.URLClassLoader$1.run(URLClassLoader.java:214)
>        at java.security.AccessController.doPrivileged(Native Method)
>        at java.net.URLClassLoader.findClass(URLClassLoader.java:205)
>        at java.lang.ClassLoader.loadClass(ClassLoader.java:321)
>        at sun.misc.Launcher$AppClassLoader.loadClass(Launcher.java:294)
>        at java.lang.ClassLoader.loadClass(ClassLoader.java:266)
>        at java.lang.Class.forName0(Native Method)
>        at java.lang.Class.forName(Class.java:186)
> Caused by: java.io.FileNotFoundException: /usr/home/hudson/hudson-slave/workspace/Lucene-trunk/checkout/lucene/build/classes/test/org/apache/lucene/util/TestSmallFloat.class
(Too many open files in system)
>        at java.io.FileInputStream.open(Native Method)
>        at java.io.FileInputStream.<init>(FileInputStream.java:137)
>        at sun.misc.URLClassPath$FileLoader$1.getInputStream(URLClassPath.java:1005)
>        at sun.misc.Resource.cachedInputStream(Resource.java:77)
>        at sun.misc.Resource.getByteBuffer(Resource.java:160)
>        at java.net.URLClassLoader.defineClass(URLClassLoader.java:266)
>        at java.net.URLClassLoader.access$000(URLClassLoader.java:73)
>        at java.net.URLClassLoader$1.run(URLClassLoader.java:212)
>
>
> FAILED:  <init>.org.apache.lucene.util.TestSortedVIntList
>
> Error Message:
> org.apache.lucene.util.TestSortedVIntList
>
> Stack Trace:
> java.lang.ClassNotFoundException: org.apache.lucene.util.TestSortedVIntList
>        at java.net.URLClassLoader$1.run(URLClassLoader.java:214)
>        at java.security.AccessController.doPrivileged(Native Method)
>        at java.net.URLClassLoader.findClass(URLClassLoader.java:205)
>        at java.lang.ClassLoader.loadClass(ClassLoader.java:321)
>        at sun.misc.Launcher$AppClassLoader.loadClass(Launcher.java:294)
>        at java.lang.ClassLoader.loadClass(ClassLoader.java:266)
>        at java.lang.Class.forName0(Native Method)
>        at java.lang.Class.forName(Class.java:186)
> Caused by: java.io.FileNotFoundException: /usr/home/hudson/hudson-slave/workspace/Lucene-trunk/checkout/lucene/build/classes/test/org/apache/lucene/util/TestSortedVIntList.class
(Too many open files in system)
>        at java.io.FileInputStream.open(Native Method)
>        at java.io.FileInputStream.<init>(FileInputStream.java:137)
>        at sun.misc.URLClassPath$FileLoader$1.getInputStream(URLClassPath.java:1005)
>        at sun.misc.Resource.cachedInputStream(Resource.java:77)
>        at sun.misc.Resource.getByteBuffer(Resource.java:160)
>        at java.net.URLClassLoader.defineClass(URLClassLoader.java:266)
>        at java.net.URLClassLoader.access$000(URLClassLoader.java:73)
>        at java.net.URLClassLoader$1.run(URLClassLoader.java:212)
>
>
> FAILED:  <init>.org.apache.lucene.util.TestStringIntern
>
> Error Message:
> org.apache.lucene.util.TestStringIntern
>
> Stack Trace:
> java.lang.ClassNotFoundException: org.apache.lucene.util.TestStringIntern
>        at java.net.URLClassLoader$1.run(URLClassLoader.java:214)
>        at java.security.AccessController.doPrivileged(Native Method)
>        at java.net.URLClassLoader.findClass(URLClassLoader.java:205)
>        at java.lang.ClassLoader.loadClass(ClassLoader.java:321)
>        at sun.misc.Launcher$AppClassLoader.loadClass(Launcher.java:294)
>        at java.lang.ClassLoader.loadClass(ClassLoader.java:266)
>        at java.lang.Class.forName0(Native Method)
>        at java.lang.Class.forName(Class.java:186)
> Caused by: java.io.FileNotFoundException: /usr/home/hudson/hudson-slave/workspace/Lucene-trunk/checkout/lucene/build/classes/test/org/apache/lucene/util/TestStringIntern.class
(Too many open files in system)
>        at java.io.FileInputStream.open(Native Method)
>        at java.io.FileInputStream.<init>(FileInputStream.java:137)
>        at sun.misc.URLClassPath$FileLoader$1.getInputStream(URLClassPath.java:1005)
>        at sun.misc.Resource.cachedInputStream(Resource.java:77)
>        at sun.misc.Resource.getByteBuffer(Resource.java:160)
>        at java.net.URLClassLoader.defineClass(URLClassLoader.java:266)
>        at java.net.URLClassLoader.access$000(URLClassLoader.java:73)
>        at java.net.URLClassLoader$1.run(URLClassLoader.java:212)
>
>
> FAILED:  <init>.org.apache.lucene.util.TestUnicodeUtil
>
> Error Message:
> org.apache.lucene.util.TestUnicodeUtil
>
> Stack Trace:
> java.lang.ClassNotFoundException: org.apache.lucene.util.TestUnicodeUtil
>        at java.net.URLClassLoader$1.run(URLClassLoader.java:214)
>        at java.security.AccessController.doPrivileged(Native Method)
>        at java.net.URLClassLoader.findClass(URLClassLoader.java:205)
>        at java.lang.ClassLoader.loadClass(ClassLoader.java:321)
>        at sun.misc.Launcher$AppClassLoader.loadClass(Launcher.java:294)
>        at java.lang.ClassLoader.loadClass(ClassLoader.java:266)
>        at java.lang.Class.forName0(Native Method)
>        at java.lang.Class.forName(Class.java:186)
> Caused by: java.io.FileNotFoundException: /usr/home/hudson/hudson-slave/workspace/Lucene-trunk/checkout/lucene/build/classes/test/org/apache/lucene/util/TestUnicodeUtil.class
(Too many open files in system)
>        at java.io.FileInputStream.open(Native Method)
>        at java.io.FileInputStream.<init>(FileInputStream.java:137)
>        at sun.misc.URLClassPath$FileLoader$1.getInputStream(URLClassPath.java:1005)
>        at sun.misc.Resource.cachedInputStream(Resource.java:77)
>        at sun.misc.Resource.getByteBuffer(Resource.java:160)
>        at java.net.URLClassLoader.defineClass(URLClassLoader.java:266)
>        at java.net.URLClassLoader.access$000(URLClassLoader.java:73)
>        at java.net.URLClassLoader$1.run(URLClassLoader.java:212)
>
>
> FAILED:  <init>.org.apache.lucene.util.TestVersion
>
> Error Message:
> org.apache.lucene.util.TestVersion
>
> Stack Trace:
> java.lang.ClassNotFoundException: org.apache.lucene.util.TestVersion
>        at java.net.URLClassLoader$1.run(URLClassLoader.java:214)
>        at java.security.AccessController.doPrivileged(Native Method)
>        at java.net.URLClassLoader.findClass(URLClassLoader.java:205)
>        at java.lang.ClassLoader.loadClass(ClassLoader.java:321)
>        at sun.misc.Launcher$AppClassLoader.loadClass(Launcher.java:294)
>        at java.lang.ClassLoader.loadClass(ClassLoader.java:266)
>        at java.lang.Class.forName0(Native Method)
>        at java.lang.Class.forName(Class.java:186)
> Caused by: java.io.FileNotFoundException: /usr/home/hudson/hudson-slave/workspace/Lucene-trunk/checkout/lucene/build/classes/test/org/apache/lucene/util/TestVersion.class
(Too many open files in system)
>        at java.io.FileInputStream.open(Native Method)
>        at java.io.FileInputStream.<init>(FileInputStream.java:137)
>        at sun.misc.URLClassPath$FileLoader$1.getInputStream(URLClassPath.java:1005)
>        at sun.misc.Resource.cachedInputStream(Resource.java:77)
>        at sun.misc.Resource.getByteBuffer(Resource.java:160)
>        at java.net.URLClassLoader.defineClass(URLClassLoader.java:266)
>        at java.net.URLClassLoader.access$000(URLClassLoader.java:73)
>        at java.net.URLClassLoader$1.run(URLClassLoader.java:212)
>
>
> FAILED:  <init>.org.apache.lucene.util.TestVirtualMethod
>
> Error Message:
> org.apache.lucene.util.TestVirtualMethod
>
> Stack Trace:
> java.lang.ClassNotFoundException: org.apache.lucene.util.TestVirtualMethod
>        at java.net.URLClassLoader$1.run(URLClassLoader.java:214)
>        at java.security.AccessController.doPrivileged(Native Method)
>        at java.net.URLClassLoader.findClass(URLClassLoader.java:205)
>        at java.lang.ClassLoader.loadClass(ClassLoader.java:321)
>        at sun.misc.Launcher$AppClassLoader.loadClass(Launcher.java:294)
>        at java.lang.ClassLoader.loadClass(ClassLoader.java:266)
>        at java.lang.Class.forName0(Native Method)
>        at java.lang.Class.forName(Class.java:186)
> Caused by: java.io.FileNotFoundException: /usr/home/hudson/hudson-slave/workspace/Lucene-trunk/checkout/lucene/build/classes/test/org/apache/lucene/util/TestVirtualMethod.class
(Too many open files in system)
>        at java.io.FileInputStream.open(Native Method)
>        at java.io.FileInputStream.<init>(FileInputStream.java:137)
>        at sun.misc.URLClassPath$FileLoader$1.getInputStream(URLClassPath.java:1005)
>        at sun.misc.Resource.cachedInputStream(Resource.java:77)
>        at sun.misc.Resource.getByteBuffer(Resource.java:160)
>        at java.net.URLClassLoader.defineClass(URLClassLoader.java:266)
>        at java.net.URLClassLoader.access$000(URLClassLoader.java:73)
>        at java.net.URLClassLoader$1.run(URLClassLoader.java:212)
>
>
> FAILED:  <init>.org.apache.lucene.util.automaton.TestBasicOperations
>
> Error Message:
> org.apache.lucene.util.automaton.TestBasicOperations
>
> Stack Trace:
> java.lang.ClassNotFoundException: org.apache.lucene.util.automaton.TestBasicOperations
>        at java.net.URLClassLoader$1.run(URLClassLoader.java:214)
>        at java.security.AccessController.doPrivileged(Native Method)
>        at java.net.URLClassLoader.findClass(URLClassLoader.java:205)
>        at java.lang.ClassLoader.loadClass(ClassLoader.java:321)
>        at sun.misc.Launcher$AppClassLoader.loadClass(Launcher.java:294)
>        at java.lang.ClassLoader.loadClass(ClassLoader.java:266)
>        at java.lang.Class.forName0(Native Method)
>        at java.lang.Class.forName(Class.java:186)
> Caused by: java.io.FileNotFoundException: /usr/home/hudson/hudson-slave/workspace/Lucene-trunk/checkout/lucene/build/classes/test/org/apache/lucene/util/automaton/TestBasicOperations.class
(Too many open files in system)
>        at java.io.FileInputStream.open(Native Method)
>        at java.io.FileInputStream.<init>(FileInputStream.java:137)
>        at sun.misc.URLClassPath$FileLoader$1.getInputStream(URLClassPath.java:1005)
>        at sun.misc.Resource.cachedInputStream(Resource.java:77)
>        at sun.misc.Resource.getByteBuffer(Resource.java:160)
>        at java.net.URLClassLoader.defineClass(URLClassLoader.java:266)
>        at java.net.URLClassLoader.access$000(URLClassLoader.java:73)
>        at java.net.URLClassLoader$1.run(URLClassLoader.java:212)
>
>
> FAILED:  <init>.org.apache.lucene.util.automaton.TestDeterminism
>
> Error Message:
> org.apache.lucene.util.automaton.TestDeterminism
>
> Stack Trace:
> java.lang.ClassNotFoundException: org.apache.lucene.util.automaton.TestDeterminism
>        at java.net.URLClassLoader$1.run(URLClassLoader.java:214)
>        at java.security.AccessController.doPrivileged(Native Method)
>        at java.net.URLClassLoader.findClass(URLClassLoader.java:205)
>        at java.lang.ClassLoader.loadClass(ClassLoader.java:321)
>        at sun.misc.Launcher$AppClassLoader.loadClass(Launcher.java:294)
>        at java.lang.ClassLoader.loadClass(ClassLoader.java:266)
>        at java.lang.Class.forName0(Native Method)
>        at java.lang.Class.forName(Class.java:186)
> Caused by: java.io.FileNotFoundException: /usr/home/hudson/hudson-slave/workspace/Lucene-trunk/checkout/lucene/build/classes/test/org/apache/lucene/util/automaton/TestDeterminism.class
(Too many open files in system)
>        at java.io.FileInputStream.open(Native Method)
>        at java.io.FileInputStream.<init>(FileInputStream.java:137)
>        at sun.misc.URLClassPath$FileLoader$1.getInputStream(URLClassPath.java:1005)
>        at sun.misc.Resource.cachedInputStream(Resource.java:77)
>        at sun.misc.Resource.getByteBuffer(Resource.java:160)
>        at java.net.URLClassLoader.defineClass(URLClassLoader.java:266)
>        at java.net.URLClassLoader.access$000(URLClassLoader.java:73)
>        at java.net.URLClassLoader$1.run(URLClassLoader.java:212)
>
>
> FAILED:  <init>.org.apache.lucene.util.automaton.TestDeterminizeLexicon
>
> Error Message:
> org.apache.lucene.util.automaton.TestDeterminizeLexicon
>
> Stack Trace:
> java.lang.ClassNotFoundException: org.apache.lucene.util.automaton.TestDeterminizeLexicon
>        at java.net.URLClassLoader$1.run(URLClassLoader.java:214)
>        at java.security.AccessController.doPrivileged(Native Method)
>        at java.net.URLClassLoader.findClass(URLClassLoader.java:205)
>        at java.lang.ClassLoader.loadClass(ClassLoader.java:321)
>        at sun.misc.Launcher$AppClassLoader.loadClass(Launcher.java:294)
>        at java.lang.ClassLoader.loadClass(ClassLoader.java:266)
>        at java.lang.Class.forName0(Native Method)
>        at java.lang.Class.forName(Class.java:186)
> Caused by: java.io.FileNotFoundException: /usr/home/hudson/hudson-slave/workspace/Lucene-trunk/checkout/lucene/build/classes/test/org/apache/lucene/util/automaton/TestDeterminizeLexicon.class
(Too many open files in system)
>        at java.io.FileInputStream.open(Native Method)
>        at java.io.FileInputStream.<init>(FileInputStream.java:137)
>        at sun.misc.URLClassPath$FileLoader$1.getInputStream(URLClassPath.java:1005)
>        at sun.misc.Resource.cachedInputStream(Resource.java:77)
>        at sun.misc.Resource.getByteBuffer(Resource.java:160)
>        at java.net.URLClassLoader.defineClass(URLClassLoader.java:266)
>        at java.net.URLClassLoader.access$000(URLClassLoader.java:73)
>        at java.net.URLClassLoader$1.run(URLClassLoader.java:212)
>
>
> FAILED:  <init>.org.apache.lucene.util.automaton.TestLevenshteinAutomata
>
> Error Message:
> org.apache.lucene.util.automaton.TestLevenshteinAutomata
>
> Stack Trace:
> java.lang.ClassNotFoundException: org.apache.lucene.util.automaton.TestLevenshteinAutomata
>        at java.net.URLClassLoader$1.run(URLClassLoader.java:214)
>        at java.security.AccessController.doPrivileged(Native Method)
>        at java.net.URLClassLoader.findClass(URLClassLoader.java:205)
>        at java.lang.ClassLoader.loadClass(ClassLoader.java:321)
>        at sun.misc.Launcher$AppClassLoader.loadClass(Launcher.java:294)
>        at java.lang.ClassLoader.loadClass(ClassLoader.java:266)
>        at java.lang.Class.forName0(Native Method)
>        at java.lang.Class.forName(Class.java:186)
> Caused by: java.io.FileNotFoundException: /usr/home/hudson/hudson-slave/workspace/Lucene-trunk/checkout/lucene/build/classes/test/org/apache/lucene/util/automaton/TestLevenshteinAutomata.class
(Too many open files in system)
>        at java.io.FileInputStream.open(Native Method)
>        at java.io.FileInputStream.<init>(FileInputStream.java:137)
>        at sun.misc.URLClassPath$FileLoader$1.getInputStream(URLClassPath.java:1005)
>        at sun.misc.Resource.cachedInputStream(Resource.java:77)
>        at sun.misc.Resource.getByteBuffer(Resource.java:160)
>        at java.net.URLClassLoader.defineClass(URLClassLoader.java:266)
>        at java.net.URLClassLoader.access$000(URLClassLoader.java:73)
>        at java.net.URLClassLoader$1.run(URLClassLoader.java:212)
>
>
> FAILED:  <init>.org.apache.lucene.util.automaton.TestMinimize
>
> Error Message:
> org.apache.lucene.util.automaton.TestMinimize
>
> Stack Trace:
> java.lang.ClassNotFoundException: org.apache.lucene.util.automaton.TestMinimize
>        at java.net.URLClassLoader$1.run(URLClassLoader.java:214)
>        at java.security.AccessController.doPrivileged(Native Method)
>        at java.net.URLClassLoader.findClass(URLClassLoader.java:205)
>        at java.lang.ClassLoader.loadClass(ClassLoader.java:321)
>        at sun.misc.Launcher$AppClassLoader.loadClass(Launcher.java:294)
>        at java.lang.ClassLoader.loadClass(ClassLoader.java:266)
>        at java.lang.Class.forName0(Native Method)
>        at java.lang.Class.forName(Class.java:186)
> Caused by: java.io.FileNotFoundException: /usr/home/hudson/hudson-slave/workspace/Lucene-trunk/checkout/lucene/build/classes/test/org/apache/lucene/util/automaton/TestMinimize.class
(Too many open files in system)
>        at java.io.FileInputStream.open(Native Method)
>        at java.io.FileInputStream.<init>(FileInputStream.java:137)
>        at sun.misc.URLClassPath$FileLoader$1.getInputStream(URLClassPath.java:1005)
>        at sun.misc.Resource.cachedInputStream(Resource.java:77)
>        at sun.misc.Resource.getByteBuffer(Resource.java:160)
>        at java.net.URLClassLoader.defineClass(URLClassLoader.java:266)
>        at java.net.URLClassLoader.access$000(URLClassLoader.java:73)
>        at java.net.URLClassLoader$1.run(URLClassLoader.java:212)
>
>
> FAILED:  <init>.org.apache.lucene.util.automaton.TestUTF32ToUTF8
>
> Error Message:
> org.apache.lucene.util.automaton.TestUTF32ToUTF8
>
> Stack Trace:
> java.lang.ClassNotFoundException: org.apache.lucene.util.automaton.TestUTF32ToUTF8
>        at java.net.URLClassLoader$1.run(URLClassLoader.java:214)
>        at java.security.AccessController.doPrivileged(Native Method)
>        at java.net.URLClassLoader.findClass(URLClassLoader.java:205)
>        at java.lang.ClassLoader.loadClass(ClassLoader.java:321)
>        at sun.misc.Launcher$AppClassLoader.loadClass(Launcher.java:294)
>        at java.lang.ClassLoader.loadClass(ClassLoader.java:266)
>        at java.lang.Class.forName0(Native Method)
>        at java.lang.Class.forName(Class.java:186)
> Caused by: java.io.FileNotFoundException: /usr/home/hudson/hudson-slave/workspace/Lucene-trunk/checkout/lucene/build/classes/test/org/apache/lucene/util/automaton/TestUTF32ToUTF8.class
(Too many open files in system)
>        at java.io.FileInputStream.open(Native Method)
>        at java.io.FileInputStream.<init>(FileInputStream.java:137)
>        at sun.misc.URLClassPath$FileLoader$1.getInputStream(URLClassPath.java:1005)
>        at sun.misc.Resource.cachedInputStream(Resource.java:77)
>        at sun.misc.Resource.getByteBuffer(Resource.java:160)
>        at java.net.URLClassLoader.defineClass(URLClassLoader.java:266)
>        at java.net.URLClassLoader.access$000(URLClassLoader.java:73)
>        at java.net.URLClassLoader$1.run(URLClassLoader.java:212)
>
>
> FAILED:  <init>.org.apache.lucene.util.automaton.fst.TestFSTs
>
> Error Message:
> org.apache.lucene.util.automaton.fst.TestFSTs
>
> Stack Trace:
> java.lang.ClassNotFoundException: org.apache.lucene.util.automaton.fst.TestFSTs
>        at java.net.URLClassLoader$1.run(URLClassLoader.java:214)
>        at java.security.AccessController.doPrivileged(Native Method)
>        at java.net.URLClassLoader.findClass(URLClassLoader.java:205)
>        at java.lang.ClassLoader.loadClass(ClassLoader.java:321)
>        at sun.misc.Launcher$AppClassLoader.loadClass(Launcher.java:294)
>        at java.lang.ClassLoader.loadClass(ClassLoader.java:266)
>        at java.lang.Class.forName0(Native Method)
>        at java.lang.Class.forName(Class.java:186)
> Caused by: java.io.FileNotFoundException: /usr/home/hudson/hudson-slave/workspace/Lucene-trunk/checkout/lucene/build/classes/test/org/apache/lucene/util/automaton/fst/TestFSTs.class
(Too many open files in system)
>        at java.io.FileInputStream.open(Native Method)
>        at java.io.FileInputStream.<init>(FileInputStream.java:137)
>        at sun.misc.URLClassPath$FileLoader$1.getInputStream(URLClassPath.java:1005)
>        at sun.misc.Resource.cachedInputStream(Resource.java:77)
>        at sun.misc.Resource.getByteBuffer(Resource.java:160)
>        at java.net.URLClassLoader.defineClass(URLClassLoader.java:266)
>        at java.net.URLClassLoader.access$000(URLClassLoader.java:73)
>        at java.net.URLClassLoader$1.run(URLClassLoader.java:212)
>
>
> FAILED:  <init>.org.apache.lucene.util.packed.TestPackedInts
>
> Error Message:
> org.apache.lucene.util.packed.TestPackedInts
>
> Stack Trace:
> java.lang.ClassNotFoundException: org.apache.lucene.util.packed.TestPackedInts
>        at java.net.URLClassLoader$1.run(URLClassLoader.java:214)
>        at java.security.AccessController.doPrivileged(Native Method)
>        at java.net.URLClassLoader.findClass(URLClassLoader.java:205)
>        at java.lang.ClassLoader.loadClass(ClassLoader.java:321)
>        at sun.misc.Launcher$AppClassLoader.loadClass(Launcher.java:294)
>        at java.lang.ClassLoader.loadClass(ClassLoader.java:266)
>        at java.lang.Class.forName0(Native Method)
>        at java.lang.Class.forName(Class.java:186)
> Caused by: java.io.FileNotFoundException: /usr/home/hudson/hudson-slave/workspace/Lucene-trunk/checkout/lucene/build/classes/test/org/apache/lucene/util/packed/TestPackedInts.class
(Too many open files in system)
>        at java.io.FileInputStream.open(Native Method)
>        at java.io.FileInputStream.<init>(FileInputStream.java:137)
>        at sun.misc.URLClassPath$FileLoader$1.getInputStream(URLClassPath.java:1005)
>        at sun.misc.Resource.cachedInputStream(Resource.java:77)
>        at sun.misc.Resource.getByteBuffer(Resource.java:160)
>        at java.net.URLClassLoader.defineClass(URLClassLoader.java:266)
>        at java.net.URLClassLoader.access$000(URLClassLoader.java:73)
>        at java.net.URLClassLoader$1.run(URLClassLoader.java:212)
>
>
>
>
> Build Log (for compile errors):
> [...truncated 10014 lines...]
>
>
>
> ---------------------------------------------------------------------
> To unsubscribe, e-mail: dev-unsubscribe@lucene.apache.org
> For additional commands, e-mail: dev-help@lucene.apache.org
>
>

---------------------------------------------------------------------
To unsubscribe, e-mail: dev-unsubscribe@lucene.apache.org
For additional commands, e-mail: dev-help@lucene.apache.org


Mime
View raw message