lucene-dev mailing list archives

Site index · List index
Message view « Date » · « Thread »
Top « Date » · « Thread »
From Apache Hudson Server <hud...@hudson.apache.org>
Subject [HUDSON] Lucene-Solr-tests-only-trunk - Build # 4694 - Failure
Date Thu, 10 Feb 2011 00:12:23 GMT
Build: https://hudson.apache.org/hudson/job/Lucene-Solr-tests-only-trunk/4694/

45 tests failed.
FAILED:  org.apache.lucene.util.packed.TestPackedInts.testBQ22

Error Message:
Forked Java VM exited abnormally. Please note the time in the report does not reflect the time until the VM exit.

Stack Trace:
junit.framework.AssertionFailedError: Forked Java VM exited abnormally. Please note the time in the report does not reflect the time until the VM exit.
	at java.lang.Thread.run(Thread.java:636)


REGRESSION:  org.apache.lucene.index.TestIndexReaderReopen.testThreadSafety

Error Message:
Error occurred in thread Thread-44: /usr/home/hudson/hudson-slave/workspace/Lucene-Solr-tests-only-trunk/checkout/lucene/build/test/4/test6553334448781393139tmp/_e_4.skp (Too many open files in system)

Stack Trace:
junit.framework.AssertionFailedError: Error occurred in thread Thread-44:
/usr/home/hudson/hudson-slave/workspace/Lucene-Solr-tests-only-trunk/checkout/lucene/build/test/4/test6553334448781393139tmp/_e_4.skp (Too many open files in system)
	at org.apache.lucene.util.LuceneTestCase$LuceneTestCaseRunner.runChild(LuceneTestCase.java:1183)
	at org.apache.lucene.util.LuceneTestCase$LuceneTestCaseRunner.runChild(LuceneTestCase.java:1115)
/usr/home/hudson/hudson-slave/workspace/Lucene-Solr-tests-only-trunk/checkout/lucene/build/test/4/test6553334448781393139tmp/_e_4.skp (Too many open files in system)
	at org.apache.lucene.index.TestIndexReaderReopen.testThreadSafety(TestIndexReaderReopen.java:833)


REGRESSION:  org.apache.lucene.index.TestIndexWriterDelete.testNonRAMDelete

Error Message:
/usr/home/hudson/hudson-slave/workspace/Lucene-Solr-tests-only-trunk/checkout/lucene/build/test/5/test7105883153426957006tmp/_0.tvd (Too many open files in system)

Stack Trace:
java.io.FileNotFoundException: /usr/home/hudson/hudson-slave/workspace/Lucene-Solr-tests-only-trunk/checkout/lucene/build/test/5/test7105883153426957006tmp/_0.tvd (Too many open files in system)
	at java.io.RandomAccessFile.open(Native Method)
	at java.io.RandomAccessFile.<init>(RandomAccessFile.java:233)
	at org.apache.lucene.store.FSDirectory$FSIndexOutput.<init>(FSDirectory.java:448)
	at org.apache.lucene.store.FSDirectory.createOutput(FSDirectory.java:312)
	at org.apache.lucene.store.MockDirectoryWrapper.createOutput(MockDirectoryWrapper.java:335)
	at org.apache.lucene.index.TermVectorsTermsWriter.initTermVectorsWriter(TermVectorsTermsWriter.java:124)
	at org.apache.lucene.index.TermVectorsTermsWriter.finishDocument(TermVectorsTermsWriter.java:139)
	at org.apache.lucene.index.TermVectorsTermsWriter$PerDoc.finish(TermVectorsTermsWriter.java:240)
	at org.apache.lucene.index.DocFieldProcessorPerThread$PerDoc.finish(DocFieldProcessorPerThread.java:318)
	at org.apache.lucene.index.DocumentsWriter$WaitQueue.writeDocument(DocumentsWriter.java:1138)
	at org.apache.lucene.index.DocumentsWriter$WaitQueue.add(DocumentsWriter.java:1158)
	at org.apache.lucene.index.DocumentsWriter.finishDocument(DocumentsWriter.java:908)
	at org.apache.lucene.index.DocumentsWriter.updateDocument(DocumentsWriter.java:797)
	at org.apache.lucene.index.IndexWriter.addDocument(IndexWriter.java:1253)
	at org.apache.lucene.index.IndexWriter.addDocument(IndexWriter.java:1229)
	at org.apache.lucene.index.TestIndexWriterDelete.addDoc(TestIndexWriterDelete.java:394)
	at org.apache.lucene.index.TestIndexWriterDelete.testNonRAMDelete(TestIndexWriterDelete.java:89)
	at org.apache.lucene.util.LuceneTestCase$LuceneTestCaseRunner.runChild(LuceneTestCase.java:1183)
	at org.apache.lucene.util.LuceneTestCase$LuceneTestCaseRunner.runChild(LuceneTestCase.java:1115)


REGRESSION:  org.apache.lucene.index.TestNRTThreads.testNRTThreads

Error Message:
org/apache/lucene/util/LuceneTestCase$TwoLongs

Stack Trace:
java.lang.NoClassDefFoundError: org/apache/lucene/util/LuceneTestCase$TwoLongs
	at org.apache.lucene.util.LuceneTestCase.reportAdditionalFailureInfo(LuceneTestCase.java:1080)
	at org.apache.lucene.util.LuceneTestCase$1.failed(LuceneTestCase.java:435)
	at org.apache.lucene.util.LuceneTestCase$LuceneTestCaseRunner.runChild(LuceneTestCase.java:1183)
	at org.apache.lucene.util.LuceneTestCase$LuceneTestCaseRunner.runChild(LuceneTestCase.java:1115)
Caused by: java.lang.ClassNotFoundException: org.apache.lucene.util.LuceneTestCase$TwoLongs
	at java.net.URLClassLoader$1.run(URLClassLoader.java:214)
	at java.security.AccessController.doPrivileged(Native Method)
	at java.net.URLClassLoader.findClass(URLClassLoader.java:205)
	at java.lang.ClassLoader.loadClass(ClassLoader.java:321)
	at sun.misc.Launcher$AppClassLoader.loadClass(Launcher.java:294)
	at java.lang.ClassLoader.loadClass(ClassLoader.java:266)
Caused by: java.io.FileNotFoundException: /usr/home/hudson/hudson-slave/workspace/Lucene-Solr-tests-only-trunk/checkout/lucene/build/classes/test-framework/org/apache/lucene/util/LuceneTestCase$TwoLongs.class (Too many open files in system)
	at java.io.FileInputStream.open(Native Method)
	at java.io.FileInputStream.<init>(FileInputStream.java:137)
	at sun.misc.URLClassPath$FileLoader$1.getInputStream(URLClassPath.java:1005)
	at sun.misc.Resource.cachedInputStream(Resource.java:77)
	at sun.misc.Resource.getByteBuffer(Resource.java:160)
	at java.net.URLClassLoader.defineClass(URLClassLoader.java:266)
	at java.net.URLClassLoader.access$000(URLClassLoader.java:73)
	at java.net.URLClassLoader$1.run(URLClassLoader.java:212)


REGRESSION:  org.apache.lucene.index.TestOmitNorms.testOmitNormsCombos

Error Message:
MockDirectoryWrapper: cannot close: there are still open files: {_0.fdx=1}

Stack Trace:
java.lang.RuntimeException: MockDirectoryWrapper: cannot close: there are still open files: {_0.fdx=1}
	at org.apache.lucene.store.MockDirectoryWrapper.close(MockDirectoryWrapper.java:407)
	at org.apache.lucene.index.TestOmitNorms.getNorms(TestOmitNorms.java:300)
	at org.apache.lucene.index.TestOmitNorms.testOmitNormsCombos(TestOmitNorms.java:248)
	at org.apache.lucene.util.LuceneTestCase$LuceneTestCaseRunner.runChild(LuceneTestCase.java:1183)
	at org.apache.lucene.util.LuceneTestCase$LuceneTestCaseRunner.runChild(LuceneTestCase.java:1115)


REGRESSION:  org.apache.lucene.index.TestPerFieldCodecSupport.testStressPerFieldCodec

Error Message:
background merge hit exception: _0(4.0):Cv94 _1(4.0):Cv3 _2(4.0):Cv97 _3(4.0):Cv97 _4(4.0):Cv97 _5(4.0):Cv97 into _6 [optimize]

Stack Trace:
java.io.IOException: background merge hit exception: _0(4.0):Cv94 _1(4.0):Cv3 _2(4.0):Cv97 _3(4.0):Cv97 _4(4.0):Cv97 _5(4.0):Cv97 into _6 [optimize]
	at org.apache.lucene.index.IndexWriter.optimize(IndexWriter.java:1624)
	at org.apache.lucene.index.IndexWriter.optimize(IndexWriter.java:1563)
	at org.apache.lucene.index.IndexWriter.optimize(IndexWriter.java:1533)
	at org.apache.lucene.index.TestPerFieldCodecSupport.testStressPerFieldCodec(TestPerFieldCodecSupport.java:306)
	at org.apache.lucene.util.LuceneTestCase$LuceneTestCaseRunner.runChild(LuceneTestCase.java:1183)
	at org.apache.lucene.util.LuceneTestCase$LuceneTestCaseRunner.runChild(LuceneTestCase.java:1115)
Caused by: java.io.FileNotFoundException: /usr/home/hudson/hudson-slave/workspace/Lucene-Solr-tests-only-trunk/checkout/lucene/build/test/6/test7903198171475999679tmp/_6_2.tii (Too many open files in system)
	at java.io.RandomAccessFile.open(Native Method)
	at java.io.RandomAccessFile.<init>(RandomAccessFile.java:233)
	at org.apache.lucene.store.FSDirectory$FSIndexOutput.<init>(FSDirectory.java:448)
	at org.apache.lucene.store.FSDirectory.createOutput(FSDirectory.java:312)
	at org.apache.lucene.store.MockDirectoryWrapper.createOutput(MockDirectoryWrapper.java:335)
	at org.apache.lucene.index.codecs.FixedGapTermsIndexWriter.<init>(FixedGapTermsIndexWriter.java:60)
	at org.apache.lucene.index.codecs.pulsing.PulsingCodec.fieldsConsumer(PulsingCodec.java:81)
	at org.apache.lucene.index.PerFieldCodecWrapper$FieldsWriter.<init>(PerFieldCodecWrapper.java:64)
	at org.apache.lucene.index.PerFieldCodecWrapper.fieldsConsumer(PerFieldCodecWrapper.java:54)
	at org.apache.lucene.index.SegmentMerger.mergeTerms(SegmentMerger.java:547)
	at org.apache.lucene.index.SegmentMerger.merge(SegmentMerger.java:120)
	at org.apache.lucene.index.IndexWriter.mergeMiddle(IndexWriter.java:3156)
	at org.apache.lucene.index.IndexWriter.merge(IndexWriter.java:2830)
	at org.apache.lucene.index.ConcurrentMergeScheduler.doMerge(ConcurrentMergeScheduler.java:379)
	at org.apache.lucene.index.ConcurrentMergeScheduler$MergeThread.run(ConcurrentMergeScheduler.java:447)


REGRESSION:  org.apache.lucene.index.TestPersistentSnapshotDeletionPolicy.testSnapshotDeletionPolicy

Error Message:
org/apache/lucene/index/TestIndexWriter

Stack Trace:
java.lang.NoClassDefFoundError: org/apache/lucene/index/TestIndexWriter
	at org.apache.lucene.index.TestSnapshotDeletionPolicy.runTest(TestSnapshotDeletionPolicy.java:164)
	at org.apache.lucene.index.TestSnapshotDeletionPolicy.testSnapshotDeletionPolicy(TestSnapshotDeletionPolicy.java:99)
	at org.apache.lucene.util.LuceneTestCase$LuceneTestCaseRunner.runChild(LuceneTestCase.java:1183)
	at org.apache.lucene.util.LuceneTestCase$LuceneTestCaseRunner.runChild(LuceneTestCase.java:1115)
Caused by: java.lang.ClassNotFoundException: org.apache.lucene.index.TestIndexWriter
	at java.net.URLClassLoader$1.run(URLClassLoader.java:214)
	at java.security.AccessController.doPrivileged(Native Method)
	at java.net.URLClassLoader.findClass(URLClassLoader.java:205)
	at java.lang.ClassLoader.loadClass(ClassLoader.java:321)
	at sun.misc.Launcher$AppClassLoader.loadClass(Launcher.java:294)
	at java.lang.ClassLoader.loadClass(ClassLoader.java:266)
Caused by: java.io.FileNotFoundException: /usr/home/hudson/hudson-slave/workspace/Lucene-Solr-tests-only-trunk/checkout/lucene/build/classes/test/org/apache/lucene/index/TestIndexWriter.class (Too many open files in system)
	at java.io.FileInputStream.open(Native Method)
	at java.io.FileInputStream.<init>(FileInputStream.java:137)
	at sun.misc.URLClassPath$FileLoader$1.getInputStream(URLClassPath.java:1005)
	at sun.misc.Resource.cachedInputStream(Resource.java:77)
	at sun.misc.Resource.getByteBuffer(Resource.java:160)
	at java.net.URLClassLoader.defineClass(URLClassLoader.java:266)
	at java.net.URLClassLoader.access$000(URLClassLoader.java:73)
	at java.net.URLClassLoader$1.run(URLClassLoader.java:212)


REGRESSION:  org.apache.lucene.index.TestPersistentSnapshotDeletionPolicy.testMultiThreadedSnapshotting

Error Message:
java.io.IOException: Too many open files in system

Stack Trace:
java.lang.RuntimeException: java.io.IOException: Too many open files in system
	at org.apache.lucene.util.LuceneTestCase.newDirectoryImpl(LuceneTestCase.java:1028)
	at org.apache.lucene.util.LuceneTestCase.newDirectory(LuceneTestCase.java:839)
	at org.apache.lucene.util.LuceneTestCase.newDirectory(LuceneTestCase.java:835)
	at org.apache.lucene.index.TestPersistentSnapshotDeletionPolicy.setUp(TestPersistentSnapshotDeletionPolicy.java:40)
	at org.apache.lucene.util.LuceneTestCase$LuceneTestCaseRunner.runChild(LuceneTestCase.java:1183)
	at org.apache.lucene.util.LuceneTestCase$LuceneTestCaseRunner.runChild(LuceneTestCase.java:1115)
Caused by: java.io.IOException: Too many open files in system
	at java.io.UnixFileSystem.createFileExclusively(Native Method)
	at java.io.File.checkAndCreate(File.java:1716)
	at java.io.File.createTempFile(File.java:1804)
	at org.apache.lucene.util.LuceneTestCase.newDirectoryImpl(LuceneTestCase.java:1019)


FAILED:  <init>.org.apache.lucene.index.TestTransactionRollback

Error Message:
org.apache.lucene.index.TestTransactionRollback

Stack Trace:
java.lang.ClassNotFoundException: org.apache.lucene.index.TestTransactionRollback
	at java.net.URLClassLoader$1.run(URLClassLoader.java:214)
	at java.security.AccessController.doPrivileged(Native Method)
	at java.net.URLClassLoader.findClass(URLClassLoader.java:205)
	at java.lang.ClassLoader.loadClass(ClassLoader.java:321)
	at sun.misc.Launcher$AppClassLoader.loadClass(Launcher.java:294)
	at java.lang.ClassLoader.loadClass(ClassLoader.java:266)
	at java.lang.Class.forName0(Native Method)
	at java.lang.Class.forName(Class.java:186)
Caused by: java.io.FileNotFoundException: /usr/home/hudson/hudson-slave/workspace/Lucene-Solr-tests-only-trunk/checkout/lucene/build/classes/test/org/apache/lucene/index/TestTransactionRollback.class (Too many open files in system)
	at java.io.FileInputStream.open(Native Method)
	at java.io.FileInputStream.<init>(FileInputStream.java:137)
	at sun.misc.URLClassPath$FileLoader$1.getInputStream(URLClassPath.java:1005)
	at sun.misc.Resource.cachedInputStream(Resource.java:77)
	at sun.misc.Resource.getByteBuffer(Resource.java:160)
	at java.net.URLClassLoader.defineClass(URLClassLoader.java:266)
	at java.net.URLClassLoader.access$000(URLClassLoader.java:73)
	at java.net.URLClassLoader$1.run(URLClassLoader.java:212)


FAILED:  <init>.org.apache.lucene.messages.TestNLS

Error Message:
org.apache.lucene.messages.TestNLS

Stack Trace:
java.lang.ClassNotFoundException: org.apache.lucene.messages.TestNLS
	at java.net.URLClassLoader$1.run(URLClassLoader.java:214)
	at java.security.AccessController.doPrivileged(Native Method)
	at java.net.URLClassLoader.findClass(URLClassLoader.java:205)
	at java.lang.ClassLoader.loadClass(ClassLoader.java:321)
	at sun.misc.Launcher$AppClassLoader.loadClass(Launcher.java:294)
	at java.lang.ClassLoader.loadClass(ClassLoader.java:266)
	at java.lang.Class.forName0(Native Method)
	at java.lang.Class.forName(Class.java:186)
Caused by: java.io.FileNotFoundException: /usr/home/hudson/hudson-slave/workspace/Lucene-Solr-tests-only-trunk/checkout/lucene/build/classes/test/org/apache/lucene/messages/TestNLS.class (Too many open files in system)
	at java.io.FileInputStream.open(Native Method)
	at java.io.FileInputStream.<init>(FileInputStream.java:137)
	at sun.misc.URLClassPath$FileLoader$1.getInputStream(URLClassPath.java:1005)
	at sun.misc.Resource.cachedInputStream(Resource.java:77)
	at sun.misc.Resource.getByteBuffer(Resource.java:160)
	at java.net.URLClassLoader.defineClass(URLClassLoader.java:266)
	at java.net.URLClassLoader.access$000(URLClassLoader.java:73)
	at java.net.URLClassLoader$1.run(URLClassLoader.java:212)


REGRESSION:  org.apache.lucene.search.TestComplexExplanations.testDMQ10

Error Message:
/usr/home/hudson/hudson-slave/workspace/Lucene-Solr-tests-only-trunk/checkout/lucene/build/test/8/test6650750416955297052tmp/_0.tvf (Too many open files in system)

Stack Trace:
java.io.FileNotFoundException: /usr/home/hudson/hudson-slave/workspace/Lucene-Solr-tests-only-trunk/checkout/lucene/build/test/8/test6650750416955297052tmp/_0.tvf (Too many open files in system)
	at java.io.RandomAccessFile.open(Native Method)
	at java.io.RandomAccessFile.<init>(RandomAccessFile.java:233)
	at org.apache.lucene.store.FSDirectory$FSIndexOutput.<init>(FSDirectory.java:448)
	at org.apache.lucene.store.FSDirectory.createOutput(FSDirectory.java:312)
	at org.apache.lucene.store.MockDirectoryWrapper.createOutput(MockDirectoryWrapper.java:335)
	at org.apache.lucene.index.TermVectorsTermsWriter.initTermVectorsWriter(TermVectorsTermsWriter.java:125)
	at org.apache.lucene.index.TermVectorsTermsWriter.finishDocument(TermVectorsTermsWriter.java:139)
	at org.apache.lucene.index.TermVectorsTermsWriter$PerDoc.finish(TermVectorsTermsWriter.java:240)
	at org.apache.lucene.index.DocFieldProcessorPerThread$PerDoc.finish(DocFieldProcessorPerThread.java:318)
	at org.apache.lucene.index.DocumentsWriter$WaitQueue.writeDocument(DocumentsWriter.java:1138)
	at org.apache.lucene.index.DocumentsWriter$WaitQueue.add(DocumentsWriter.java:1158)
	at org.apache.lucene.index.DocumentsWriter.finishDocument(DocumentsWriter.java:908)
	at org.apache.lucene.index.DocumentsWriter.updateDocument(DocumentsWriter.java:797)
	at org.apache.lucene.index.IndexWriter.addDocument(IndexWriter.java:1253)
	at org.apache.lucene.index.IndexWriter.addDocument(IndexWriter.java:1229)
	at org.apache.lucene.index.RandomIndexWriter.addDocument(RandomIndexWriter.java:95)
	at org.apache.lucene.search.TestExplanations.setUp(TestExplanations.java:76)
	at org.apache.lucene.search.TestComplexExplanations.setUp(TestComplexExplanations.java:36)
	at org.apache.lucene.util.LuceneTestCase$LuceneTestCaseRunner.runChild(LuceneTestCase.java:1183)
	at org.apache.lucene.util.LuceneTestCase$LuceneTestCaseRunner.runChild(LuceneTestCase.java:1115)


REGRESSION:  org.apache.lucene.search.TestComplexExplanations.testBQ13

Error Message:
/usr/home/hudson/hudson-slave/workspace/Lucene-Solr-tests-only-trunk/checkout/lucene/build/test/8/test3287829681523185304tmp/_0.tvd (Too many open files in system)

Stack Trace:
java.io.FileNotFoundException: /usr/home/hudson/hudson-slave/workspace/Lucene-Solr-tests-only-trunk/checkout/lucene/build/test/8/test3287829681523185304tmp/_0.tvd (Too many open files in system)
	at java.io.RandomAccessFile.open(Native Method)
	at java.io.RandomAccessFile.<init>(RandomAccessFile.java:233)
	at org.apache.lucene.store.FSDirectory$FSIndexOutput.<init>(FSDirectory.java:448)
	at org.apache.lucene.store.FSDirectory.createOutput(FSDirectory.java:312)
	at org.apache.lucene.store.MockDirectoryWrapper.createOutput(MockDirectoryWrapper.java:335)
	at org.apache.lucene.index.TermVectorsTermsWriter.initTermVectorsWriter(TermVectorsTermsWriter.java:124)
	at org.apache.lucene.index.TermVectorsTermsWriter.finishDocument(TermVectorsTermsWriter.java:139)
	at org.apache.lucene.index.TermVectorsTermsWriter$PerDoc.finish(TermVectorsTermsWriter.java:240)
	at org.apache.lucene.index.DocFieldProcessorPerThread$PerDoc.finish(DocFieldProcessorPerThread.java:318)
	at org.apache.lucene.index.DocumentsWriter$WaitQueue.writeDocument(DocumentsWriter.java:1138)
	at org.apache.lucene.index.DocumentsWriter$WaitQueue.add(DocumentsWriter.java:1158)
	at org.apache.lucene.index.DocumentsWriter.finishDocument(DocumentsWriter.java:908)
	at org.apache.lucene.index.DocumentsWriter.updateDocument(DocumentsWriter.java:797)
	at org.apache.lucene.index.IndexWriter.addDocument(IndexWriter.java:1253)
	at org.apache.lucene.index.IndexWriter.addDocument(IndexWriter.java:1229)
	at org.apache.lucene.index.RandomIndexWriter.addDocument(RandomIndexWriter.java:95)
	at org.apache.lucene.search.TestExplanations.setUp(TestExplanations.java:76)
	at org.apache.lucene.search.TestComplexExplanations.setUp(TestComplexExplanations.java:36)
	at org.apache.lucene.util.LuceneTestCase$LuceneTestCaseRunner.runChild(LuceneTestCase.java:1183)
	at org.apache.lucene.util.LuceneTestCase$LuceneTestCaseRunner.runChild(LuceneTestCase.java:1115)


REGRESSION:  org.apache.lucene.search.TestComplexExplanations.testST6

Error Message:
java.io.IOException: Too many open files in system

Stack Trace:
java.lang.RuntimeException: java.io.IOException: Too many open files in system
	at org.apache.lucene.util.LuceneTestCase.newDirectoryImpl(LuceneTestCase.java:1028)
	at org.apache.lucene.util.LuceneTestCase.newDirectory(LuceneTestCase.java:839)
	at org.apache.lucene.util.LuceneTestCase.newDirectory(LuceneTestCase.java:835)
	at org.apache.lucene.search.TestExplanations.setUp(TestExplanations.java:70)
	at org.apache.lucene.search.TestComplexExplanations.setUp(TestComplexExplanations.java:36)
	at org.apache.lucene.util.LuceneTestCase$LuceneTestCaseRunner.runChild(LuceneTestCase.java:1183)
	at org.apache.lucene.util.LuceneTestCase$LuceneTestCaseRunner.runChild(LuceneTestCase.java:1115)
Caused by: java.io.IOException: Too many open files in system
	at java.io.UnixFileSystem.createFileExclusively(Native Method)
	at java.io.File.checkAndCreate(File.java:1716)
	at java.io.File.createTempFile(File.java:1804)
	at org.apache.lucene.util.LuceneTestCase.newDirectoryImpl(LuceneTestCase.java:1019)


REGRESSION:  org.apache.lucene.search.TestComplexExplanations.testSNot3

Error Message:
org/apache/lucene/util/LuceneTestCase$TwoLongs

Stack Trace:
java.lang.NoClassDefFoundError: org/apache/lucene/util/LuceneTestCase$TwoLongs
	at org.apache.lucene.util.LuceneTestCase.reportAdditionalFailureInfo(LuceneTestCase.java:1080)
	at org.apache.lucene.util.LuceneTestCase$1.failed(LuceneTestCase.java:435)
	at org.apache.lucene.util.LuceneTestCase$LuceneTestCaseRunner.runChild(LuceneTestCase.java:1183)
	at org.apache.lucene.util.LuceneTestCase$LuceneTestCaseRunner.runChild(LuceneTestCase.java:1115)
Caused by: java.lang.ClassNotFoundException: org.apache.lucene.util.LuceneTestCase$TwoLongs
	at java.net.URLClassLoader$1.run(URLClassLoader.java:214)
	at java.security.AccessController.doPrivileged(Native Method)
	at java.net.URLClassLoader.findClass(URLClassLoader.java:205)
	at java.lang.ClassLoader.loadClass(ClassLoader.java:321)
	at sun.misc.Launcher$AppClassLoader.loadClass(Launcher.java:294)
	at java.lang.ClassLoader.loadClass(ClassLoader.java:266)
Caused by: java.io.FileNotFoundException: /usr/home/hudson/hudson-slave/workspace/Lucene-Solr-tests-only-trunk/checkout/lucene/build/classes/test-framework/org/apache/lucene/util/LuceneTestCase$TwoLongs.class (Too many open files in system)
	at java.io.FileInputStream.open(Native Method)
	at java.io.FileInputStream.<init>(FileInputStream.java:137)
	at sun.misc.URLClassPath$FileLoader$1.getInputStream(URLClassPath.java:1005)
	at sun.misc.Resource.cachedInputStream(Resource.java:77)
	at sun.misc.Resource.getByteBuffer(Resource.java:160)
	at java.net.URLClassLoader.defineClass(URLClassLoader.java:266)
	at java.net.URLClassLoader.access$000(URLClassLoader.java:73)
	at java.net.URLClassLoader$1.run(URLClassLoader.java:212)


REGRESSION:  org.apache.lucene.search.TestComplexExplanations.testSNot6

Error Message:
org/apache/lucene/util/LuceneTestCase$TwoLongs

Stack Trace:
java.lang.NoClassDefFoundError: org/apache/lucene/util/LuceneTestCase$TwoLongs
	at org.apache.lucene.util.LuceneTestCase.reportAdditionalFailureInfo(LuceneTestCase.java:1080)
	at org.apache.lucene.util.LuceneTestCase$1.failed(LuceneTestCase.java:435)
	at org.apache.lucene.util.LuceneTestCase$LuceneTestCaseRunner.runChild(LuceneTestCase.java:1183)
	at org.apache.lucene.util.LuceneTestCase$LuceneTestCaseRunner.runChild(LuceneTestCase.java:1115)


REGRESSION:  org.apache.lucene.search.TestComplexExplanations.testSNot8

Error Message:
org/apache/lucene/util/LuceneTestCase$TwoLongs

Stack Trace:
java.lang.NoClassDefFoundError: org/apache/lucene/util/LuceneTestCase$TwoLongs
	at org.apache.lucene.util.LuceneTestCase.reportAdditionalFailureInfo(LuceneTestCase.java:1080)
	at org.apache.lucene.util.LuceneTestCase$1.failed(LuceneTestCase.java:435)
	at org.apache.lucene.util.LuceneTestCase$LuceneTestCaseRunner.runChild(LuceneTestCase.java:1183)
	at org.apache.lucene.util.LuceneTestCase$LuceneTestCaseRunner.runChild(LuceneTestCase.java:1115)


REGRESSION:  org.apache.lucene.search.TestComplexExplanations.testSNot9

Error Message:
org/apache/lucene/util/LuceneTestCase$TwoLongs

Stack Trace:
java.lang.NoClassDefFoundError: org/apache/lucene/util/LuceneTestCase$TwoLongs
	at org.apache.lucene.util.LuceneTestCase.reportAdditionalFailureInfo(LuceneTestCase.java:1080)
	at org.apache.lucene.util.LuceneTestCase$1.failed(LuceneTestCase.java:435)
	at org.apache.lucene.util.LuceneTestCase$LuceneTestCaseRunner.runChild(LuceneTestCase.java:1183)
	at org.apache.lucene.util.LuceneTestCase$LuceneTestCaseRunner.runChild(LuceneTestCase.java:1115)


REGRESSION:  org.apache.lucene.search.TestComplexExplanations.testNoop

Error Message:
java.io.IOException: Too many open files in system

Stack Trace:
java.lang.RuntimeException: java.io.IOException: Too many open files in system
	at org.apache.lucene.util.LuceneTestCase.newDirectoryImpl(LuceneTestCase.java:1028)
	at org.apache.lucene.util.LuceneTestCase.newDirectory(LuceneTestCase.java:839)
	at org.apache.lucene.util.LuceneTestCase.newDirectory(LuceneTestCase.java:835)
	at org.apache.lucene.search.TestExplanations.setUp(TestExplanations.java:70)
	at org.apache.lucene.search.TestComplexExplanations.setUp(TestComplexExplanations.java:36)
	at org.apache.lucene.util.LuceneTestCase$LuceneTestCaseRunner.runChild(LuceneTestCase.java:1183)
	at org.apache.lucene.util.LuceneTestCase$LuceneTestCaseRunner.runChild(LuceneTestCase.java:1115)
Caused by: java.io.IOException: Too many open files in system
	at java.io.UnixFileSystem.createFileExclusively(Native Method)
	at java.io.File.checkAndCreate(File.java:1716)
	at java.io.File.createTempFile(File.java:1804)
	at org.apache.lucene.util.LuceneTestCase.newDirectoryImpl(LuceneTestCase.java:1019)


FAILED:  <init>.org.apache.lucene.search.TestDocBoost

Error Message:
org.apache.lucene.search.TestDocBoost

Stack Trace:
java.lang.ClassNotFoundException: org.apache.lucene.search.TestDocBoost
	at java.net.URLClassLoader$1.run(URLClassLoader.java:214)
	at java.security.AccessController.doPrivileged(Native Method)
	at java.net.URLClassLoader.findClass(URLClassLoader.java:205)
	at java.lang.ClassLoader.loadClass(ClassLoader.java:321)
	at sun.misc.Launcher$AppClassLoader.loadClass(Launcher.java:294)
	at java.lang.ClassLoader.loadClass(ClassLoader.java:266)
	at java.lang.Class.forName0(Native Method)
	at java.lang.Class.forName(Class.java:186)
Caused by: java.io.FileNotFoundException: /usr/home/hudson/hudson-slave/workspace/Lucene-Solr-tests-only-trunk/checkout/lucene/build/classes/test/org/apache/lucene/search/TestDocBoost.class (Too many open files in system)
	at java.io.FileInputStream.open(Native Method)
	at java.io.FileInputStream.<init>(FileInputStream.java:137)
	at sun.misc.URLClassPath$FileLoader$1.getInputStream(URLClassPath.java:1005)
	at sun.misc.Resource.cachedInputStream(Resource.java:77)
	at sun.misc.Resource.getByteBuffer(Resource.java:160)
	at java.net.URLClassLoader.defineClass(URLClassLoader.java:266)
	at java.net.URLClassLoader.access$000(URLClassLoader.java:73)
	at java.net.URLClassLoader$1.run(URLClassLoader.java:212)


FAILED:  <init>.org.apache.lucene.search.TestElevationComparator

Error Message:
org.apache.lucene.search.TestElevationComparator

Stack Trace:
java.lang.ClassNotFoundException: org.apache.lucene.search.TestElevationComparator
	at java.net.URLClassLoader$1.run(URLClassLoader.java:214)
	at java.security.AccessController.doPrivileged(Native Method)
	at java.net.URLClassLoader.findClass(URLClassLoader.java:205)
	at java.lang.ClassLoader.loadClass(ClassLoader.java:321)
	at sun.misc.Launcher$AppClassLoader.loadClass(Launcher.java:294)
	at java.lang.ClassLoader.loadClass(ClassLoader.java:266)
	at java.lang.Class.forName0(Native Method)
	at java.lang.Class.forName(Class.java:186)
Caused by: java.io.FileNotFoundException: /usr/home/hudson/hudson-slave/workspace/Lucene-Solr-tests-only-trunk/checkout/lucene/build/classes/test/org/apache/lucene/search/TestElevationComparator.class (Too many open files in system)
	at java.io.FileInputStream.open(Native Method)
	at java.io.FileInputStream.<init>(FileInputStream.java:137)
	at sun.misc.URLClassPath$FileLoader$1.getInputStream(URLClassPath.java:1005)
	at sun.misc.Resource.cachedInputStream(Resource.java:77)
	at sun.misc.Resource.getByteBuffer(Resource.java:160)
	at java.net.URLClassLoader.defineClass(URLClassLoader.java:266)
	at java.net.URLClassLoader.access$000(URLClassLoader.java:73)
	at java.net.URLClassLoader$1.run(URLClassLoader.java:212)


FAILED:  <init>.org.apache.lucene.search.TestFieldCacheTermsFilter

Error Message:
org.apache.lucene.search.TestFieldCacheTermsFilter

Stack Trace:
java.lang.ClassNotFoundException: org.apache.lucene.search.TestFieldCacheTermsFilter
	at java.net.URLClassLoader$1.run(URLClassLoader.java:214)
	at java.security.AccessController.doPrivileged(Native Method)
	at java.net.URLClassLoader.findClass(URLClassLoader.java:205)
	at java.lang.ClassLoader.loadClass(ClassLoader.java:321)
	at sun.misc.Launcher$AppClassLoader.loadClass(Launcher.java:294)
	at java.lang.ClassLoader.loadClass(ClassLoader.java:266)
	at java.lang.Class.forName0(Native Method)
	at java.lang.Class.forName(Class.java:186)
Caused by: java.io.FileNotFoundException: /usr/home/hudson/hudson-slave/workspace/Lucene-Solr-tests-only-trunk/checkout/lucene/build/classes/test/org/apache/lucene/search/TestFieldCacheTermsFilter.class (Too many open files in system)
	at java.io.FileInputStream.open(Native Method)
	at java.io.FileInputStream.<init>(FileInputStream.java:137)
	at sun.misc.URLClassPath$FileLoader$1.getInputStream(URLClassPath.java:1005)
	at sun.misc.Resource.cachedInputStream(Resource.java:77)
	at sun.misc.Resource.getByteBuffer(Resource.java:160)
	at java.net.URLClassLoader.defineClass(URLClassLoader.java:266)
	at java.net.URLClassLoader.access$000(URLClassLoader.java:73)
	at java.net.URLClassLoader$1.run(URLClassLoader.java:212)


FAILED:  <init>.org.apache.lucene.search.TestFilteredQuery

Error Message:
org.apache.lucene.search.TestFilteredQuery

Stack Trace:
java.lang.ClassNotFoundException: org.apache.lucene.search.TestFilteredQuery
	at java.net.URLClassLoader$1.run(URLClassLoader.java:214)
	at java.security.AccessController.doPrivileged(Native Method)
	at java.net.URLClassLoader.findClass(URLClassLoader.java:205)
	at java.lang.ClassLoader.loadClass(ClassLoader.java:321)
	at sun.misc.Launcher$AppClassLoader.loadClass(Launcher.java:294)
	at java.lang.ClassLoader.loadClass(ClassLoader.java:266)
	at java.lang.Class.forName0(Native Method)
	at java.lang.Class.forName(Class.java:186)
Caused by: java.io.FileNotFoundException: /usr/home/hudson/hudson-slave/workspace/Lucene-Solr-tests-only-trunk/checkout/lucene/build/classes/test/org/apache/lucene/search/TestFilteredQuery.class (Too many open files in system)
	at java.io.FileInputStream.open(Native Method)
	at java.io.FileInputStream.<init>(FileInputStream.java:137)
	at sun.misc.URLClassPath$FileLoader$1.getInputStream(URLClassPath.java:1005)
	at sun.misc.Resource.cachedInputStream(Resource.java:77)
	at sun.misc.Resource.getByteBuffer(Resource.java:160)
	at java.net.URLClassLoader.defineClass(URLClassLoader.java:266)
	at java.net.URLClassLoader.access$000(URLClassLoader.java:73)
	at java.net.URLClassLoader$1.run(URLClassLoader.java:212)


FAILED:  <init>.org.apache.lucene.search.TestFuzzyQuery

Error Message:
org.apache.lucene.search.TestFuzzyQuery

Stack Trace:
java.lang.ClassNotFoundException: org.apache.lucene.search.TestFuzzyQuery
	at java.net.URLClassLoader$1.run(URLClassLoader.java:214)
	at java.security.AccessController.doPrivileged(Native Method)
	at java.net.URLClassLoader.findClass(URLClassLoader.java:205)
	at java.lang.ClassLoader.loadClass(ClassLoader.java:321)
	at sun.misc.Launcher$AppClassLoader.loadClass(Launcher.java:294)
	at java.lang.ClassLoader.loadClass(ClassLoader.java:266)
	at java.lang.Class.forName0(Native Method)
	at java.lang.Class.forName(Class.java:186)
Caused by: java.io.FileNotFoundException: /usr/home/hudson/hudson-slave/workspace/Lucene-Solr-tests-only-trunk/checkout/lucene/build/classes/test/org/apache/lucene/search/TestFuzzyQuery.class (Too many open files in system)
	at java.io.FileInputStream.open(Native Method)
	at java.io.FileInputStream.<init>(FileInputStream.java:137)
	at sun.misc.URLClassPath$FileLoader$1.getInputStream(URLClassPath.java:1005)
	at sun.misc.Resource.cachedInputStream(Resource.java:77)
	at sun.misc.Resource.getByteBuffer(Resource.java:160)
	at java.net.URLClassLoader.defineClass(URLClassLoader.java:266)
	at java.net.URLClassLoader.access$000(URLClassLoader.java:73)
	at java.net.URLClassLoader$1.run(URLClassLoader.java:212)


REGRESSION:  org.apache.lucene.search.TestFuzzyQuery2.testFromTestData

Error Message:
null

Stack Trace:
java.lang.NullPointerException
	at java.io.Reader.<init>(Reader.java:78)
	at java.io.InputStreamReader.<init>(InputStreamReader.java:97)
	at org.apache.lucene.search.TestFuzzyQuery2.assertFromTestData(TestFuzzyQuery2.java:76)
	at org.apache.lucene.search.TestFuzzyQuery2.testFromTestData(TestFuzzyQuery2.java:62)
	at org.apache.lucene.util.LuceneTestCase$LuceneTestCaseRunner.runChild(LuceneTestCase.java:1183)
	at org.apache.lucene.util.LuceneTestCase$LuceneTestCaseRunner.runChild(LuceneTestCase.java:1115)


FAILED:  <init>.org.apache.lucene.search.TestMatchAllDocsQuery

Error Message:
org.apache.lucene.search.TestMatchAllDocsQuery

Stack Trace:
java.lang.ClassNotFoundException: org.apache.lucene.search.TestMatchAllDocsQuery
	at java.net.URLClassLoader$1.run(URLClassLoader.java:214)
	at java.security.AccessController.doPrivileged(Native Method)
	at java.net.URLClassLoader.findClass(URLClassLoader.java:205)
	at java.lang.ClassLoader.loadClass(ClassLoader.java:321)
	at sun.misc.Launcher$AppClassLoader.loadClass(Launcher.java:294)
	at java.lang.ClassLoader.loadClass(ClassLoader.java:266)
	at java.lang.Class.forName0(Native Method)
	at java.lang.Class.forName(Class.java:186)
Caused by: java.io.FileNotFoundException: /usr/home/hudson/hudson-slave/workspace/Lucene-Solr-tests-only-trunk/checkout/lucene/build/classes/test/org/apache/lucene/search/TestMatchAllDocsQuery.class (Too many open files in system)
	at java.io.FileInputStream.open(Native Method)
	at java.io.FileInputStream.<init>(FileInputStream.java:137)
	at sun.misc.URLClassPath$FileLoader$1.getInputStream(URLClassPath.java:1005)
	at sun.misc.Resource.cachedInputStream(Resource.java:77)
	at sun.misc.Resource.getByteBuffer(Resource.java:160)
	at java.net.URLClassLoader.defineClass(URLClassLoader.java:266)
	at java.net.URLClassLoader.access$000(URLClassLoader.java:73)
	at java.net.URLClassLoader$1.run(URLClassLoader.java:212)


FAILED:  <init>.org.apache.lucene.search.TestMultiTermQueryRewrites

Error Message:
org.apache.lucene.search.TestMultiTermQueryRewrites

Stack Trace:
java.lang.ClassNotFoundException: org.apache.lucene.search.TestMultiTermQueryRewrites
	at java.net.URLClassLoader$1.run(URLClassLoader.java:214)
	at java.security.AccessController.doPrivileged(Native Method)
	at java.net.URLClassLoader.findClass(URLClassLoader.java:205)
	at java.lang.ClassLoader.loadClass(ClassLoader.java:321)
	at sun.misc.Launcher$AppClassLoader.loadClass(Launcher.java:294)
	at java.lang.ClassLoader.loadClass(ClassLoader.java:266)
	at java.lang.Class.forName0(Native Method)
	at java.lang.Class.forName(Class.java:186)
Caused by: java.io.FileNotFoundException: /usr/home/hudson/hudson-slave/workspace/Lucene-Solr-tests-only-trunk/checkout/lucene/build/classes/test/org/apache/lucene/search/TestMultiTermQueryRewrites.class (Too many open files in system)
	at java.io.FileInputStream.open(Native Method)
	at java.io.FileInputStream.<init>(FileInputStream.java:137)
	at sun.misc.URLClassPath$FileLoader$1.getInputStream(URLClassPath.java:1005)
	at sun.misc.Resource.cachedInputStream(Resource.java:77)
	at sun.misc.Resource.getByteBuffer(Resource.java:160)
	at java.net.URLClassLoader.defineClass(URLClassLoader.java:266)
	at java.net.URLClassLoader.access$000(URLClassLoader.java:73)
	at java.net.URLClassLoader$1.run(URLClassLoader.java:212)


REGRESSION:  org.apache.lucene.search.TestMultiThreadTermVectors.test

Error Message:
java.io.IOException: Too many open files in system

Stack Trace:
java.lang.RuntimeException: java.io.IOException: Too many open files in system
	at org.apache.lucene.util.LuceneTestCase.newDirectoryImpl(LuceneTestCase.java:1028)
	at org.apache.lucene.util.LuceneTestCase.newDirectory(LuceneTestCase.java:839)
	at org.apache.lucene.util.LuceneTestCase.newDirectory(LuceneTestCase.java:835)
	at org.apache.lucene.search.TestMultiThreadTermVectors.setUp(TestMultiThreadTermVectors.java:40)
	at org.apache.lucene.util.LuceneTestCase$LuceneTestCaseRunner.runChild(LuceneTestCase.java:1183)
	at org.apache.lucene.util.LuceneTestCase$LuceneTestCaseRunner.runChild(LuceneTestCase.java:1115)
Caused by: java.io.IOException: Too many open files in system
	at java.io.UnixFileSystem.createFileExclusively(Native Method)
	at java.io.File.checkAndCreate(File.java:1716)
	at java.io.File.createTempFile(File.java:1804)
	at org.apache.lucene.util.LuceneTestCase.newDirectoryImpl(LuceneTestCase.java:1019)


FAILED:  <init>.org.apache.lucene.search.TestPhrasePrefixQuery

Error Message:
org.apache.lucene.search.TestPhrasePrefixQuery

Stack Trace:
java.lang.ClassNotFoundException: org.apache.lucene.search.TestPhrasePrefixQuery
	at java.net.URLClassLoader$1.run(URLClassLoader.java:214)
	at java.security.AccessController.doPrivileged(Native Method)
	at java.net.URLClassLoader.findClass(URLClassLoader.java:205)
	at java.lang.ClassLoader.loadClass(ClassLoader.java:321)
	at sun.misc.Launcher$AppClassLoader.loadClass(Launcher.java:294)
	at java.lang.ClassLoader.loadClass(ClassLoader.java:266)
	at java.lang.Class.forName0(Native Method)
	at java.lang.Class.forName(Class.java:186)
Caused by: java.io.FileNotFoundException: /usr/home/hudson/hudson-slave/workspace/Lucene-Solr-tests-only-trunk/checkout/lucene/build/classes/test/org/apache/lucene/search/TestPhrasePrefixQuery.class (Too many open files in system)
	at java.io.FileInputStream.open(Native Method)
	at java.io.FileInputStream.<init>(FileInputStream.java:137)
	at sun.misc.URLClassPath$FileLoader$1.getInputStream(URLClassPath.java:1005)
	at sun.misc.Resource.cachedInputStream(Resource.java:77)
	at sun.misc.Resource.getByteBuffer(Resource.java:160)
	at java.net.URLClassLoader.defineClass(URLClassLoader.java:266)
	at java.net.URLClassLoader.access$000(URLClassLoader.java:73)
	at java.net.URLClassLoader$1.run(URLClassLoader.java:212)


FAILED:  <init>.org.apache.lucene.search.TestPhraseQuery

Error Message:
org.apache.lucene.search.TestPhraseQuery

Stack Trace:
java.lang.ClassNotFoundException: org.apache.lucene.search.TestPhraseQuery
	at java.net.URLClassLoader$1.run(URLClassLoader.java:214)
	at java.security.AccessController.doPrivileged(Native Method)
	at java.net.URLClassLoader.findClass(URLClassLoader.java:205)
	at java.lang.ClassLoader.loadClass(ClassLoader.java:321)
	at sun.misc.Launcher$AppClassLoader.loadClass(Launcher.java:294)
	at java.lang.ClassLoader.loadClass(ClassLoader.java:266)
	at java.lang.Class.forName0(Native Method)
	at java.lang.Class.forName(Class.java:186)
Caused by: java.io.FileNotFoundException: /usr/home/hudson/hudson-slave/workspace/Lucene-Solr-tests-only-trunk/checkout/lucene/build/classes/test/org/apache/lucene/search/TestPhraseQuery.class (Too many open files in system)
	at java.io.FileInputStream.open(Native Method)
	at java.io.FileInputStream.<init>(FileInputStream.java:137)
	at sun.misc.URLClassPath$FileLoader$1.getInputStream(URLClassPath.java:1005)
	at sun.misc.Resource.cachedInputStream(Resource.java:77)
	at sun.misc.Resource.getByteBuffer(Resource.java:160)
	at java.net.URLClassLoader.defineClass(URLClassLoader.java:266)
	at java.net.URLClassLoader.access$000(URLClassLoader.java:73)
	at java.net.URLClassLoader$1.run(URLClassLoader.java:212)


REGRESSION:  org.apache.lucene.search.TestRegexpRandom.testRegexps

Error Message:
org/apache/lucene/search/RegexpQuery$1

Stack Trace:
java.lang.NoClassDefFoundError: org/apache/lucene/search/RegexpQuery$1
	at org.apache.lucene.search.RegexpQuery.<clinit>(RegexpQuery.java:55)
	at org.apache.lucene.search.TestRegexpRandom.assertPatternHits(TestRegexpRandom.java:87)
	at org.apache.lucene.search.TestRegexpRandom.testRegexps(TestRegexpRandom.java:103)
	at org.apache.lucene.util.LuceneTestCase$LuceneTestCaseRunner.runChild(LuceneTestCase.java:1183)
	at org.apache.lucene.util.LuceneTestCase$LuceneTestCaseRunner.runChild(LuceneTestCase.java:1115)
Caused by: java.lang.ClassNotFoundException: org.apache.lucene.search.RegexpQuery$1
	at java.net.URLClassLoader$1.run(URLClassLoader.java:214)
	at java.security.AccessController.doPrivileged(Native Method)
	at java.net.URLClassLoader.findClass(URLClassLoader.java:205)
	at java.lang.ClassLoader.loadClass(ClassLoader.java:321)
	at sun.misc.Launcher$AppClassLoader.loadClass(Launcher.java:294)
	at java.lang.ClassLoader.loadClass(ClassLoader.java:266)
Caused by: java.io.FileNotFoundException: /usr/home/hudson/hudson-slave/workspace/Lucene-Solr-tests-only-trunk/checkout/lucene/build/classes/java/org/apache/lucene/search/RegexpQuery$1.class (Too many open files in system)
	at java.io.FileInputStream.open(Native Method)
	at java.io.FileInputStream.<init>(FileInputStream.java:137)
	at sun.misc.URLClassPath$FileLoader$1.getInputStream(URLClassPath.java:1005)
	at sun.misc.Resource.cachedInputStream(Resource.java:77)
	at sun.misc.Resource.getByteBuffer(Resource.java:160)
	at java.net.URLClassLoader.defineClass(URLClassLoader.java:266)
	at java.net.URLClassLoader.access$000(URLClassLoader.java:73)
	at java.net.URLClassLoader$1.run(URLClassLoader.java:212)


FAILED:  <init>.org.apache.lucene.search.TestRegexpRandom2

Error Message:
org.apache.lucene.search.TestRegexpRandom2

Stack Trace:
java.lang.ClassNotFoundException: org.apache.lucene.search.TestRegexpRandom2
	at java.net.URLClassLoader$1.run(URLClassLoader.java:214)
	at java.security.AccessController.doPrivileged(Native Method)
	at java.net.URLClassLoader.findClass(URLClassLoader.java:205)
	at java.lang.ClassLoader.loadClass(ClassLoader.java:321)
	at sun.misc.Launcher$AppClassLoader.loadClass(Launcher.java:294)
	at java.lang.ClassLoader.loadClass(ClassLoader.java:266)
	at java.lang.Class.forName0(Native Method)
	at java.lang.Class.forName(Class.java:186)
Caused by: java.io.FileNotFoundException: /usr/home/hudson/hudson-slave/workspace/Lucene-Solr-tests-only-trunk/checkout/lucene/build/classes/test/org/apache/lucene/search/TestRegexpRandom2.class (Too many open files in system)
	at java.io.FileInputStream.open(Native Method)
	at java.io.FileInputStream.<init>(FileInputStream.java:137)
	at sun.misc.URLClassPath$FileLoader$1.getInputStream(URLClassPath.java:1005)
	at sun.misc.Resource.cachedInputStream(Resource.java:77)
	at sun.misc.Resource.getByteBuffer(Resource.java:160)
	at java.net.URLClassLoader.defineClass(URLClassLoader.java:266)
	at java.net.URLClassLoader.access$000(URLClassLoader.java:73)
	at java.net.URLClassLoader$1.run(URLClassLoader.java:212)


FAILED:  <init>.org.apache.lucene.search.TestSearchWithThreads

Error Message:
org.apache.lucene.search.TestSearchWithThreads

Stack Trace:
java.lang.ClassNotFoundException: org.apache.lucene.search.TestSearchWithThreads
	at java.net.URLClassLoader$1.run(URLClassLoader.java:214)
	at java.security.AccessController.doPrivileged(Native Method)
	at java.net.URLClassLoader.findClass(URLClassLoader.java:205)
	at java.lang.ClassLoader.loadClass(ClassLoader.java:321)
	at sun.misc.Launcher$AppClassLoader.loadClass(Launcher.java:294)
	at java.lang.ClassLoader.loadClass(ClassLoader.java:266)
	at java.lang.Class.forName0(Native Method)
	at java.lang.Class.forName(Class.java:186)
Caused by: java.io.FileNotFoundException: /usr/home/hudson/hudson-slave/workspace/Lucene-Solr-tests-only-trunk/checkout/lucene/build/classes/test/org/apache/lucene/search/TestSearchWithThreads.class (Too many open files in system)
	at java.io.FileInputStream.open(Native Method)
	at java.io.FileInputStream.<init>(FileInputStream.java:137)
	at sun.misc.URLClassPath$FileLoader$1.getInputStream(URLClassPath.java:1005)
	at sun.misc.Resource.cachedInputStream(Resource.java:77)
	at sun.misc.Resource.getByteBuffer(Resource.java:160)
	at java.net.URLClassLoader.defineClass(URLClassLoader.java:266)
	at java.net.URLClassLoader.access$000(URLClassLoader.java:73)
	at java.net.URLClassLoader$1.run(URLClassLoader.java:212)


FAILED:  <init>.org.apache.lucene.search.TestThreadSafe

Error Message:
org.apache.lucene.search.TestThreadSafe

Stack Trace:
java.lang.ClassNotFoundException: org.apache.lucene.search.TestThreadSafe
	at java.net.URLClassLoader$1.run(URLClassLoader.java:214)
	at java.security.AccessController.doPrivileged(Native Method)
	at java.net.URLClassLoader.findClass(URLClassLoader.java:205)
	at java.lang.ClassLoader.loadClass(ClassLoader.java:321)
	at sun.misc.Launcher$AppClassLoader.loadClass(Launcher.java:294)
	at java.lang.ClassLoader.loadClass(ClassLoader.java:266)
	at java.lang.Class.forName0(Native Method)
	at java.lang.Class.forName(Class.java:186)
Caused by: java.io.FileNotFoundException: /usr/home/hudson/hudson-slave/workspace/Lucene-Solr-tests-only-trunk/checkout/lucene/build/classes/test/org/apache/lucene/search/TestThreadSafe.class (Too many open files in system)
	at java.io.FileInputStream.open(Native Method)
	at java.io.FileInputStream.<init>(FileInputStream.java:137)
	at sun.misc.URLClassPath$FileLoader$1.getInputStream(URLClassPath.java:1005)
	at sun.misc.Resource.cachedInputStream(Resource.java:77)
	at sun.misc.Resource.getByteBuffer(Resource.java:160)
	at java.net.URLClassLoader.defineClass(URLClassLoader.java:266)
	at java.net.URLClassLoader.access$000(URLClassLoader.java:73)
	at java.net.URLClassLoader$1.run(URLClassLoader.java:212)


FAILED:  <init>.org.apache.lucene.search.TestTimeLimitingCollector

Error Message:
org.apache.lucene.search.TestTimeLimitingCollector

Stack Trace:
java.lang.ClassNotFoundException: org.apache.lucene.search.TestTimeLimitingCollector
	at java.net.URLClassLoader$1.run(URLClassLoader.java:214)
	at java.security.AccessController.doPrivileged(Native Method)
	at java.net.URLClassLoader.findClass(URLClassLoader.java:205)
	at java.lang.ClassLoader.loadClass(ClassLoader.java:321)
	at sun.misc.Launcher$AppClassLoader.loadClass(Launcher.java:294)
	at java.lang.ClassLoader.loadClass(ClassLoader.java:266)
	at java.lang.Class.forName0(Native Method)
	at java.lang.Class.forName(Class.java:186)
Caused by: java.io.FileNotFoundException: /usr/home/hudson/hudson-slave/workspace/Lucene-Solr-tests-only-trunk/checkout/lucene/build/classes/test/org/apache/lucene/search/TestTimeLimitingCollector.class (Too many open files in system)
	at java.io.FileInputStream.open(Native Method)
	at java.io.FileInputStream.<init>(FileInputStream.java:137)
	at sun.misc.URLClassPath$FileLoader$1.getInputStream(URLClassPath.java:1005)
	at sun.misc.Resource.cachedInputStream(Resource.java:77)
	at sun.misc.Resource.getByteBuffer(Resource.java:160)
	at java.net.URLClassLoader.defineClass(URLClassLoader.java:266)
	at java.net.URLClassLoader.access$000(URLClassLoader.java:73)
	at java.net.URLClassLoader$1.run(URLClassLoader.java:212)


FAILED:  <init>.org.apache.lucene.search.TestWildcard

Error Message:
org.apache.lucene.search.TestWildcard

Stack Trace:
java.lang.ClassNotFoundException: org.apache.lucene.search.TestWildcard
	at java.net.URLClassLoader$1.run(URLClassLoader.java:214)
	at java.security.AccessController.doPrivileged(Native Method)
	at java.net.URLClassLoader.findClass(URLClassLoader.java:205)
	at java.lang.ClassLoader.loadClass(ClassLoader.java:321)
	at sun.misc.Launcher$AppClassLoader.loadClass(Launcher.java:294)
	at java.lang.ClassLoader.loadClass(ClassLoader.java:266)
	at java.lang.Class.forName0(Native Method)
	at java.lang.Class.forName(Class.java:186)
Caused by: java.io.FileNotFoundException: /usr/home/hudson/hudson-slave/workspace/Lucene-Solr-tests-only-trunk/checkout/lucene/build/classes/test/org/apache/lucene/search/TestWildcard.class (Too many open files in system)
	at java.io.FileInputStream.open(Native Method)
	at java.io.FileInputStream.<init>(FileInputStream.java:137)
	at sun.misc.URLClassPath$FileLoader$1.getInputStream(URLClassPath.java:1005)
	at sun.misc.Resource.cachedInputStream(Resource.java:77)
	at sun.misc.Resource.getByteBuffer(Resource.java:160)
	at java.net.URLClassLoader.defineClass(URLClassLoader.java:266)
	at java.net.URLClassLoader.access$000(URLClassLoader.java:73)
	at java.net.URLClassLoader$1.run(URLClassLoader.java:212)


FAILED:  <init>.org.apache.lucene.search.TestWildcardRandom

Error Message:
org.apache.lucene.search.TestWildcardRandom

Stack Trace:
java.lang.ClassNotFoundException: org.apache.lucene.search.TestWildcardRandom
	at java.net.URLClassLoader$1.run(URLClassLoader.java:214)
	at java.security.AccessController.doPrivileged(Native Method)
	at java.net.URLClassLoader.findClass(URLClassLoader.java:205)
	at java.lang.ClassLoader.loadClass(ClassLoader.java:321)
	at sun.misc.Launcher$AppClassLoader.loadClass(Launcher.java:294)
	at java.lang.ClassLoader.loadClass(ClassLoader.java:266)
	at java.lang.Class.forName0(Native Method)
	at java.lang.Class.forName(Class.java:186)
Caused by: java.io.FileNotFoundException: /usr/home/hudson/hudson-slave/workspace/Lucene-Solr-tests-only-trunk/checkout/lucene/build/classes/test/org/apache/lucene/search/TestWildcardRandom.class (Too many open files in system)
	at java.io.FileInputStream.open(Native Method)
	at java.io.FileInputStream.<init>(FileInputStream.java:137)
	at sun.misc.URLClassPath$FileLoader$1.getInputStream(URLClassPath.java:1005)
	at sun.misc.Resource.cachedInputStream(Resource.java:77)
	at sun.misc.Resource.getByteBuffer(Resource.java:160)
	at java.net.URLClassLoader.defineClass(URLClassLoader.java:266)
	at java.net.URLClassLoader.access$000(URLClassLoader.java:73)
	at java.net.URLClassLoader$1.run(URLClassLoader.java:212)


FAILED:  <init>.org.apache.lucene.search.function.TestCustomScoreQuery

Error Message:
org.apache.lucene.search.function.TestCustomScoreQuery

Stack Trace:
java.lang.ClassNotFoundException: org.apache.lucene.search.function.TestCustomScoreQuery
	at java.net.URLClassLoader$1.run(URLClassLoader.java:214)
	at java.security.AccessController.doPrivileged(Native Method)
	at java.net.URLClassLoader.findClass(URLClassLoader.java:205)
	at java.lang.ClassLoader.loadClass(ClassLoader.java:321)
	at sun.misc.Launcher$AppClassLoader.loadClass(Launcher.java:294)
	at java.lang.ClassLoader.loadClass(ClassLoader.java:266)
	at java.lang.Class.forName0(Native Method)
	at java.lang.Class.forName(Class.java:186)
Caused by: java.io.FileNotFoundException: /usr/home/hudson/hudson-slave/workspace/Lucene-Solr-tests-only-trunk/checkout/lucene/build/classes/test/org/apache/lucene/search/function/TestCustomScoreQuery.class (Too many open files in system)
	at java.io.FileInputStream.open(Native Method)
	at java.io.FileInputStream.<init>(FileInputStream.java:137)
	at sun.misc.URLClassPath$FileLoader$1.getInputStream(URLClassPath.java:1005)
	at sun.misc.Resource.cachedInputStream(Resource.java:77)
	at sun.misc.Resource.getByteBuffer(Resource.java:160)
	at java.net.URLClassLoader.defineClass(URLClassLoader.java:266)
	at java.net.URLClassLoader.access$000(URLClassLoader.java:73)
	at java.net.URLClassLoader$1.run(URLClassLoader.java:212)


FAILED:  <init>.org.apache.lucene.search.function.TestFieldScoreQuery

Error Message:
org.apache.lucene.search.function.TestFieldScoreQuery

Stack Trace:
java.lang.ClassNotFoundException: org.apache.lucene.search.function.TestFieldScoreQuery
	at java.net.URLClassLoader$1.run(URLClassLoader.java:214)
	at java.security.AccessController.doPrivileged(Native Method)
	at java.net.URLClassLoader.findClass(URLClassLoader.java:205)
	at java.lang.ClassLoader.loadClass(ClassLoader.java:321)
	at sun.misc.Launcher$AppClassLoader.loadClass(Launcher.java:294)
	at java.lang.ClassLoader.loadClass(ClassLoader.java:266)
	at java.lang.Class.forName0(Native Method)
	at java.lang.Class.forName(Class.java:186)
Caused by: java.io.FileNotFoundException: /usr/home/hudson/hudson-slave/workspace/Lucene-Solr-tests-only-trunk/checkout/lucene/build/classes/test/org/apache/lucene/search/function/TestFieldScoreQuery.class (Too many open files in system)
	at java.io.FileInputStream.open(Native Method)
	at java.io.FileInputStream.<init>(FileInputStream.java:137)
	at sun.misc.URLClassPath$FileLoader$1.getInputStream(URLClassPath.java:1005)
	at sun.misc.Resource.cachedInputStream(Resource.java:77)
	at sun.misc.Resource.getByteBuffer(Resource.java:160)
	at java.net.URLClassLoader.defineClass(URLClassLoader.java:266)
	at java.net.URLClassLoader.access$000(URLClassLoader.java:73)
	at java.net.URLClassLoader$1.run(URLClassLoader.java:212)


FAILED:  <init>.org.apache.lucene.search.spans.TestFieldMaskingSpanQuery

Error Message:
org.apache.lucene.search.spans.TestFieldMaskingSpanQuery

Stack Trace:
java.lang.ClassNotFoundException: org.apache.lucene.search.spans.TestFieldMaskingSpanQuery
	at java.net.URLClassLoader$1.run(URLClassLoader.java:214)
	at java.security.AccessController.doPrivileged(Native Method)
	at java.net.URLClassLoader.findClass(URLClassLoader.java:205)
	at java.lang.ClassLoader.loadClass(ClassLoader.java:321)
	at sun.misc.Launcher$AppClassLoader.loadClass(Launcher.java:294)
	at java.lang.ClassLoader.loadClass(ClassLoader.java:266)
	at java.lang.Class.forName0(Native Method)
	at java.lang.Class.forName(Class.java:186)
Caused by: java.io.FileNotFoundException: /usr/home/hudson/hudson-slave/workspace/Lucene-Solr-tests-only-trunk/checkout/lucene/build/classes/test/org/apache/lucene/search/spans/TestFieldMaskingSpanQuery.class (Too many open files in system)
	at java.io.FileInputStream.open(Native Method)
	at java.io.FileInputStream.<init>(FileInputStream.java:137)
	at sun.misc.URLClassPath$FileLoader$1.getInputStream(URLClassPath.java:1005)
	at sun.misc.Resource.cachedInputStream(Resource.java:77)
	at sun.misc.Resource.getByteBuffer(Resource.java:160)
	at java.net.URLClassLoader.defineClass(URLClassLoader.java:266)
	at java.net.URLClassLoader.access$000(URLClassLoader.java:73)
	at java.net.URLClassLoader$1.run(URLClassLoader.java:212)


FAILED:  <init>.org.apache.lucene.search.spans.TestSpansAdvanced

Error Message:
org.apache.lucene.search.spans.TestSpansAdvanced

Stack Trace:
java.lang.ClassNotFoundException: org.apache.lucene.search.spans.TestSpansAdvanced
	at java.net.URLClassLoader$1.run(URLClassLoader.java:214)
	at java.security.AccessController.doPrivileged(Native Method)
	at java.net.URLClassLoader.findClass(URLClassLoader.java:205)
	at java.lang.ClassLoader.loadClass(ClassLoader.java:321)
	at sun.misc.Launcher$AppClassLoader.loadClass(Launcher.java:294)
	at java.lang.ClassLoader.loadClass(ClassLoader.java:266)
	at java.lang.Class.forName0(Native Method)
	at java.lang.Class.forName(Class.java:186)
Caused by: java.io.FileNotFoundException: /usr/home/hudson/hudson-slave/workspace/Lucene-Solr-tests-only-trunk/checkout/lucene/build/classes/test/org/apache/lucene/search/spans/TestSpansAdvanced.class (Too many open files in system)
	at java.io.FileInputStream.open(Native Method)
	at java.io.FileInputStream.<init>(FileInputStream.java:137)
	at sun.misc.URLClassPath$FileLoader$1.getInputStream(URLClassPath.java:1005)
	at sun.misc.Resource.cachedInputStream(Resource.java:77)
	at sun.misc.Resource.getByteBuffer(Resource.java:160)
	at java.net.URLClassLoader.defineClass(URLClassLoader.java:266)
	at java.net.URLClassLoader.access$000(URLClassLoader.java:73)
	at java.net.URLClassLoader$1.run(URLClassLoader.java:212)


FAILED:  <init>.org.apache.lucene.store.TestCopyBytes

Error Message:
org.apache.lucene.store.TestCopyBytes

Stack Trace:
java.lang.ClassNotFoundException: org.apache.lucene.store.TestCopyBytes
	at java.net.URLClassLoader$1.run(URLClassLoader.java:214)
	at java.security.AccessController.doPrivileged(Native Method)
	at java.net.URLClassLoader.findClass(URLClassLoader.java:205)
	at java.lang.ClassLoader.loadClass(ClassLoader.java:321)
	at sun.misc.Launcher$AppClassLoader.loadClass(Launcher.java:294)
	at java.lang.ClassLoader.loadClass(ClassLoader.java:266)
	at java.lang.Class.forName0(Native Method)
	at java.lang.Class.forName(Class.java:186)
Caused by: java.io.FileNotFoundException: /usr/home/hudson/hudson-slave/workspace/Lucene-Solr-tests-only-trunk/checkout/lucene/build/classes/test/org/apache/lucene/store/TestCopyBytes.class (Too many open files in system)
	at java.io.FileInputStream.open(Native Method)
	at java.io.FileInputStream.<init>(FileInputStream.java:137)
	at sun.misc.URLClassPath$FileLoader$1.getInputStream(URLClassPath.java:1005)
	at sun.misc.Resource.cachedInputStream(Resource.java:77)
	at sun.misc.Resource.getByteBuffer(Resource.java:160)
	at java.net.URLClassLoader.defineClass(URLClassLoader.java:266)
	at java.net.URLClassLoader.access$000(URLClassLoader.java:73)
	at java.net.URLClassLoader$1.run(URLClassLoader.java:212)


REGRESSION:  org.apache.lucene.store.TestLockFactory.testStressLocks

Error Message:
directory '/usr/home/hudson/hudson-slave/workspace/Lucene-Solr-tests-only-trunk/checkout/lucene/build/test/4/index.TestLockFactory6.7638588031512546275' exists and is a directory, but cannot be listed: list() returned null

Stack Trace:
java.io.IOException: directory '/usr/home/hudson/hudson-slave/workspace/Lucene-Solr-tests-only-trunk/checkout/lucene/build/test/4/index.TestLockFactory6.7638588031512546275' exists and is a directory, but cannot be listed: list() returned null
	at org.apache.lucene.store.FSDirectory.listAll(FSDirectory.java:239)
	at org.apache.lucene.store.FSDirectory.listAll(FSDirectory.java:250)
	at org.apache.lucene.store.MockDirectoryWrapper.listAll(MockDirectoryWrapper.java:488)
	at org.apache.lucene.index.IndexFileDeleter.refresh(IndexFileDeleter.java:320)
	at org.apache.lucene.index.DocumentsWriter.flush(DocumentsWriter.java:683)
	at org.apache.lucene.index.IndexWriter.doFlush(IndexWriter.java:2530)
	at org.apache.lucene.index.IndexWriter.flush(IndexWriter.java:2495)
	at org.apache.lucene.index.IndexWriter.closeInternal(IndexWriter.java:1069)
	at org.apache.lucene.index.IndexWriter.close(IndexWriter.java:1033)
	at org.apache.lucene.index.IndexWriter.close(IndexWriter.java:997)
	at org.apache.lucene.store.TestLockFactory._testStressLocks(TestLockFactory.java:153)
	at org.apache.lucene.store.TestLockFactory.testStressLocks(TestLockFactory.java:135)
	at org.apache.lucene.util.LuceneTestCase$LuceneTestCaseRunner.runChild(LuceneTestCase.java:1183)
	at org.apache.lucene.util.LuceneTestCase$LuceneTestCaseRunner.runChild(LuceneTestCase.java:1115)


FAILED:  <init>.org.apache.lucene.util.TestBitVector

Error Message:
org.apache.lucene.util.TestBitVector

Stack Trace:
java.lang.ClassNotFoundException: org.apache.lucene.util.TestBitVector
	at java.net.URLClassLoader$1.run(URLClassLoader.java:214)
	at java.security.AccessController.doPrivileged(Native Method)
	at java.net.URLClassLoader.findClass(URLClassLoader.java:205)
	at java.lang.ClassLoader.loadClass(ClassLoader.java:321)
	at sun.misc.Launcher$AppClassLoader.loadClass(Launcher.java:294)
	at java.lang.ClassLoader.loadClass(ClassLoader.java:266)
	at java.lang.Class.forName0(Native Method)
	at java.lang.Class.forName(Class.java:186)
Caused by: java.io.FileNotFoundException: /usr/home/hudson/hudson-slave/workspace/Lucene-Solr-tests-only-trunk/checkout/lucene/build/classes/test/org/apache/lucene/util/TestBitVector.class (Too many open files in system)
	at java.io.FileInputStream.open(Native Method)
	at java.io.FileInputStream.<init>(FileInputStream.java:137)
	at sun.misc.URLClassPath$FileLoader$1.getInputStream(URLClassPath.java:1005)
	at sun.misc.Resource.cachedInputStream(Resource.java:77)
	at sun.misc.Resource.getByteBuffer(Resource.java:160)
	at java.net.URLClassLoader.defineClass(URLClassLoader.java:266)
	at java.net.URLClassLoader.access$000(URLClassLoader.java:73)
	at java.net.URLClassLoader$1.run(URLClassLoader.java:212)


FAILED:  <init>.org.apache.lucene.util.TestBytesRefHash

Error Message:
org.apache.lucene.util.TestBytesRefHash

Stack Trace:
java.lang.ClassNotFoundException: org.apache.lucene.util.TestBytesRefHash
	at java.net.URLClassLoader$1.run(URLClassLoader.java:214)
	at java.security.AccessController.doPrivileged(Native Method)
	at java.net.URLClassLoader.findClass(URLClassLoader.java:205)
	at java.lang.ClassLoader.loadClass(ClassLoader.java:321)
	at sun.misc.Launcher$AppClassLoader.loadClass(Launcher.java:294)
	at java.lang.ClassLoader.loadClass(ClassLoader.java:266)
	at java.lang.Class.forName0(Native Method)
	at java.lang.Class.forName(Class.java:186)
Caused by: java.io.FileNotFoundException: /usr/home/hudson/hudson-slave/workspace/Lucene-Solr-tests-only-trunk/checkout/lucene/build/classes/test/org/apache/lucene/util/TestBytesRefHash.class (Too many open files in system)
	at java.io.FileInputStream.open(Native Method)
	at java.io.FileInputStream.<init>(FileInputStream.java:137)
	at sun.misc.URLClassPath$FileLoader$1.getInputStream(URLClassPath.java:1005)
	at sun.misc.Resource.cachedInputStream(Resource.java:77)
	at sun.misc.Resource.getByteBuffer(Resource.java:160)
	at java.net.URLClassLoader.defineClass(URLClassLoader.java:266)
	at java.net.URLClassLoader.access$000(URLClassLoader.java:73)
	at java.net.URLClassLoader$1.run(URLClassLoader.java:212)


FAILED:  <init>.org.apache.lucene.util.automaton.TestDeterminism

Error Message:
org.apache.lucene.util.automaton.TestDeterminism

Stack Trace:
java.lang.ClassNotFoundException: org.apache.lucene.util.automaton.TestDeterminism
	at java.net.URLClassLoader$1.run(URLClassLoader.java:214)
	at java.security.AccessController.doPrivileged(Native Method)
	at java.net.URLClassLoader.findClass(URLClassLoader.java:205)
	at java.lang.ClassLoader.loadClass(ClassLoader.java:321)
	at sun.misc.Launcher$AppClassLoader.loadClass(Launcher.java:294)
	at java.lang.ClassLoader.loadClass(ClassLoader.java:266)
	at java.lang.Class.forName0(Native Method)
	at java.lang.Class.forName(Class.java:186)
Caused by: java.io.FileNotFoundException: /usr/home/hudson/hudson-slave/workspace/Lucene-Solr-tests-only-trunk/checkout/lucene/build/classes/test/org/apache/lucene/util/automaton/TestDeterminism.class (Too many open files in system)
	at java.io.FileInputStream.open(Native Method)
	at java.io.FileInputStream.<init>(FileInputStream.java:137)
	at sun.misc.URLClassPath$FileLoader$1.getInputStream(URLClassPath.java:1005)
	at sun.misc.Resource.cachedInputStream(Resource.java:77)
	at sun.misc.Resource.getByteBuffer(Resource.java:160)
	at java.net.URLClassLoader.defineClass(URLClassLoader.java:266)
	at java.net.URLClassLoader.access$000(URLClassLoader.java:73)
	at java.net.URLClassLoader$1.run(URLClassLoader.java:212)




Build Log (for compile errors):
[...truncated 4123 lines...]



---------------------------------------------------------------------
To unsubscribe, e-mail: dev-unsubscribe@lucene.apache.org
For additional commands, e-mail: dev-help@lucene.apache.org


Mime
View raw message