lucene-dev mailing list archives

Site index · List index
Message view « Date » · « Thread »
Top « Date » · « Thread »
From Apache Hudson Server <hud...@hudson.apache.org>
Subject [HUDSON] Lucene-Solr-tests-only-trunk - Build # 5382 - Failure
Date Sun, 27 Feb 2011 13:16:13 GMT
Build: https://hudson.apache.org/hudson/job/Lucene-Solr-tests-only-trunk/5382/

18 tests failed.
REGRESSION:  org.apache.lucene.index.TestDeletionPolicy.testKeepLastNDeletionPolicyWithReader

Error Message:
expected:<160> but was:<161>

Stack Trace:
junit.framework.AssertionFailedError: expected:<160> but was:<161>
	at org.apache.lucene.util.LuceneTestCase$LuceneTestCaseRunner.runChild(LuceneTestCase.java:1213)
	at org.apache.lucene.util.LuceneTestCase$LuceneTestCaseRunner.runChild(LuceneTestCase.java:1145)
	at org.apache.lucene.index.TestDeletionPolicy.testKeepLastNDeletionPolicyWithReader(TestDeletionPolicy.java:657)


REGRESSION:  org.apache.lucene.index.TestIndexReaderReopen.testThreadSafety

Error Message:
Error occurred in thread Thread-58: /usr/home/hudson/hudson-slave/workspace/Lucene-Solr-tests-only-trunk/checkout/lucene/build/test/2/test5227502549337488185tmp/_d_4.frq
(Too many open files in system)

Stack Trace:
junit.framework.AssertionFailedError: Error occurred in thread Thread-58:
/usr/home/hudson/hudson-slave/workspace/Lucene-Solr-tests-only-trunk/checkout/lucene/build/test/2/test5227502549337488185tmp/_d_4.frq
(Too many open files in system)
	at org.apache.lucene.util.LuceneTestCase$LuceneTestCaseRunner.runChild(LuceneTestCase.java:1213)
	at org.apache.lucene.util.LuceneTestCase$LuceneTestCaseRunner.runChild(LuceneTestCase.java:1145)
/usr/home/hudson/hudson-slave/workspace/Lucene-Solr-tests-only-trunk/checkout/lucene/build/test/2/test5227502549337488185tmp/_d_4.frq
(Too many open files in system)
	at org.apache.lucene.index.TestIndexReaderReopen.testThreadSafety(TestIndexReaderReopen.java:833)


REGRESSION:  org.apache.lucene.index.TestIndexWriter.testCommitOnCloseDiskUsage

Error Message:
/usr/home/hudson/hudson-slave/workspace/Lucene-Solr-tests-only-trunk/checkout/lucene/build/test/2/test3305618400989549399tmp/_3s.tvf
(Too many open files in system)

Stack Trace:
java.io.FileNotFoundException: /usr/home/hudson/hudson-slave/workspace/Lucene-Solr-tests-only-trunk/checkout/lucene/build/test/2/test3305618400989549399tmp/_3s.tvf
(Too many open files in system)
	at java.io.RandomAccessFile.open(Native Method)
	at java.io.RandomAccessFile.<init>(RandomAccessFile.java:233)
	at org.apache.lucene.store.FSDirectory$FSIndexOutput.<init>(FSDirectory.java:448)
	at org.apache.lucene.store.FSDirectory.createOutput(FSDirectory.java:312)
	at org.apache.lucene.store.MockDirectoryWrapper.createOutput(MockDirectoryWrapper.java:347)
	at org.apache.lucene.index.TermVectorsTermsWriter.initTermVectorsWriter(TermVectorsTermsWriter.java:125)
	at org.apache.lucene.index.TermVectorsTermsWriter.finishDocument(TermVectorsTermsWriter.java:139)
	at org.apache.lucene.index.TermVectorsTermsWriter$PerDoc.finish(TermVectorsTermsWriter.java:240)
	at org.apache.lucene.index.DocFieldProcessorPerThread$PerDoc.finish(DocFieldProcessorPerThread.java:287)
	at org.apache.lucene.index.DocumentsWriter$WaitQueue.writeDocument(DocumentsWriter.java:1148)
	at org.apache.lucene.index.DocumentsWriter$WaitQueue.add(DocumentsWriter.java:1168)
	at org.apache.lucene.index.DocumentsWriter.finishDocument(DocumentsWriter.java:918)
	at org.apache.lucene.index.DocumentsWriter.updateDocument(DocumentsWriter.java:807)
	at org.apache.lucene.index.IndexWriter.addDocument(IndexWriter.java:1261)
	at org.apache.lucene.index.IndexWriter.addDocument(IndexWriter.java:1237)
	at org.apache.lucene.index.TestIndexWriter.addDocWithIndex(TestIndexWriter.java:143)
	at org.apache.lucene.index.TestIndexWriter.testCommitOnCloseDiskUsage(TestIndexWriter.java:512)
	at org.apache.lucene.util.LuceneTestCase$LuceneTestCaseRunner.runChild(LuceneTestCase.java:1213)
	at org.apache.lucene.util.LuceneTestCase$LuceneTestCaseRunner.runChild(LuceneTestCase.java:1145)


REGRESSION:  org.apache.lucene.index.TestIndexWriterOnDiskFull.testAddIndexOnDiskFull

Error Message:
addIndexes(Directory[]) hit IOException after disk space was freed up

Stack Trace:
junit.framework.AssertionFailedError: addIndexes(Directory[]) hit IOException after disk space
was freed up
	at org.apache.lucene.util.LuceneTestCase$LuceneTestCaseRunner.runChild(LuceneTestCase.java:1213)
	at org.apache.lucene.util.LuceneTestCase$LuceneTestCaseRunner.runChild(LuceneTestCase.java:1145)
	at org.apache.lucene.index.TestIndexWriterOnDiskFull.testAddIndexOnDiskFull(TestIndexWriterOnDiskFull.java:327)


REGRESSION:  org.apache.lucene.index.TestNRTThreads.testNRTThreads

Error Message:
null

Stack Trace:
junit.framework.AssertionFailedError: 
	at org.apache.lucene.util.LuceneTestCase$LuceneTestCaseRunner.runChild(LuceneTestCase.java:1213)
	at org.apache.lucene.util.LuceneTestCase$LuceneTestCaseRunner.runChild(LuceneTestCase.java:1145)
	at org.apache.lucene.index.TestNRTThreads.testNRTThreads(TestNRTThreads.java:378)


FAILED:  junit.framework.TestSuite.org.apache.lucene.search.TestNumericRangeQuery32

Error Message:
directory '/usr/home/hudson/hudson-slave/workspace/Lucene-Solr-tests-only-trunk/checkout/lucene/build/test/2/test3839579056034627335tmp'
exists and is a directory, but cannot be listed: list() returned null

Stack Trace:
java.io.IOException: directory '/usr/home/hudson/hudson-slave/workspace/Lucene-Solr-tests-only-trunk/checkout/lucene/build/test/2/test3839579056034627335tmp'
exists and is a directory, but cannot be listed: list() returned null
	at org.apache.lucene.store.FSDirectory.listAll(FSDirectory.java:239)
	at org.apache.lucene.store.FSDirectory.listAll(FSDirectory.java:250)
	at org.apache.lucene.store.MockDirectoryWrapper.listAll(MockDirectoryWrapper.java:500)
	at org.apache.lucene.index.IndexFileDeleter.refresh(IndexFileDeleter.java:320)
	at org.apache.lucene.index.DocumentsWriter.flush(DocumentsWriter.java:693)
	at org.apache.lucene.index.IndexWriter.doFlush(IndexWriter.java:2538)
	at org.apache.lucene.index.IndexWriter.flush(IndexWriter.java:2503)
	at org.apache.lucene.index.IndexWriter.prepareCommit(IndexWriter.java:2373)
	at org.apache.lucene.index.IndexWriter.commitInternal(IndexWriter.java:2446)
	at org.apache.lucene.index.IndexWriter.commit(IndexWriter.java:2428)
	at org.apache.lucene.index.IndexWriter.commit(IndexWriter.java:2412)
	at org.apache.lucene.index.RandomIndexWriter.addDocument(RandomIndexWriter.java:104)
	at org.apache.lucene.search.TestNumericRangeQuery32.beforeClass(TestNumericRangeQuery32.java:88)


FAILED:  junit.framework.TestSuite.org.apache.lucene.search.TestNumericRangeQuery32

Error Message:
null

Stack Trace:
java.lang.NullPointerException
	at org.apache.lucene.search.TestNumericRangeQuery32.afterClass(TestNumericRangeQuery32.java:98)


FAILED:  junit.framework.TestSuite.org.apache.lucene.search.TestNumericRangeQuery32

Error Message:
directory of test was not closed, opened from: org.apache.lucene.search.TestNumericRangeQuery32.beforeClass(TestNumericRangeQuery32.java:55)

Stack Trace:
junit.framework.AssertionFailedError: directory of test was not closed, opened from: org.apache.lucene.search.TestNumericRangeQuery32.beforeClass(TestNumericRangeQuery32.java:55)
	at org.apache.lucene.util.LuceneTestCase.afterClassLuceneTestCaseJ4(LuceneTestCase.java:385)


REGRESSION:  org.apache.lucene.search.TestPhraseQuery.testOrderDoesntMatter

Error Message:
java.io.IOException: Too many open files in system

Stack Trace:
java.lang.RuntimeException: java.io.IOException: Too many open files in system
	at org.apache.lucene.util.LuceneTestCase.newDirectoryImpl(LuceneTestCase.java:1057)
	at org.apache.lucene.util.LuceneTestCase.newDirectory(LuceneTestCase.java:844)
	at org.apache.lucene.util.LuceneTestCase.newDirectory(LuceneTestCase.java:836)
	at org.apache.lucene.search.TestPhraseQuery.setUp(TestPhraseQuery.java:56)
	at org.apache.lucene.util.LuceneTestCase$LuceneTestCaseRunner.runChild(LuceneTestCase.java:1213)
	at org.apache.lucene.util.LuceneTestCase$LuceneTestCaseRunner.runChild(LuceneTestCase.java:1145)
Caused by: java.io.IOException: Too many open files in system
	at java.io.UnixFileSystem.createFileExclusively(Native Method)
	at java.io.File.checkAndCreate(File.java:1716)
	at java.io.File.createTempFile(File.java:1804)
	at org.apache.lucene.util.LuceneTestCase.newDirectoryImpl(LuceneTestCase.java:1048)


REGRESSION:  org.apache.lucene.search.function.TestFieldScoreQuery.testCachingByte

Error Message:
directory '/usr/home/hudson/hudson-slave/workspace/Lucene-Solr-tests-only-trunk/checkout/lucene/build/test/1/test1565160021996610029tmp'
exists and is a directory, but cannot be listed: list() returned null

Stack Trace:
java.io.IOException: directory '/usr/home/hudson/hudson-slave/workspace/Lucene-Solr-tests-only-trunk/checkout/lucene/build/test/1/test1565160021996610029tmp'
exists and is a directory, but cannot be listed: list() returned null
	at org.apache.lucene.store.FSDirectory.listAll(FSDirectory.java:239)
	at org.apache.lucene.store.FSDirectory.listAll(FSDirectory.java:250)
	at org.apache.lucene.store.MockDirectoryWrapper.listAll(MockDirectoryWrapper.java:500)
	at org.apache.lucene.index.IndexFileDeleter.refresh(IndexFileDeleter.java:320)
	at org.apache.lucene.index.DocumentsWriter.flush(DocumentsWriter.java:693)
	at org.apache.lucene.index.IndexWriter.doFlush(IndexWriter.java:2538)
	at org.apache.lucene.index.IndexWriter.flush(IndexWriter.java:2503)
	at org.apache.lucene.index.IndexWriter.addDocument(IndexWriter.java:1268)
	at org.apache.lucene.index.IndexWriter.addDocument(IndexWriter.java:1237)
	at org.apache.lucene.index.RandomIndexWriter.addDocument(RandomIndexWriter.java:99)
	at org.apache.lucene.search.function.FunctionTestSetup.addDoc(FunctionTestSetup.java:154)
	at org.apache.lucene.search.function.FunctionTestSetup.setUp(FunctionTestSetup.java:116)
	at org.apache.lucene.util.LuceneTestCase$LuceneTestCaseRunner.runChild(LuceneTestCase.java:1213)
	at org.apache.lucene.util.LuceneTestCase$LuceneTestCaseRunner.runChild(LuceneTestCase.java:1145)


FAILED:  <init>.org.apache.lucene.search.spans.TestFieldMaskingSpanQuery

Error Message:
org.apache.lucene.search.spans.TestFieldMaskingSpanQuery

Stack Trace:
java.lang.ClassNotFoundException: org.apache.lucene.search.spans.TestFieldMaskingSpanQuery
	at java.net.URLClassLoader$1.run(URLClassLoader.java:214)
	at java.security.AccessController.doPrivileged(Native Method)
	at java.net.URLClassLoader.findClass(URLClassLoader.java:205)
	at java.lang.ClassLoader.loadClass(ClassLoader.java:321)
	at sun.misc.Launcher$AppClassLoader.loadClass(Launcher.java:294)
	at java.lang.ClassLoader.loadClass(ClassLoader.java:266)
	at java.lang.Class.forName0(Native Method)
	at java.lang.Class.forName(Class.java:186)
Caused by: java.io.FileNotFoundException: /usr/home/hudson/hudson-slave/workspace/Lucene-Solr-tests-only-trunk/checkout/lucene/build/classes/test/org/apache/lucene/search/spans/TestFieldMaskingSpanQuery.class
(Too many open files in system)
	at java.io.FileInputStream.open(Native Method)
	at java.io.FileInputStream.<init>(FileInputStream.java:137)
	at sun.misc.URLClassPath$FileLoader$1.getInputStream(URLClassPath.java:1005)
	at sun.misc.Resource.cachedInputStream(Resource.java:77)
	at sun.misc.Resource.getByteBuffer(Resource.java:160)
	at java.net.URLClassLoader.defineClass(URLClassLoader.java:266)
	at java.net.URLClassLoader.access$000(URLClassLoader.java:73)
	at java.net.URLClassLoader$1.run(URLClassLoader.java:212)


FAILED:  <init>.org.apache.lucene.search.spans.TestSpansAdvanced

Error Message:
org.apache.lucene.search.spans.TestSpansAdvanced

Stack Trace:
java.lang.ClassNotFoundException: org.apache.lucene.search.spans.TestSpansAdvanced
	at java.net.URLClassLoader$1.run(URLClassLoader.java:214)
	at java.security.AccessController.doPrivileged(Native Method)
	at java.net.URLClassLoader.findClass(URLClassLoader.java:205)
	at java.lang.ClassLoader.loadClass(ClassLoader.java:321)
	at sun.misc.Launcher$AppClassLoader.loadClass(Launcher.java:294)
	at java.lang.ClassLoader.loadClass(ClassLoader.java:266)
	at java.lang.Class.forName0(Native Method)
	at java.lang.Class.forName(Class.java:186)
Caused by: java.io.FileNotFoundException: /usr/home/hudson/hudson-slave/workspace/Lucene-Solr-tests-only-trunk/checkout/lucene/build/classes/test/org/apache/lucene/search/spans/TestSpansAdvanced.class
(Too many open files in system)
	at java.io.FileInputStream.open(Native Method)
	at java.io.FileInputStream.<init>(FileInputStream.java:137)
	at sun.misc.URLClassPath$FileLoader$1.getInputStream(URLClassPath.java:1005)
	at sun.misc.Resource.cachedInputStream(Resource.java:77)
	at sun.misc.Resource.getByteBuffer(Resource.java:160)
	at java.net.URLClassLoader.defineClass(URLClassLoader.java:266)
	at java.net.URLClassLoader.access$000(URLClassLoader.java:73)
	at java.net.URLClassLoader$1.run(URLClassLoader.java:212)


FAILED:  <init>.org.apache.lucene.store.TestCopyBytes

Error Message:
org.apache.lucene.store.TestCopyBytes

Stack Trace:
java.lang.ClassNotFoundException: org.apache.lucene.store.TestCopyBytes
	at java.net.URLClassLoader$1.run(URLClassLoader.java:214)
	at java.security.AccessController.doPrivileged(Native Method)
	at java.net.URLClassLoader.findClass(URLClassLoader.java:205)
	at java.lang.ClassLoader.loadClass(ClassLoader.java:321)
	at sun.misc.Launcher$AppClassLoader.loadClass(Launcher.java:294)
	at java.lang.ClassLoader.loadClass(ClassLoader.java:266)
	at java.lang.Class.forName0(Native Method)
	at java.lang.Class.forName(Class.java:186)
Caused by: java.io.FileNotFoundException: /usr/home/hudson/hudson-slave/workspace/Lucene-Solr-tests-only-trunk/checkout/lucene/build/classes/test/org/apache/lucene/store/TestCopyBytes.class
(Too many open files in system)
	at java.io.FileInputStream.open(Native Method)
	at java.io.FileInputStream.<init>(FileInputStream.java:137)
	at sun.misc.URLClassPath$FileLoader$1.getInputStream(URLClassPath.java:1005)
	at sun.misc.Resource.cachedInputStream(Resource.java:77)
	at sun.misc.Resource.getByteBuffer(Resource.java:160)
	at java.net.URLClassLoader.defineClass(URLClassLoader.java:266)
	at java.net.URLClassLoader.access$000(URLClassLoader.java:73)
	at java.net.URLClassLoader$1.run(URLClassLoader.java:212)


REGRESSION:  org.apache.lucene.store.TestLockFactory.testStressLocks

Error Message:
org/apache/lucene/util/LuceneTestCase$TwoLongs

Stack Trace:
java.lang.NoClassDefFoundError: org/apache/lucene/util/LuceneTestCase$TwoLongs
	at org.apache.lucene.util.LuceneTestCase.reportAdditionalFailureInfo(LuceneTestCase.java:1110)
	at org.apache.lucene.util.LuceneTestCase$1.failed(LuceneTestCase.java:435)
	at org.apache.lucene.util.LuceneTestCase$LuceneTestCaseRunner.runChild(LuceneTestCase.java:1213)
	at org.apache.lucene.util.LuceneTestCase$LuceneTestCaseRunner.runChild(LuceneTestCase.java:1145)
Caused by: java.lang.ClassNotFoundException: org.apache.lucene.util.LuceneTestCase$TwoLongs
	at java.net.URLClassLoader$1.run(URLClassLoader.java:214)
	at java.security.AccessController.doPrivileged(Native Method)
	at java.net.URLClassLoader.findClass(URLClassLoader.java:205)
	at java.lang.ClassLoader.loadClass(ClassLoader.java:321)
	at sun.misc.Launcher$AppClassLoader.loadClass(Launcher.java:294)
	at java.lang.ClassLoader.loadClass(ClassLoader.java:266)
Caused by: java.io.FileNotFoundException: /usr/home/hudson/hudson-slave/workspace/Lucene-Solr-tests-only-trunk/checkout/lucene/build/classes/test-framework/org/apache/lucene/util/LuceneTestCase$TwoLongs.class
(Too many open files in system)
	at java.io.FileInputStream.open(Native Method)
	at java.io.FileInputStream.<init>(FileInputStream.java:137)
	at sun.misc.URLClassPath$FileLoader$1.getInputStream(URLClassPath.java:1005)
	at sun.misc.Resource.cachedInputStream(Resource.java:77)
	at sun.misc.Resource.getByteBuffer(Resource.java:160)
	at java.net.URLClassLoader.defineClass(URLClassLoader.java:266)
	at java.net.URLClassLoader.access$000(URLClassLoader.java:73)
	at java.net.URLClassLoader$1.run(URLClassLoader.java:212)


REGRESSION:  org.apache.lucene.store.TestLockFactory.testStressLocksNativeFSLockFactory

Error Message:
org/apache/lucene/util/LuceneTestCase$TwoLongs

Stack Trace:
java.lang.NoClassDefFoundError: org/apache/lucene/util/LuceneTestCase$TwoLongs
	at org.apache.lucene.util.LuceneTestCase.reportAdditionalFailureInfo(LuceneTestCase.java:1110)
	at org.apache.lucene.util.LuceneTestCase$1.failed(LuceneTestCase.java:435)
	at org.apache.lucene.util.LuceneTestCase$LuceneTestCaseRunner.runChild(LuceneTestCase.java:1213)
	at org.apache.lucene.util.LuceneTestCase$LuceneTestCaseRunner.runChild(LuceneTestCase.java:1145)


FAILED:  <init>.org.apache.lucene.util.TestBitVector

Error Message:
org.apache.lucene.util.TestBitVector

Stack Trace:
java.lang.ClassNotFoundException: org.apache.lucene.util.TestBitVector
	at java.net.URLClassLoader$1.run(URLClassLoader.java:214)
	at java.security.AccessController.doPrivileged(Native Method)
	at java.net.URLClassLoader.findClass(URLClassLoader.java:205)
	at java.lang.ClassLoader.loadClass(ClassLoader.java:321)
	at sun.misc.Launcher$AppClassLoader.loadClass(Launcher.java:294)
	at java.lang.ClassLoader.loadClass(ClassLoader.java:266)
	at java.lang.Class.forName0(Native Method)
	at java.lang.Class.forName(Class.java:186)
Caused by: java.io.FileNotFoundException: /usr/home/hudson/hudson-slave/workspace/Lucene-Solr-tests-only-trunk/checkout/lucene/build/classes/test/org/apache/lucene/util/TestBitVector.class
(Too many open files in system)
	at java.io.FileInputStream.open(Native Method)
	at java.io.FileInputStream.<init>(FileInputStream.java:137)
	at sun.misc.URLClassPath$FileLoader$1.getInputStream(URLClassPath.java:1005)
	at sun.misc.Resource.cachedInputStream(Resource.java:77)
	at sun.misc.Resource.getByteBuffer(Resource.java:160)
	at java.net.URLClassLoader.defineClass(URLClassLoader.java:266)
	at java.net.URLClassLoader.access$000(URLClassLoader.java:73)
	at java.net.URLClassLoader$1.run(URLClassLoader.java:212)


FAILED:  <init>.org.apache.lucene.util.TestBytesRefHash

Error Message:
org.apache.lucene.util.TestBytesRefHash

Stack Trace:
java.lang.ClassNotFoundException: org.apache.lucene.util.TestBytesRefHash
	at java.net.URLClassLoader$1.run(URLClassLoader.java:214)
	at java.security.AccessController.doPrivileged(Native Method)
	at java.net.URLClassLoader.findClass(URLClassLoader.java:205)
	at java.lang.ClassLoader.loadClass(ClassLoader.java:321)
	at sun.misc.Launcher$AppClassLoader.loadClass(Launcher.java:294)
	at java.lang.ClassLoader.loadClass(ClassLoader.java:266)
	at java.lang.Class.forName0(Native Method)
	at java.lang.Class.forName(Class.java:186)
Caused by: java.io.FileNotFoundException: /usr/home/hudson/hudson-slave/workspace/Lucene-Solr-tests-only-trunk/checkout/lucene/build/classes/test/org/apache/lucene/util/TestBytesRefHash.class
(Too many open files in system)
	at java.io.FileInputStream.open(Native Method)
	at java.io.FileInputStream.<init>(FileInputStream.java:137)
	at sun.misc.URLClassPath$FileLoader$1.getInputStream(URLClassPath.java:1005)
	at sun.misc.Resource.cachedInputStream(Resource.java:77)
	at sun.misc.Resource.getByteBuffer(Resource.java:160)
	at java.net.URLClassLoader.defineClass(URLClassLoader.java:266)
	at java.net.URLClassLoader.access$000(URLClassLoader.java:73)
	at java.net.URLClassLoader$1.run(URLClassLoader.java:212)


FAILED:  <init>.org.apache.lucene.util.automaton.TestDeterminism

Error Message:
org.apache.lucene.util.automaton.TestDeterminism

Stack Trace:
java.lang.ClassNotFoundException: org.apache.lucene.util.automaton.TestDeterminism
	at java.net.URLClassLoader$1.run(URLClassLoader.java:214)
	at java.security.AccessController.doPrivileged(Native Method)
	at java.net.URLClassLoader.findClass(URLClassLoader.java:205)
	at java.lang.ClassLoader.loadClass(ClassLoader.java:321)
	at sun.misc.Launcher$AppClassLoader.loadClass(Launcher.java:294)
	at java.lang.ClassLoader.loadClass(ClassLoader.java:266)
	at java.lang.Class.forName0(Native Method)
	at java.lang.Class.forName(Class.java:186)
Caused by: java.io.FileNotFoundException: /usr/home/hudson/hudson-slave/workspace/Lucene-Solr-tests-only-trunk/checkout/lucene/build/classes/test/org/apache/lucene/util/automaton/TestDeterminism.class
(Too many open files in system)
	at java.io.FileInputStream.open(Native Method)
	at java.io.FileInputStream.<init>(FileInputStream.java:137)
	at sun.misc.URLClassPath$FileLoader$1.getInputStream(URLClassPath.java:1005)
	at sun.misc.Resource.cachedInputStream(Resource.java:77)
	at sun.misc.Resource.getByteBuffer(Resource.java:160)
	at java.net.URLClassLoader.defineClass(URLClassLoader.java:266)
	at java.net.URLClassLoader.access$000(URLClassLoader.java:73)
	at java.net.URLClassLoader$1.run(URLClassLoader.java:212)




Build Log (for compile errors):
[...truncated 5479 lines...]



---------------------------------------------------------------------
To unsubscribe, e-mail: dev-unsubscribe@lucene.apache.org
For additional commands, e-mail: dev-help@lucene.apache.org


Mime
View raw message