lucene-dev mailing list archives

Site index · List index
Message view « Date » · « Thread »
Top « Date » · « Thread »
From Apache Hudson Server <hud...@hudson.apache.org>
Subject Lucene-Solr-tests-only-trunk - Build # 1145 - Failure
Date Mon, 08 Nov 2010 21:27:54 GMT
Build: https://hudson.apache.org/hudson/job/Lucene-Solr-tests-only-trunk/1145/

4 tests failed.
FAILED:  junit.framework.TestSuite.org.apache.lucene.search.TestNumericRangeQuery64

Error Message:
this writer hit an OutOfMemoryError; cannot complete optimize

Stack Trace:
java.lang.IllegalStateException: this writer hit an OutOfMemoryError; cannot complete optimize
	at org.apache.lucene.index.IndexWriter.optimize(IndexWriter.java:2394)
	at org.apache.lucene.index.IndexWriter.optimize(IndexWriter.java:2346)
	at org.apache.lucene.index.IndexWriter.optimize(IndexWriter.java:2316)
	at org.apache.lucene.index.RandomIndexWriter.getReader(RandomIndexWriter.java:129)
	at org.apache.lucene.search.TestNumericRangeQuery64.beforeClass(TestNumericRangeQuery64.java:90)


FAILED:  junit.framework.TestSuite.org.apache.lucene.search.TestNumericRangeQuery64

Error Message:
null

Stack Trace:
java.lang.NullPointerException
	at org.apache.lucene.search.TestNumericRangeQuery64.afterClass(TestNumericRangeQuery64.java:97)


FAILED:  junit.framework.TestSuite.org.apache.lucene.search.TestNumericRangeQuery64

Error Message:
directory of test was not closed, opened from: org.apache.lucene.util.LuceneTestCase.newDirectory(LuceneTestCase.java:653)

Stack Trace:
junit.framework.AssertionFailedError: directory of test was not closed, opened from: org.apache.lucene.util.LuceneTestCase.newDirectory(LuceneTestCase.java:653)
	at org.apache.lucene.util.LuceneTestCase.afterClassLuceneTestCaseJ4(LuceneTestCase.java:331)


REGRESSION:  org.apache.lucene.search.TestPrefixFilter.testPrefixFilter

Error Message:
ConcurrentMergeScheduler hit unhandled exceptions

Stack Trace:
junit.framework.AssertionFailedError: ConcurrentMergeScheduler hit unhandled exceptions
	at org.apache.lucene.util.LuceneTestCase$LuceneTestCaseRunner.runChild(LuceneTestCase.java:878)
	at org.apache.lucene.util.LuceneTestCase$LuceneTestCaseRunner.runChild(LuceneTestCase.java:844)
	at org.apache.lucene.util.LuceneTestCase.tearDown(LuceneTestCase.java:458)




Build Log (for compile errors):
[...truncated 3116 lines...]



---------------------------------------------------------------------
To unsubscribe, e-mail: dev-unsubscribe@lucene.apache.org
For additional commands, e-mail: dev-help@lucene.apache.org


Mime
View raw message