lucene-dev mailing list archives

Site index · List index
Message view « Date » · « Thread »
Top « Date » · « Thread »
From Apache Hudson Server <hud...@hudson.apache.org>
Subject Lucene-Solr-tests-only-trunk - Build # 1107 - Failure
Date Mon, 08 Nov 2010 00:59:10 GMT
Build: https://hudson.apache.org/hudson/job/Lucene-Solr-tests-only-trunk/1107/

3 tests failed.
FAILED:  junit.framework.TestSuite.org.apache.lucene.search.TestNumericRangeQuery64

Error Message:
Java heap space

Stack Trace:
java.lang.OutOfMemoryError: Java heap space
	at org.apache.lucene.store.RAMFile.newBuffer(RAMFile.java:89)
	at org.apache.lucene.store.RAMFile.addBuffer(RAMFile.java:62)
	at org.apache.lucene.store.RAMOutputStream.switchCurrentBuffer(RAMOutputStream.java:132)
	at org.apache.lucene.store.RAMOutputStream.copyBytes(RAMOutputStream.java:171)
	at org.apache.lucene.store.MockIndexOutputWrapper.copyBytes(MockIndexOutputWrapper.java:134)
	at org.apache.lucene.index.CompoundFileWriter.copyFile(CompoundFileWriter.java:222)
	at org.apache.lucene.index.CompoundFileWriter.close(CompoundFileWriter.java:188)
	at org.apache.lucene.index.SegmentMerger.createCompoundFile(SegmentMerger.java:212)
	at org.apache.lucene.index.IndexWriter.mergeMiddle(IndexWriter.java:4182)
	at org.apache.lucene.index.IndexWriter.merge(IndexWriter.java:3659)
	at org.apache.lucene.index.SerialMergeScheduler.merge(SerialMergeScheduler.java:37)
	at org.apache.lucene.index.IndexWriter.maybeMerge(IndexWriter.java:2566)
	at org.apache.lucene.index.IndexWriter.optimize(IndexWriter.java:2387)
	at org.apache.lucene.index.IndexWriter.optimize(IndexWriter.java:2346)
	at org.apache.lucene.index.IndexWriter.optimize(IndexWriter.java:2316)
	at org.apache.lucene.index.RandomIndexWriter.close(RandomIndexWriter.java:145)
	at org.apache.lucene.search.TestNumericRangeQuery64.beforeClass(TestNumericRangeQuery64.java:92)


FAILED:  junit.framework.TestSuite.org.apache.lucene.search.TestNumericRangeQuery64

Error Message:
MockDirectoryWrapper: cannot close: there are still open files: {_3f.pst=1}

Stack Trace:
java.lang.RuntimeException: MockDirectoryWrapper: cannot close: there are still open files:
{_3f.pst=1}
	at org.apache.lucene.store.MockDirectoryWrapper.close(MockDirectoryWrapper.java:343)
	at org.apache.lucene.search.TestNumericRangeQuery64.afterClass(TestNumericRangeQuery64.java:101)
Caused by: java.lang.RuntimeException: unclosed IndexInput
	at org.apache.lucene.store.MockDirectoryWrapper.openInput(MockDirectoryWrapper.java:300)
	at org.apache.lucene.index.codecs.simpletext.SimpleTextFieldsReader.<init>(SimpleTextFieldsReader.java:57)
	at org.apache.lucene.index.codecs.simpletext.SimpleTextCodec.fieldsProducer(SimpleTextCodec.java:53)
	at org.apache.lucene.index.SegmentReader$CoreReaders.<init>(SegmentReader.java:136)
	at org.apache.lucene.index.SegmentReader.get(SegmentReader.java:536)
	at org.apache.lucene.index.IndexWriter$ReaderPool.get(IndexWriter.java:626)
	at org.apache.lucene.index.IndexWriter.mergeMiddle(IndexWriter.java:4114)
	at org.apache.lucene.index.IndexWriter.merge(IndexWriter.java:3659)
	at org.apache.lucene.index.SerialMergeScheduler.merge(SerialMergeScheduler.java:37)
	at org.apache.lucene.index.IndexWriter.maybeMerge(IndexWriter.java:2566)
	at org.apache.lucene.index.IndexWriter.optimize(IndexWriter.java:2387)
	at org.apache.lucene.index.IndexWriter.optimize(IndexWriter.java:2346)
	at org.apache.lucene.index.IndexWriter.optimize(IndexWriter.java:2316)
	at org.apache.lucene.index.RandomIndexWriter.close(RandomIndexWriter.java:145)
	at org.apache.lucene.search.TestNumericRangeQuery64.beforeClass(TestNumericRangeQuery64.java:92)


FAILED:  junit.framework.TestSuite.org.apache.lucene.search.TestNumericRangeQuery64

Error Message:
directory of test was not closed, opened from: org.apache.lucene.util.LuceneTestCase.newDirectory(LuceneTestCase.java:653)

Stack Trace:
junit.framework.AssertionFailedError: directory of test was not closed, opened from: org.apache.lucene.util.LuceneTestCase.newDirectory(LuceneTestCase.java:653)
	at org.apache.lucene.util.LuceneTestCase.afterClassLuceneTestCaseJ4(LuceneTestCase.java:331)




Build Log (for compile errors):
[...truncated 3113 lines...]



---------------------------------------------------------------------
To unsubscribe, e-mail: dev-unsubscribe@lucene.apache.org
For additional commands, e-mail: dev-help@lucene.apache.org


Mime
View raw message