lucene-dev mailing list archives

Site index · List index
Message view « Date » · « Thread »
Top « Date » · « Thread »
From Apache Hudson Server <hud...@hudson.apache.org>
Subject Lucene-Solr-tests-only-trunk - Build # 1067 - Failure
Date Sat, 06 Nov 2010 18:04:52 GMT
Build: https://hudson.apache.org/hudson/job/Lucene-Solr-tests-only-trunk/1067/

14 tests failed.
REGRESSION:  org.apache.solr.cloud.BasicDistributedZkTest.testDistribSearch

Error Message:
Severe errors in solr configuration.  Check your log files for more detailed information on
what may be wrong.  ------------------------------------------------------------- org.apache.solr.common.cloud.ZooKeeperException:
  at org.apache.solr.cloud.ZkController.init(ZkController.java:301)  at org.apache.solr.cloud.ZkController.<init>(ZkController.java:133)
 at org.apache.solr.core.CoreContainer.initZooKeeper(CoreContainer.java:159)  at org.apache.solr.core.CoreContainer.load(CoreContainer.java:338)
 at org.apache.solr.core.CoreContainer.load(CoreContainer.java:294)  at org.apache.solr.core.CoreContainer$Initializer.initialize(CoreContainer.java:243)
 at org.apache.solr.servlet.SolrDispatchFilter.init(SolrDispatchFilter.java:86)  at org.mortbay.jetty.servlet.FilterHolder.doStart(FilterHolder.java:97)
 at org.mortbay.component.AbstractLifeCycle.start(AbstractLifeCycle.java:50)  at org.mortbay.jetty.servlet.ServletHandler.initialize(ServletHandler.java:662)
 at org.mortbay.jetty.servlet.ServletHandler.updateMappings(ServletHandler.java:1053)  at
org.mortbay.jetty.servlet.ServletHandler.setFilterMappings(ServletHandler.java:1089)  at org.mortbay.jetty.servlet.ServletHandler.addFilterWithMapping(ServletHandler.java:889)
 at org.mortbay.jetty.servlet.ServletHandler.addFilterWithMapping(ServletHandler.java:844)
 at org.mortbay.jetty.servlet.Context.addFilter(Context.java:207)  at org.apache.solr.client.solrj.embedded.JettySolrRunner$1.lifeCycleStarted(JettySolrRunner.java:97)
 at org.mortbay.component.AbstractLifeCycle.setStarted(AbstractLifeCycle.java:140)  at org.mortbay.component.AbstractLifeCycle.start(AbstractLifeCycle.java:52)
 at org.apache.solr.client.solrj.embedded.JettySolrRunner.start(JettySolrRunner.java:122)
 at org.apache.solr.client.solrj.embedded.JettySolrRunner.start(JettySolrRunner.java:117)
 at org.apache.solr.BaseDistributedSearchTestCase.createJetty(BaseDistributedSearchTestCase.java:215)
 at org.apache.solr.BaseDistributedSearchTestCase.createJetty(BaseDistributedSearchTestCase.java:206)
 at org.a  Severe errors in solr configuration.  Check your log files for more detailed information
on what may be wrong.  ------------------------------------------------------------- org.apache.solr.common.cloud.ZooKeeperException:
  at org.apache.solr.cloud.ZkController.init(ZkController.java:301)  at org.apache.solr.cloud.ZkController.<init>(ZkController.java:133)
 at org.apache.solr.core.CoreContainer.initZooKeeper(CoreContainer.java:159)  at org.apache.solr.core.CoreContainer.load(CoreContainer.java:338)
 at org.apache.solr.core.CoreContainer.load(CoreContainer.java:294)  at org.apache.solr.core.CoreContainer$Initializer.initialize(CoreContainer.java:243)
 at org.apache.solr.servlet.SolrDispatchFilter.init(SolrDispatchFilter.java:86)  at org.mortbay.jetty.servlet.FilterHolder.doStart(FilterHolder.java:97)
 at org.mortbay.component.AbstractLifeCycle.start(AbstractLifeCycle.java:50)  at org.mortbay.jetty.servlet.ServletHandler.initialize(ServletHandler.java:662)
 at org.mortbay.jetty.servlet.ServletHandler.updateMappings(ServletHandler.java:1053)  at
org.mortbay.jetty.servlet.ServletHandler.setFilterMappings(ServletHandler.java:1089)  at org.mortbay.jetty.servlet.ServletHandler.addFilterWithMapping(ServletHandler.java:889)
 at org.mortbay.jetty.servlet.ServletHandler.addFilterWithMapping(ServletHandler.java:844)
 at org.mortbay.jetty.servlet.Context.addFilter(Context.java:207)  at org.apache.solr.client.solrj.embedded.JettySolrRunner$1.lifeCycleStarted(JettySolrRunner.java:97)
 at org.mortbay.component.AbstractLifeCycle.setStarted(AbstractLifeCycle.java:140)  at org.mortbay.component.AbstractLifeCycle.start(AbstractLifeCycle.java:52)
 at org.apache.solr.client.solrj.embedded.JettySolrRunner.start(JettySolrRunner.java:122)
 at org.apache.solr.client.solrj.embedded.JettySolrRunner.start(JettySolrRunner.java:117)
 at org.apache.solr.BaseDistributedSearchTestCase.createJetty(BaseDistributedSearchTestCase.java:215)
 at org.apache.solr.BaseDistributedSearchTestCase.createJetty(BaseDistributedSearchTestCase.java:206)
 at org.a  request: http://localhost:10971/solr/update?wt=javabin&version=2

Stack Trace:


request: http://localhost:10971/solr/update?wt=javabin&version=2
	at org.apache.solr.client.solrj.impl.CommonsHttpSolrServer.request(CommonsHttpSolrServer.java:435)
	at org.apache.solr.client.solrj.impl.CommonsHttpSolrServer.request(CommonsHttpSolrServer.java:244)
	at org.apache.solr.client.solrj.request.AbstractUpdateRequest.process(AbstractUpdateRequest.java:105)
	at org.apache.solr.client.solrj.SolrServer.deleteByQuery(SolrServer.java:111)
	at org.apache.solr.BaseDistributedSearchTestCase.del(BaseDistributedSearchTestCase.java:275)
	at org.apache.solr.cloud.BasicDistributedZkTest.doTest(BasicDistributedZkTest.java:86)
	at org.apache.solr.BaseDistributedSearchTestCase.testDistribSearch(BaseDistributedSearchTestCase.java:562)
	at org.apache.lucene.util.LuceneTestCase$LuceneTestCaseRunner.runChild(LuceneTestCase.java:878)
	at org.apache.lucene.util.LuceneTestCase$LuceneTestCaseRunner.runChild(LuceneTestCase.java:844)


REGRESSION:  org.apache.solr.cloud.CloudStateUpdateTest.testCoreRegistration

Error Message:
null

Stack Trace:
org.apache.solr.common.cloud.ZooKeeperException: 
	at org.apache.solr.core.CoreContainer.initZooKeeper(CoreContainer.java:178)
	at org.apache.solr.core.CoreContainer.load(CoreContainer.java:338)
	at org.apache.solr.core.CoreContainer.load(CoreContainer.java:294)
	at org.apache.solr.core.CoreContainer$Initializer.initialize(CoreContainer.java:243)
	at org.apache.solr.cloud.CloudStateUpdateTest.setUp(CloudStateUpdateTest.java:131)
	at org.apache.lucene.util.LuceneTestCase$LuceneTestCaseRunner.runChild(LuceneTestCase.java:878)
	at org.apache.lucene.util.LuceneTestCase$LuceneTestCaseRunner.runChild(LuceneTestCase.java:844)
Caused by: java.util.concurrent.TimeoutException: Could not connect to ZooKeeper 127.0.0.1:10917/solr
within 5000 ms
	at org.apache.solr.common.cloud.ConnectionManager.waitForConnected(ConnectionManager.java:124)
	at org.apache.solr.common.cloud.SolrZkClient.<init>(SolrZkClient.java:122)
	at org.apache.solr.common.cloud.SolrZkClient.<init>(SolrZkClient.java:69)
	at org.apache.solr.cloud.ZkController.<init>(ZkController.java:104)
	at org.apache.solr.core.CoreContainer.initZooKeeper(CoreContainer.java:159)


REGRESSION:  org.apache.solr.handler.TestReplicationHandler.testReplicateAfterWrite2Slave

Error Message:
http://localhost:11041/solr/replication?command=disableReplication

Stack Trace:
java.io.FileNotFoundException: http://localhost:11041/solr/replication?command=disableReplication
	at sun.net.www.protocol.http.HttpURLConnection.getInputStream(HttpURLConnection.java:1267)
	at java.net.URL.openStream(URL.java:1029)
	at org.apache.solr.handler.TestReplicationHandler.testReplicateAfterWrite2Slave(TestReplicationHandler.java:173)
	at org.apache.lucene.util.LuceneTestCase$LuceneTestCaseRunner.runChild(LuceneTestCase.java:878)
	at org.apache.lucene.util.LuceneTestCase$LuceneTestCaseRunner.runChild(LuceneTestCase.java:844)


REGRESSION:  org.apache.solr.handler.TestReplicationHandler.testIndexAndConfigReplication

Error Message:
expected:<498> but was:<499>

Stack Trace:
junit.framework.AssertionFailedError: expected:<498> but was:<499>
	at org.apache.lucene.util.LuceneTestCase$LuceneTestCaseRunner.runChild(LuceneTestCase.java:878)
	at org.apache.lucene.util.LuceneTestCase$LuceneTestCaseRunner.runChild(LuceneTestCase.java:844)
	at org.apache.solr.handler.TestReplicationHandler.testIndexAndConfigReplication(TestReplicationHandler.java:240)


REGRESSION:  org.apache.solr.handler.TestReplicationHandler.testStopPoll

Error Message:
expected:<497> but was:<0>

Stack Trace:
junit.framework.AssertionFailedError: expected:<497> but was:<0>
	at org.apache.lucene.util.LuceneTestCase$LuceneTestCaseRunner.runChild(LuceneTestCase.java:878)
	at org.apache.lucene.util.LuceneTestCase$LuceneTestCaseRunner.runChild(LuceneTestCase.java:844)
	at org.apache.solr.handler.TestReplicationHandler.testStopPoll(TestReplicationHandler.java:303)


REGRESSION:  org.apache.solr.handler.TestReplicationHandler.testSnapPullWithMasterUrl

Error Message:
http://localhost:11200/solr/replication?command=fetchindex&masterUrl=http://localhost:11041/solr/replication

Stack Trace:
java.io.FileNotFoundException: http://localhost:11200/solr/replication?command=fetchindex&masterUrl=http://localhost:11041/solr/replication
	at sun.net.www.protocol.http.HttpURLConnection.getInputStream(HttpURLConnection.java:1267)
	at java.net.URL.openStream(URL.java:1029)
	at org.apache.solr.handler.TestReplicationHandler.testSnapPullWithMasterUrl(TestReplicationHandler.java:375)
	at org.apache.lucene.util.LuceneTestCase$LuceneTestCaseRunner.runChild(LuceneTestCase.java:878)
	at org.apache.lucene.util.LuceneTestCase$LuceneTestCaseRunner.runChild(LuceneTestCase.java:844)


REGRESSION:  org.apache.solr.handler.TestReplicationHandler.testReplicateAfterStartup

Error Message:
expected:<495> but was:<0>

Stack Trace:
junit.framework.AssertionFailedError: expected:<495> but was:<0>
	at org.apache.lucene.util.LuceneTestCase$LuceneTestCaseRunner.runChild(LuceneTestCase.java:878)
	at org.apache.lucene.util.LuceneTestCase$LuceneTestCaseRunner.runChild(LuceneTestCase.java:844)
	at org.apache.solr.handler.TestReplicationHandler.testReplicateAfterStartup(TestReplicationHandler.java:433)


REGRESSION:  org.apache.solr.handler.TestReplicationHandler.testIndexAndConfigAliasReplication

Error Message:
expected:<494> but was:<0>

Stack Trace:
junit.framework.AssertionFailedError: expected:<494> but was:<0>
	at org.apache.lucene.util.LuceneTestCase$LuceneTestCaseRunner.runChild(LuceneTestCase.java:878)
	at org.apache.lucene.util.LuceneTestCase$LuceneTestCaseRunner.runChild(LuceneTestCase.java:844)
	at org.apache.solr.handler.TestReplicationHandler.testIndexAndConfigAliasReplication(TestReplicationHandler.java:471)


REGRESSION:  org.apache.solr.handler.TestReplicationHandler.testBackup

Error Message:
http://localhost:29213/solr/replication?command=details

Stack Trace:
junit.framework.AssertionFailedError: http://localhost:29213/solr/replication?command=details
	at org.apache.lucene.util.LuceneTestCase$LuceneTestCaseRunner.runChild(LuceneTestCase.java:878)
	at org.apache.lucene.util.LuceneTestCase$LuceneTestCaseRunner.runChild(LuceneTestCase.java:844)
	at org.apache.solr.handler.TestReplicationHandler.testBackup(TestReplicationHandler.java:592)


FAILED:  junit.framework.TestSuite.org.apache.solr.handler.component.QueryElevationComponentTest

Error Message:
org.apache.solr.common.SolrException: Error initializing QueryElevationComponent.

Stack Trace:
java.lang.RuntimeException: org.apache.solr.common.SolrException: Error initializing QueryElevationComponent.
	at org.apache.solr.util.TestHarness.<init>(TestHarness.java:152)
	at org.apache.solr.util.TestHarness.<init>(TestHarness.java:134)
	at org.apache.solr.util.TestHarness.<init>(TestHarness.java:124)
	at org.apache.solr.SolrTestCaseJ4.initCore(SolrTestCaseJ4.java:233)
	at org.apache.solr.SolrTestCaseJ4.initCore(SolrTestCaseJ4.java:96)
	at org.apache.solr.SolrTestCaseJ4.initCore(SolrTestCaseJ4.java:84)
	at org.apache.solr.handler.component.QueryElevationComponentTest.beforeClass(QueryElevationComponentTest.java:50)
Caused by: org.apache.solr.common.SolrException: Error initializing QueryElevationComponent.
	at org.apache.solr.handler.component.QueryElevationComponent.inform(QueryElevationComponent.java:212)
	at org.apache.solr.core.SolrResourceLoader.inform(SolrResourceLoader.java:539)
	at org.apache.solr.core.SolrCore.<init>(SolrCore.java:592)
	at org.apache.solr.util.TestHarness$Initializer.initialize(TestHarness.java:190)
	at org.apache.solr.util.TestHarness.<init>(TestHarness.java:139)
Caused by: java.io.FileNotFoundException: /usr/home/hudson/hudson-slave/workspace/Lucene-Solr-tests-only-trunk/checkout/solr/build/test-results/temp/2/solrtest-QueryElevationComponentTest-1289066642084/elevate.xml
(No such file or directory)
	at java.io.FileInputStream.open(Native Method)
	at java.io.FileInputStream.<init>(FileInputStream.java:137)
	at org.apache.solr.util.VersionedFile.getLatestFile(VersionedFile.java:79)
	at org.apache.solr.handler.component.QueryElevationComponent.getElevationMap(QueryElevationComponent.java:232)
	at org.apache.solr.handler.component.QueryElevationComponent.inform(QueryElevationComponent.java:204)


FAILED:  junit.framework.TestSuite.org.apache.solr.handler.component.QueryElevationComponentTest

Error Message:
ERROR: SolrIndexSearcher opens=1 closes=0

Stack Trace:
junit.framework.AssertionFailedError: ERROR: SolrIndexSearcher opens=1 closes=0
	at org.apache.solr.SolrTestCaseJ4.endTrackingSearchers(SolrTestCaseJ4.java:114)
	at org.apache.solr.SolrTestCaseJ4.deleteCore(SolrTestCaseJ4.java:288)
	at org.apache.solr.SolrTestCaseJ4.afterClassSolrTestCase(SolrTestCaseJ4.java:65)


REGRESSION:  org.apache.solr.servlet.NoCacheHeaderTest.testLastModified

Error Message:
Unknown request response expected:<0> but was:<500>

Stack Trace:
junit.framework.AssertionFailedError: Unknown request response expected:<0> but was:<500>
	at org.apache.lucene.util.LuceneTestCase$LuceneTestCaseRunner.runChild(LuceneTestCase.java:878)
	at org.apache.lucene.util.LuceneTestCase$LuceneTestCaseRunner.runChild(LuceneTestCase.java:844)
	at org.apache.solr.servlet.CacheHeaderTestBase.checkResponseBody(CacheHeaderTestBase.java:91)
	at org.apache.solr.servlet.NoCacheHeaderTest.doLastModified(NoCacheHeaderTest.java:64)
	at org.apache.solr.servlet.NoCacheHeaderTest.testLastModified(NoCacheHeaderTest.java:42)


REGRESSION:  org.apache.solr.servlet.NoCacheHeaderTest.testEtag

Error Message:
Unknown request response expected:<0> but was:<500>

Stack Trace:
junit.framework.AssertionFailedError: Unknown request response expected:<0> but was:<500>
	at org.apache.lucene.util.LuceneTestCase$LuceneTestCaseRunner.runChild(LuceneTestCase.java:878)
	at org.apache.lucene.util.LuceneTestCase$LuceneTestCaseRunner.runChild(LuceneTestCase.java:844)
	at org.apache.solr.servlet.CacheHeaderTestBase.checkResponseBody(CacheHeaderTestBase.java:91)
	at org.apache.solr.servlet.NoCacheHeaderTest.doETag(NoCacheHeaderTest.java:113)
	at org.apache.solr.servlet.NoCacheHeaderTest.testEtag(NoCacheHeaderTest.java:48)


REGRESSION:  org.apache.solr.servlet.NoCacheHeaderTest.testCacheControl

Error Message:
Unknown request response expected:<0> but was:<500>

Stack Trace:
junit.framework.AssertionFailedError: Unknown request response expected:<0> but was:<500>
	at org.apache.lucene.util.LuceneTestCase$LuceneTestCaseRunner.runChild(LuceneTestCase.java:878)
	at org.apache.lucene.util.LuceneTestCase$LuceneTestCaseRunner.runChild(LuceneTestCase.java:844)
	at org.apache.solr.servlet.CacheHeaderTestBase.checkResponseBody(CacheHeaderTestBase.java:91)
	at org.apache.solr.servlet.NoCacheHeaderTest.doCacheControl(NoCacheHeaderTest.java:161)
	at org.apache.solr.servlet.NoCacheHeaderTest.testCacheControl(NoCacheHeaderTest.java:54)




Build Log (for compile errors):
[...truncated 9702 lines...]



---------------------------------------------------------------------
To unsubscribe, e-mail: dev-unsubscribe@lucene.apache.org
For additional commands, e-mail: dev-help@lucene.apache.org


Mime
View raw message