lucene-dev mailing list archives

Site index · List index
Message view « Date » · « Thread »
Top « Date » · « Thread »
From Apache Hudson Server <hud...@hudson.apache.org>
Subject Lucene-Solr-tests-only-3.x - Build # 1953 - Failure
Date Mon, 29 Nov 2010 16:10:10 GMT
Build: https://hudson.apache.org/hudson/job/Lucene-Solr-tests-only-3.x/1953/

247 tests failed.
REGRESSION:  org.apache.lucene.TestMergeSchedulerExternal.testSubclassConcurrentMergeScheduler

Error Message:
fileMap

Stack Trace:
java.lang.NoSuchFieldError: fileMap
	at org.apache.lucene.store.MockRAMDirectory.openInput(MockRAMDirectory.java:234)
	at org.apache.lucene.index.SegmentInfos$FindSegmentsFile.run(SegmentInfos.java:591)
	at org.apache.lucene.index.SegmentInfos$FindSegmentsFile.run(SegmentInfos.java:524)
	at org.apache.lucene.index.SegmentInfos.read(SegmentInfos.java:307)
	at org.apache.lucene.index.IndexWriter.<init>(IndexWriter.java:1093)
	at org.apache.lucene.index.IndexWriter.<init>(IndexWriter.java:887)
	at org.apache.lucene.TestMergeSchedulerExternal.testSubclassConcurrentMergeScheduler(TestMergeSchedulerExternal.java:98)
	at org.apache.lucene.util.LuceneTestCase.runBare(LuceneTestCase.java:253)


REGRESSION:  org.apache.lucene.document.TestBinaryDocument.testBinaryFieldInIndex

Error Message:
fileMap

Stack Trace:
java.lang.NoSuchFieldError: fileMap
	at org.apache.lucene.store.MockRAMDirectory.openInput(MockRAMDirectory.java:234)
	at org.apache.lucene.index.SegmentInfos$FindSegmentsFile.run(SegmentInfos.java:591)
	at org.apache.lucene.index.SegmentInfos$FindSegmentsFile.run(SegmentInfos.java:524)
	at org.apache.lucene.index.SegmentInfos.read(SegmentInfos.java:307)
	at org.apache.lucene.index.IndexWriter.<init>(IndexWriter.java:1093)
	at org.apache.lucene.index.IndexWriter.<init>(IndexWriter.java:887)
	at org.apache.lucene.document.TestBinaryDocument.testBinaryFieldInIndex(TestBinaryDocument.java:62)
	at org.apache.lucene.util.LuceneTestCase.runBare(LuceneTestCase.java:253)


REGRESSION:  org.apache.lucene.document.TestBinaryDocument.testCompressionTools

Error Message:
fileMap

Stack Trace:
java.lang.NoSuchFieldError: fileMap
	at org.apache.lucene.store.MockRAMDirectory.openInput(MockRAMDirectory.java:234)
	at org.apache.lucene.index.SegmentInfos$FindSegmentsFile.run(SegmentInfos.java:591)
	at org.apache.lucene.index.SegmentInfos$FindSegmentsFile.run(SegmentInfos.java:524)
	at org.apache.lucene.index.SegmentInfos.read(SegmentInfos.java:307)
	at org.apache.lucene.index.IndexWriter.<init>(IndexWriter.java:1093)
	at org.apache.lucene.index.IndexWriter.<init>(IndexWriter.java:887)
	at org.apache.lucene.document.TestBinaryDocument.testCompressionTools(TestBinaryDocument.java:100)
	at org.apache.lucene.util.LuceneTestCase.runBare(LuceneTestCase.java:253)


REGRESSION:  org.apache.lucene.index.TestAddIndexesNoOptimize.testHangOnClose

Error Message:
fileMap

Stack Trace:
java.lang.NoSuchFieldError: fileMap
	at org.apache.lucene.store.MockRAMDirectory.openInput(MockRAMDirectory.java:234)
	at org.apache.lucene.index.SegmentInfos$FindSegmentsFile.run(SegmentInfos.java:591)
	at org.apache.lucene.index.SegmentInfos$FindSegmentsFile.run(SegmentInfos.java:524)
	at org.apache.lucene.index.SegmentInfos.read(SegmentInfos.java:307)
	at org.apache.lucene.index.IndexWriter.<init>(IndexWriter.java:1093)
	at org.apache.lucene.index.IndexWriter.<init>(IndexWriter.java:887)
	at org.apache.lucene.index.TestAddIndexesNoOptimize.testHangOnClose(TestAddIndexesNoOptimize.java:497)
	at org.apache.lucene.util.LuceneTestCase.runBare(LuceneTestCase.java:253)


REGRESSION:  org.apache.lucene.index.TestAtomicUpdate.testAtomicUpdates

Error Message:
fileMap

Stack Trace:
java.lang.NoSuchFieldError: fileMap
	at org.apache.lucene.store.MockRAMDirectory.openInput(MockRAMDirectory.java:234)
	at org.apache.lucene.index.SegmentInfos$FindSegmentsFile.run(SegmentInfos.java:591)
	at org.apache.lucene.index.SegmentInfos$FindSegmentsFile.run(SegmentInfos.java:524)
	at org.apache.lucene.index.SegmentInfos.read(SegmentInfos.java:307)
	at org.apache.lucene.index.IndexWriter.<init>(IndexWriter.java:1093)
	at org.apache.lucene.index.IndexWriter.<init>(IndexWriter.java:887)
	at org.apache.lucene.index.TestAtomicUpdate$MockIndexWriter.<init>(TestAtomicUpdate.java:37)
	at org.apache.lucene.index.TestAtomicUpdate.runTest(TestAtomicUpdate.java:133)
	at org.apache.lucene.index.TestAtomicUpdate.testAtomicUpdates(TestAtomicUpdate.java:195)
	at org.apache.lucene.util.LuceneTestCase.runBare(LuceneTestCase.java:253)


REGRESSION:  org.apache.lucene.index.TestCheckIndex.testDeletedDocs

Error Message:
fileMap

Stack Trace:
java.lang.NoSuchFieldError: fileMap
	at org.apache.lucene.store.MockRAMDirectory.openInput(MockRAMDirectory.java:234)
	at org.apache.lucene.index.SegmentInfos$FindSegmentsFile.run(SegmentInfos.java:591)
	at org.apache.lucene.index.SegmentInfos$FindSegmentsFile.run(SegmentInfos.java:524)
	at org.apache.lucene.index.SegmentInfos.read(SegmentInfos.java:307)
	at org.apache.lucene.index.IndexWriter.<init>(IndexWriter.java:1093)
	at org.apache.lucene.index.IndexWriter.<init>(IndexWriter.java:887)
	at org.apache.lucene.index.TestCheckIndex.testDeletedDocs(TestCheckIndex.java:37)
	at org.apache.lucene.util.LuceneTestCase.runBare(LuceneTestCase.java:253)


REGRESSION:  org.apache.lucene.index.TestConcurrentMergeScheduler.testFlushExceptions

Error Message:
fileMap

Stack Trace:
java.lang.NoSuchFieldError: fileMap
	at org.apache.lucene.store.MockRAMDirectory.openInput(MockRAMDirectory.java:234)
	at org.apache.lucene.index.SegmentInfos$FindSegmentsFile.run(SegmentInfos.java:591)
	at org.apache.lucene.index.SegmentInfos$FindSegmentsFile.run(SegmentInfos.java:524)
	at org.apache.lucene.index.SegmentInfos.read(SegmentInfos.java:307)
	at org.apache.lucene.index.IndexWriter.<init>(IndexWriter.java:1093)
	at org.apache.lucene.index.IndexWriter.<init>(IndexWriter.java:887)
	at org.apache.lucene.index.TestConcurrentMergeScheduler.testFlushExceptions(TestConcurrentMergeScheduler.java:72)
	at org.apache.lucene.util.LuceneTestCase.runBare(LuceneTestCase.java:253)


REGRESSION:  org.apache.lucene.index.TestConcurrentMergeScheduler.testNoExtraFiles

Error Message:
fileMap

Stack Trace:
java.lang.NoSuchFieldError: fileMap
	at org.apache.lucene.store.MockRAMDirectory.openInput(MockRAMDirectory.java:234)
	at org.apache.lucene.index.SegmentInfos$FindSegmentsFile.run(SegmentInfos.java:591)
	at org.apache.lucene.index.SegmentInfos$FindSegmentsFile.run(SegmentInfos.java:524)
	at org.apache.lucene.index.SegmentInfos.read(SegmentInfos.java:307)
	at org.apache.lucene.index.IndexWriter.<init>(IndexWriter.java:1093)
	at org.apache.lucene.index.IndexWriter.<init>(IndexWriter.java:887)
	at org.apache.lucene.index.TestConcurrentMergeScheduler.testNoExtraFiles(TestConcurrentMergeScheduler.java:163)
	at org.apache.lucene.util.LuceneTestCase.runBare(LuceneTestCase.java:253)


REGRESSION:  org.apache.lucene.index.TestConcurrentMergeScheduler.testNoWaitClose

Error Message:
fileMap

Stack Trace:
java.lang.NoSuchFieldError: fileMap
	at org.apache.lucene.store.MockRAMDirectory.openInput(MockRAMDirectory.java:234)
	at org.apache.lucene.index.SegmentInfos$FindSegmentsFile.run(SegmentInfos.java:591)
	at org.apache.lucene.index.SegmentInfos$FindSegmentsFile.run(SegmentInfos.java:524)
	at org.apache.lucene.index.SegmentInfos.read(SegmentInfos.java:307)
	at org.apache.lucene.index.IndexWriter.<init>(IndexWriter.java:1093)
	at org.apache.lucene.index.IndexWriter.<init>(IndexWriter.java:887)
	at org.apache.lucene.index.TestConcurrentMergeScheduler.testNoWaitClose(TestConcurrentMergeScheduler.java:195)
	at org.apache.lucene.util.LuceneTestCase.runBare(LuceneTestCase.java:253)


REGRESSION:  org.apache.lucene.index.TestCrash.testCrashWhileIndexing

Error Message:
fileMap

Stack Trace:
java.lang.NoSuchFieldError: fileMap
	at org.apache.lucene.store.MockRAMDirectory.openInput(MockRAMDirectory.java:234)
	at org.apache.lucene.index.SegmentInfos$FindSegmentsFile.run(SegmentInfos.java:591)
	at org.apache.lucene.index.SegmentInfos$FindSegmentsFile.run(SegmentInfos.java:524)
	at org.apache.lucene.index.SegmentInfos.read(SegmentInfos.java:307)
	at org.apache.lucene.index.IndexWriter.<init>(IndexWriter.java:1093)
	at org.apache.lucene.index.IndexWriter.<init>(IndexWriter.java:914)
	at org.apache.lucene.index.TestCrash.initIndex(TestCrash.java:39)
	at org.apache.lucene.index.TestCrash.initIndex(TestCrash.java:33)
	at org.apache.lucene.index.TestCrash.testCrashWhileIndexing(TestCrash.java:65)
	at org.apache.lucene.util.LuceneTestCase.runBare(LuceneTestCase.java:253)


REGRESSION:  org.apache.lucene.index.TestCrash.testWriterAfterCrash

Error Message:
fileMap

Stack Trace:
java.lang.NoSuchFieldError: fileMap
	at org.apache.lucene.store.MockRAMDirectory.openInput(MockRAMDirectory.java:234)
	at org.apache.lucene.index.SegmentInfos$FindSegmentsFile.run(SegmentInfos.java:591)
	at org.apache.lucene.index.SegmentInfos$FindSegmentsFile.run(SegmentInfos.java:524)
	at org.apache.lucene.index.SegmentInfos.read(SegmentInfos.java:307)
	at org.apache.lucene.index.IndexWriter.<init>(IndexWriter.java:1093)
	at org.apache.lucene.index.IndexWriter.<init>(IndexWriter.java:914)
	at org.apache.lucene.index.TestCrash.initIndex(TestCrash.java:39)
	at org.apache.lucene.index.TestCrash.initIndex(TestCrash.java:33)
	at org.apache.lucene.index.TestCrash.testWriterAfterCrash(TestCrash.java:73)
	at org.apache.lucene.util.LuceneTestCase.runBare(LuceneTestCase.java:253)


REGRESSION:  org.apache.lucene.index.TestCrash.testCrashAfterReopen

Error Message:
fileMap

Stack Trace:
java.lang.NoSuchFieldError: fileMap
	at org.apache.lucene.store.MockRAMDirectory.openInput(MockRAMDirectory.java:234)
	at org.apache.lucene.index.SegmentInfos$FindSegmentsFile.run(SegmentInfos.java:591)
	at org.apache.lucene.index.SegmentInfos$FindSegmentsFile.run(SegmentInfos.java:524)
	at org.apache.lucene.index.SegmentInfos.read(SegmentInfos.java:307)
	at org.apache.lucene.index.IndexWriter.<init>(IndexWriter.java:1093)
	at org.apache.lucene.index.IndexWriter.<init>(IndexWriter.java:914)
	at org.apache.lucene.index.TestCrash.initIndex(TestCrash.java:39)
	at org.apache.lucene.index.TestCrash.initIndex(TestCrash.java:33)
	at org.apache.lucene.index.TestCrash.testCrashAfterReopen(TestCrash.java:85)
	at org.apache.lucene.util.LuceneTestCase.runBare(LuceneTestCase.java:253)


REGRESSION:  org.apache.lucene.index.TestCrash.testCrashAfterClose

Error Message:
fileMap

Stack Trace:
java.lang.NoSuchFieldError: fileMap
	at org.apache.lucene.store.MockRAMDirectory.openInput(MockRAMDirectory.java:234)
	at org.apache.lucene.index.SegmentInfos$FindSegmentsFile.run(SegmentInfos.java:591)
	at org.apache.lucene.index.SegmentInfos$FindSegmentsFile.run(SegmentInfos.java:524)
	at org.apache.lucene.index.SegmentInfos.read(SegmentInfos.java:307)
	at org.apache.lucene.index.IndexWriter.<init>(IndexWriter.java:1093)
	at org.apache.lucene.index.IndexWriter.<init>(IndexWriter.java:914)
	at org.apache.lucene.index.TestCrash.initIndex(TestCrash.java:39)
	at org.apache.lucene.index.TestCrash.initIndex(TestCrash.java:33)
	at org.apache.lucene.index.TestCrash.testCrashAfterClose(TestCrash.java:107)
	at org.apache.lucene.util.LuceneTestCase.runBare(LuceneTestCase.java:253)


REGRESSION:  org.apache.lucene.index.TestCrash.testCrashAfterCloseNoWait

Error Message:
fileMap

Stack Trace:
java.lang.NoSuchFieldError: fileMap
	at org.apache.lucene.store.MockRAMDirectory.openInput(MockRAMDirectory.java:234)
	at org.apache.lucene.index.SegmentInfos$FindSegmentsFile.run(SegmentInfos.java:591)
	at org.apache.lucene.index.SegmentInfos$FindSegmentsFile.run(SegmentInfos.java:524)
	at org.apache.lucene.index.SegmentInfos.read(SegmentInfos.java:307)
	at org.apache.lucene.index.IndexWriter.<init>(IndexWriter.java:1093)
	at org.apache.lucene.index.IndexWriter.<init>(IndexWriter.java:914)
	at org.apache.lucene.index.TestCrash.initIndex(TestCrash.java:39)
	at org.apache.lucene.index.TestCrash.initIndex(TestCrash.java:33)
	at org.apache.lucene.index.TestCrash.testCrashAfterCloseNoWait(TestCrash.java:126)
	at org.apache.lucene.util.LuceneTestCase.runBare(LuceneTestCase.java:253)


REGRESSION:  org.apache.lucene.index.TestCrash.testCrashReaderDeletes

Error Message:
fileMap

Stack Trace:
java.lang.NoSuchFieldError: fileMap
	at org.apache.lucene.store.MockRAMDirectory.openInput(MockRAMDirectory.java:234)
	at org.apache.lucene.index.SegmentInfos$FindSegmentsFile.run(SegmentInfos.java:591)
	at org.apache.lucene.index.SegmentInfos$FindSegmentsFile.run(SegmentInfos.java:524)
	at org.apache.lucene.index.SegmentInfos.read(SegmentInfos.java:307)
	at org.apache.lucene.index.IndexWriter.<init>(IndexWriter.java:1093)
	at org.apache.lucene.index.IndexWriter.<init>(IndexWriter.java:914)
	at org.apache.lucene.index.TestCrash.initIndex(TestCrash.java:39)
	at org.apache.lucene.index.TestCrash.initIndex(TestCrash.java:33)
	at org.apache.lucene.index.TestCrash.testCrashReaderDeletes(TestCrash.java:145)
	at org.apache.lucene.util.LuceneTestCase.runBare(LuceneTestCase.java:253)


REGRESSION:  org.apache.lucene.index.TestCrash.testCrashReaderDeletesAfterClose

Error Message:
fileMap

Stack Trace:
java.lang.NoSuchFieldError: fileMap
	at org.apache.lucene.store.MockRAMDirectory.openInput(MockRAMDirectory.java:234)
	at org.apache.lucene.index.SegmentInfos$FindSegmentsFile.run(SegmentInfos.java:591)
	at org.apache.lucene.index.SegmentInfos$FindSegmentsFile.run(SegmentInfos.java:524)
	at org.apache.lucene.index.SegmentInfos.read(SegmentInfos.java:307)
	at org.apache.lucene.index.IndexWriter.<init>(IndexWriter.java:1093)
	at org.apache.lucene.index.IndexWriter.<init>(IndexWriter.java:914)
	at org.apache.lucene.index.TestCrash.initIndex(TestCrash.java:39)
	at org.apache.lucene.index.TestCrash.initIndex(TestCrash.java:33)
	at org.apache.lucene.index.TestCrash.testCrashReaderDeletesAfterClose(TestCrash.java:166)
	at org.apache.lucene.util.LuceneTestCase.runBare(LuceneTestCase.java:253)


REGRESSION:  org.apache.lucene.index.TestDeletionPolicy.testOpenPriorSnapshot

Error Message:
fileMap

Stack Trace:
java.lang.NoSuchFieldError: fileMap
	at org.apache.lucene.store.MockRAMDirectory.openInput(MockRAMDirectory.java:234)
	at org.apache.lucene.index.SegmentInfos$FindSegmentsFile.run(SegmentInfos.java:591)
	at org.apache.lucene.index.SegmentInfos$FindSegmentsFile.run(SegmentInfos.java:524)
	at org.apache.lucene.index.SegmentInfos.read(SegmentInfos.java:307)
	at org.apache.lucene.index.IndexWriter.<init>(IndexWriter.java:1093)
	at org.apache.lucene.index.IndexWriter.<init>(IndexWriter.java:940)
	at org.apache.lucene.index.TestDeletionPolicy.testOpenPriorSnapshot(TestDeletionPolicy.java:350)
	at org.apache.lucene.util.LuceneTestCase.runBare(LuceneTestCase.java:253)


REGRESSION:  org.apache.lucene.index.TestFilterIndexReader.testFilterIndexReader

Error Message:
fileMap

Stack Trace:
java.lang.NoSuchFieldError: fileMap
	at org.apache.lucene.store.MockRAMDirectory.openInput(MockRAMDirectory.java:234)
	at org.apache.lucene.index.SegmentInfos$FindSegmentsFile.run(SegmentInfos.java:591)
	at org.apache.lucene.index.SegmentInfos$FindSegmentsFile.run(SegmentInfos.java:524)
	at org.apache.lucene.index.SegmentInfos.read(SegmentInfos.java:307)
	at org.apache.lucene.index.IndexWriter.<init>(IndexWriter.java:1093)
	at org.apache.lucene.index.IndexWriter.<init>(IndexWriter.java:887)
	at org.apache.lucene.index.TestFilterIndexReader.testFilterIndexReader(TestFilterIndexReader.java:100)
	at org.apache.lucene.util.LuceneTestCase.runBare(LuceneTestCase.java:253)


REGRESSION:  org.apache.lucene.index.TestIndexReader.testIsCurrent

Error Message:
fileMap

Stack Trace:
java.lang.NoSuchFieldError: fileMap
	at org.apache.lucene.store.MockRAMDirectory.openInput(MockRAMDirectory.java:234)
	at org.apache.lucene.index.SegmentInfos$FindSegmentsFile.run(SegmentInfos.java:591)
	at org.apache.lucene.index.SegmentInfos$FindSegmentsFile.run(SegmentInfos.java:524)
	at org.apache.lucene.index.SegmentInfos.read(SegmentInfos.java:307)
	at org.apache.lucene.index.IndexWriter.<init>(IndexWriter.java:1093)
	at org.apache.lucene.index.IndexWriter.<init>(IndexWriter.java:887)
	at org.apache.lucene.index.TestIndexReader.testIsCurrent(TestIndexReader.java:127)
	at org.apache.lucene.util.LuceneTestCase.runBare(LuceneTestCase.java:253)


REGRESSION:  org.apache.lucene.index.TestIndexReader.testTermVectors

Error Message:
fileMap

Stack Trace:
java.lang.NoSuchFieldError: fileMap
	at org.apache.lucene.store.MockRAMDirectory.openInput(MockRAMDirectory.java:234)
	at org.apache.lucene.index.SegmentInfos$FindSegmentsFile.run(SegmentInfos.java:591)
	at org.apache.lucene.index.SegmentInfos$FindSegmentsFile.run(SegmentInfos.java:524)
	at org.apache.lucene.index.SegmentInfos.read(SegmentInfos.java:307)
	at org.apache.lucene.index.IndexWriter.<init>(IndexWriter.java:1093)
	at org.apache.lucene.index.IndexWriter.<init>(IndexWriter.java:887)
	at org.apache.lucene.index.TestIndexReader.testTermVectors(TestIndexReader.java:247)
	at org.apache.lucene.util.LuceneTestCase.runBare(LuceneTestCase.java:253)


REGRESSION:  org.apache.lucene.index.TestIndexReader.testCommitUserData

Error Message:
fileMap

Stack Trace:
java.lang.NoSuchFieldError: fileMap
	at org.apache.lucene.store.MockRAMDirectory.openInput(MockRAMDirectory.java:234)
	at org.apache.lucene.index.SegmentInfos$FindSegmentsFile.run(SegmentInfos.java:591)
	at org.apache.lucene.index.SegmentInfos$FindSegmentsFile.run(SegmentInfos.java:524)
	at org.apache.lucene.index.SegmentInfos.read(SegmentInfos.java:307)
	at org.apache.lucene.index.IndexWriter.<init>(IndexWriter.java:1093)
	at org.apache.lucene.index.IndexWriter.<init>(IndexWriter.java:887)
	at org.apache.lucene.index.TestIndexReader.testCommitUserData(TestIndexReader.java:80)
	at org.apache.lucene.util.LuceneTestCase.runBare(LuceneTestCase.java:253)


REGRESSION:  org.apache.lucene.index.TestIndexReader.testGetFieldNames

Error Message:
fileMap

Stack Trace:
java.lang.NoSuchFieldError: fileMap
	at org.apache.lucene.store.MockRAMDirectory.openInput(MockRAMDirectory.java:234)
	at org.apache.lucene.index.SegmentInfos$FindSegmentsFile.run(SegmentInfos.java:591)
	at org.apache.lucene.index.SegmentInfos$FindSegmentsFile.run(SegmentInfos.java:524)
	at org.apache.lucene.index.SegmentInfos.read(SegmentInfos.java:307)
	at org.apache.lucene.index.IndexWriter.<init>(IndexWriter.java:1093)
	at org.apache.lucene.index.IndexWriter.<init>(IndexWriter.java:887)
	at org.apache.lucene.index.TestIndexReader.testGetFieldNames(TestIndexReader.java:155)
	at org.apache.lucene.util.LuceneTestCase.runBare(LuceneTestCase.java:253)


REGRESSION:  org.apache.lucene.index.TestIndexReader.testBasicDelete

Error Message:
fileMap

Stack Trace:
java.lang.NoSuchFieldError: fileMap
	at org.apache.lucene.store.MockRAMDirectory.openInput(MockRAMDirectory.java:234)
	at org.apache.lucene.index.SegmentInfos$FindSegmentsFile.run(SegmentInfos.java:591)
	at org.apache.lucene.index.SegmentInfos$FindSegmentsFile.run(SegmentInfos.java:524)
	at org.apache.lucene.index.SegmentInfos.read(SegmentInfos.java:307)
	at org.apache.lucene.index.IndexWriter.<init>(IndexWriter.java:1093)
	at org.apache.lucene.index.IndexWriter.<init>(IndexWriter.java:887)
	at org.apache.lucene.index.TestIndexReader.testBasicDelete(TestIndexReader.java:315)
	at org.apache.lucene.util.LuceneTestCase.runBare(LuceneTestCase.java:253)


REGRESSION:  org.apache.lucene.index.TestIndexReader.testWritingNormsNoReader

Error Message:
fileMap

Stack Trace:
java.lang.NoSuchFieldError: fileMap
	at org.apache.lucene.store.MockRAMDirectory.openInput(MockRAMDirectory.java:234)
	at org.apache.lucene.index.SegmentInfos$FindSegmentsFile.run(SegmentInfos.java:591)
	at org.apache.lucene.index.SegmentInfos$FindSegmentsFile.run(SegmentInfos.java:524)
	at org.apache.lucene.index.SegmentInfos.read(SegmentInfos.java:307)
	at org.apache.lucene.index.IndexWriter.<init>(IndexWriter.java:1093)
	at org.apache.lucene.index.IndexWriter.<init>(IndexWriter.java:887)
	at org.apache.lucene.index.TestIndexReader.testWritingNormsNoReader(TestIndexReader.java:572)
	at org.apache.lucene.util.LuceneTestCase.runBare(LuceneTestCase.java:253)


REGRESSION:  org.apache.lucene.index.TestIndexReader.testLastModified

Error Message:
fileMap

Stack Trace:
java.lang.NoSuchFieldError: fileMap
	at org.apache.lucene.store.MockRAMDirectory.openInput(MockRAMDirectory.java:234)
	at org.apache.lucene.index.SegmentInfos$FindSegmentsFile.run(SegmentInfos.java:591)
	at org.apache.lucene.index.SegmentInfos$FindSegmentsFile.run(SegmentInfos.java:524)
	at org.apache.lucene.index.SegmentInfos.read(SegmentInfos.java:307)
	at org.apache.lucene.index.IndexWriter.<init>(IndexWriter.java:1093)
	at org.apache.lucene.index.IndexWriter.<init>(IndexWriter.java:887)
	at org.apache.lucene.index.TestIndexReader.testLastModified(TestIndexReader.java:745)
	at org.apache.lucene.util.LuceneTestCase.runBare(LuceneTestCase.java:253)


REGRESSION:  org.apache.lucene.index.TestIndexReader.testVersion

Error Message:
fileMap

Stack Trace:
java.lang.NoSuchFieldError: fileMap
	at org.apache.lucene.store.MockRAMDirectory.openInput(MockRAMDirectory.java:234)
	at org.apache.lucene.index.SegmentInfos$FindSegmentsFile.run(SegmentInfos.java:591)
	at org.apache.lucene.index.SegmentInfos$FindSegmentsFile.run(SegmentInfos.java:524)
	at org.apache.lucene.index.SegmentInfos.read(SegmentInfos.java:307)
	at org.apache.lucene.index.IndexWriter.<init>(IndexWriter.java:1093)
	at org.apache.lucene.index.IndexWriter.<init>(IndexWriter.java:887)
	at org.apache.lucene.index.TestIndexReader.testVersion(TestIndexReader.java:779)
	at org.apache.lucene.util.LuceneTestCase.runBare(LuceneTestCase.java:253)


REGRESSION:  org.apache.lucene.index.TestIndexReader.testLock

Error Message:
fileMap

Stack Trace:
java.lang.NoSuchFieldError: fileMap
	at org.apache.lucene.store.MockRAMDirectory.openInput(MockRAMDirectory.java:234)
	at org.apache.lucene.index.SegmentInfos$FindSegmentsFile.run(SegmentInfos.java:591)
	at org.apache.lucene.index.SegmentInfos$FindSegmentsFile.run(SegmentInfos.java:524)
	at org.apache.lucene.index.SegmentInfos.read(SegmentInfos.java:307)
	at org.apache.lucene.index.IndexWriter.<init>(IndexWriter.java:1093)
	at org.apache.lucene.index.IndexWriter.<init>(IndexWriter.java:887)
	at org.apache.lucene.index.TestIndexReader.testLock(TestIndexReader.java:801)
	at org.apache.lucene.util.LuceneTestCase.runBare(LuceneTestCase.java:253)


REGRESSION:  org.apache.lucene.index.TestIndexReader.testUndeleteAll

Error Message:
fileMap

Stack Trace:
java.lang.NoSuchFieldError: fileMap
	at org.apache.lucene.store.MockRAMDirectory.openInput(MockRAMDirectory.java:234)
	at org.apache.lucene.index.SegmentInfos$FindSegmentsFile.run(SegmentInfos.java:591)
	at org.apache.lucene.index.SegmentInfos$FindSegmentsFile.run(SegmentInfos.java:524)
	at org.apache.lucene.index.SegmentInfos.read(SegmentInfos.java:307)
	at org.apache.lucene.index.IndexWriter.<init>(IndexWriter.java:1093)
	at org.apache.lucene.index.IndexWriter.<init>(IndexWriter.java:887)
	at org.apache.lucene.index.TestIndexReader.testUndeleteAll(TestIndexReader.java:821)
	at org.apache.lucene.util.LuceneTestCase.runBare(LuceneTestCase.java:253)


REGRESSION:  org.apache.lucene.index.TestIndexReader.testUndeleteAllAfterClose

Error Message:
fileMap

Stack Trace:
java.lang.NoSuchFieldError: fileMap
	at org.apache.lucene.store.MockRAMDirectory.openInput(MockRAMDirectory.java:234)
	at org.apache.lucene.index.SegmentInfos$FindSegmentsFile.run(SegmentInfos.java:591)
	at org.apache.lucene.index.SegmentInfos$FindSegmentsFile.run(SegmentInfos.java:524)
	at org.apache.lucene.index.SegmentInfos.read(SegmentInfos.java:307)
	at org.apache.lucene.index.IndexWriter.<init>(IndexWriter.java:1093)
	at org.apache.lucene.index.IndexWriter.<init>(IndexWriter.java:887)
	at org.apache.lucene.index.TestIndexReader.testUndeleteAllAfterClose(TestIndexReader.java:838)
	at org.apache.lucene.util.LuceneTestCase.runBare(LuceneTestCase.java:253)


REGRESSION:  org.apache.lucene.index.TestIndexReader.testUndeleteAllAfterCloseThenReopen

Error Message:
fileMap

Stack Trace:
java.lang.NoSuchFieldError: fileMap
	at org.apache.lucene.store.MockRAMDirectory.openInput(MockRAMDirectory.java:234)
	at org.apache.lucene.index.SegmentInfos$FindSegmentsFile.run(SegmentInfos.java:591)
	at org.apache.lucene.index.SegmentInfos$FindSegmentsFile.run(SegmentInfos.java:524)
	at org.apache.lucene.index.SegmentInfos.read(SegmentInfos.java:307)
	at org.apache.lucene.index.IndexWriter.<init>(IndexWriter.java:1093)
	at org.apache.lucene.index.IndexWriter.<init>(IndexWriter.java:887)
	at org.apache.lucene.index.TestIndexReader.testUndeleteAllAfterCloseThenReopen(TestIndexReader.java:855)
	at org.apache.lucene.util.LuceneTestCase.runBare(LuceneTestCase.java:253)


REGRESSION:  org.apache.lucene.index.TestIndexReader.testDiskFull

Error Message:
fileMap

Stack Trace:
java.lang.NoSuchFieldError: fileMap
	at org.apache.lucene.store.MockRAMDirectory.openInput(MockRAMDirectory.java:234)
	at org.apache.lucene.index.SegmentInfos$FindSegmentsFile.run(SegmentInfos.java:591)
	at org.apache.lucene.index.SegmentInfos$FindSegmentsFile.run(SegmentInfos.java:524)
	at org.apache.lucene.index.SegmentInfos.read(SegmentInfos.java:307)
	at org.apache.lucene.index.IndexWriter.<init>(IndexWriter.java:1093)
	at org.apache.lucene.index.IndexWriter.<init>(IndexWriter.java:887)
	at org.apache.lucene.index.TestIndexReader.testDiskFull(TestIndexReader.java:893)
	at org.apache.lucene.util.LuceneTestCase.runBare(LuceneTestCase.java:253)


REGRESSION:  org.apache.lucene.index.TestIndexReader.testDocsOutOfOrderJIRA140

Error Message:
fileMap

Stack Trace:
java.lang.NoSuchFieldError: fileMap
	at org.apache.lucene.store.MockRAMDirectory.openInput(MockRAMDirectory.java:234)
	at org.apache.lucene.index.SegmentInfos$FindSegmentsFile.run(SegmentInfos.java:591)
	at org.apache.lucene.index.SegmentInfos$FindSegmentsFile.run(SegmentInfos.java:524)
	at org.apache.lucene.index.SegmentInfos.read(SegmentInfos.java:307)
	at org.apache.lucene.index.IndexWriter.<init>(IndexWriter.java:1093)
	at org.apache.lucene.index.IndexWriter.<init>(IndexWriter.java:887)
	at org.apache.lucene.index.TestIndexReader.testDocsOutOfOrderJIRA140(TestIndexReader.java:1083)
	at org.apache.lucene.util.LuceneTestCase.runBare(LuceneTestCase.java:253)


REGRESSION:  org.apache.lucene.index.TestIndexReader.testExceptionReleaseWriteLockJIRA768

Error Message:
fileMap

Stack Trace:
java.lang.NoSuchFieldError: fileMap
	at org.apache.lucene.store.MockRAMDirectory.openInput(MockRAMDirectory.java:234)
	at org.apache.lucene.index.SegmentInfos$FindSegmentsFile.run(SegmentInfos.java:591)
	at org.apache.lucene.index.SegmentInfos$FindSegmentsFile.run(SegmentInfos.java:524)
	at org.apache.lucene.index.SegmentInfos.read(SegmentInfos.java:307)
	at org.apache.lucene.index.IndexWriter.<init>(IndexWriter.java:1093)
	at org.apache.lucene.index.IndexWriter.<init>(IndexWriter.java:887)
	at org.apache.lucene.index.TestIndexReader.testExceptionReleaseWriteLockJIRA768(TestIndexReader.java:1123)
	at org.apache.lucene.util.LuceneTestCase.runBare(LuceneTestCase.java:253)


REGRESSION:  org.apache.lucene.index.TestIndexReader.testGetIndexCommit

Error Message:
fileMap

Stack Trace:
java.lang.NoSuchFieldError: fileMap
	at org.apache.lucene.store.MockRAMDirectory.openInput(MockRAMDirectory.java:234)
	at org.apache.lucene.index.SegmentInfos$FindSegmentsFile.run(SegmentInfos.java:591)
	at org.apache.lucene.index.SegmentInfos$FindSegmentsFile.run(SegmentInfos.java:524)
	at org.apache.lucene.index.SegmentInfos.read(SegmentInfos.java:307)
	at org.apache.lucene.index.IndexWriter.<init>(IndexWriter.java:1093)
	at org.apache.lucene.index.IndexWriter.<init>(IndexWriter.java:887)
	at org.apache.lucene.index.TestIndexReader.testGetIndexCommit(TestIndexReader.java:1423)
	at org.apache.lucene.util.LuceneTestCase.runBare(LuceneTestCase.java:253)


REGRESSION:  org.apache.lucene.index.TestIndexReader.testReadOnly

Error Message:
fileMap

Stack Trace:
java.lang.NoSuchFieldError: fileMap
	at org.apache.lucene.store.MockRAMDirectory.openInput(MockRAMDirectory.java:234)
	at org.apache.lucene.index.SegmentInfos$FindSegmentsFile.run(SegmentInfos.java:591)
	at org.apache.lucene.index.SegmentInfos$FindSegmentsFile.run(SegmentInfos.java:524)
	at org.apache.lucene.index.SegmentInfos.read(SegmentInfos.java:307)
	at org.apache.lucene.index.IndexWriter.<init>(IndexWriter.java:1093)
	at org.apache.lucene.index.IndexWriter.<init>(IndexWriter.java:887)
	at org.apache.lucene.index.TestIndexReader.testReadOnly(TestIndexReader.java:1464)
	at org.apache.lucene.util.LuceneTestCase.runBare(LuceneTestCase.java:253)


REGRESSION:  org.apache.lucene.index.TestIndexReader.testIndexReaderUnDeleteAll

Error Message:
fileMap

Stack Trace:
java.lang.NoSuchFieldError: fileMap
	at org.apache.lucene.store.MockRAMDirectory.openInput(MockRAMDirectory.java:234)
	at org.apache.lucene.index.SegmentInfos$FindSegmentsFile.run(SegmentInfos.java:591)
	at org.apache.lucene.index.SegmentInfos$FindSegmentsFile.run(SegmentInfos.java:524)
	at org.apache.lucene.index.SegmentInfos.read(SegmentInfos.java:307)
	at org.apache.lucene.index.IndexWriter.<init>(IndexWriter.java:1093)
	at org.apache.lucene.index.IndexWriter.<init>(IndexWriter.java:914)
	at org.apache.lucene.index.TestIndexReader.testIndexReaderUnDeleteAll(TestIndexReader.java:1541)
	at org.apache.lucene.util.LuceneTestCase.runBare(LuceneTestCase.java:253)


REGRESSION:  org.apache.lucene.index.TestIndexReader.testNoDupCommitFileNames

Error Message:
fileMap

Stack Trace:
java.lang.NoSuchFieldError: fileMap
	at org.apache.lucene.store.MockRAMDirectory.openInput(MockRAMDirectory.java:234)
	at org.apache.lucene.index.SegmentInfos$FindSegmentsFile.run(SegmentInfos.java:591)
	at org.apache.lucene.index.SegmentInfos$FindSegmentsFile.run(SegmentInfos.java:524)
	at org.apache.lucene.index.SegmentInfos.read(SegmentInfos.java:307)
	at org.apache.lucene.index.IndexWriter.<init>(IndexWriter.java:1093)
	at org.apache.lucene.index.IndexWriter.<init>(IndexWriter.java:914)
	at org.apache.lucene.index.TestIndexReader.testNoDupCommitFileNames(TestIndexReader.java:1583)
	at org.apache.lucene.util.LuceneTestCase.runBare(LuceneTestCase.java:253)


REGRESSION:  org.apache.lucene.index.TestIndexReader.testFieldCacheReuseAfterClone

Error Message:
fileMap

Stack Trace:
java.lang.NoSuchFieldError: fileMap
	at org.apache.lucene.store.MockRAMDirectory.openInput(MockRAMDirectory.java:234)
	at org.apache.lucene.index.SegmentInfos$FindSegmentsFile.run(SegmentInfos.java:591)
	at org.apache.lucene.index.SegmentInfos$FindSegmentsFile.run(SegmentInfos.java:524)
	at org.apache.lucene.index.SegmentInfos.read(SegmentInfos.java:307)
	at org.apache.lucene.index.IndexWriter.<init>(IndexWriter.java:1093)
	at org.apache.lucene.index.IndexWriter.<init>(IndexWriter.java:914)
	at org.apache.lucene.index.TestIndexReader.testFieldCacheReuseAfterClone(TestIndexReader.java:1613)
	at org.apache.lucene.util.LuceneTestCase.runBare(LuceneTestCase.java:253)


REGRESSION:  org.apache.lucene.index.TestIndexReader.testFieldCacheReuseAfterReopen

Error Message:
fileMap

Stack Trace:
java.lang.NoSuchFieldError: fileMap
	at org.apache.lucene.store.MockRAMDirectory.openInput(MockRAMDirectory.java:234)
	at org.apache.lucene.index.SegmentInfos$FindSegmentsFile.run(SegmentInfos.java:591)
	at org.apache.lucene.index.SegmentInfos$FindSegmentsFile.run(SegmentInfos.java:524)
	at org.apache.lucene.index.SegmentInfos.read(SegmentInfos.java:307)
	at org.apache.lucene.index.IndexWriter.<init>(IndexWriter.java:1093)
	at org.apache.lucene.index.IndexWriter.<init>(IndexWriter.java:914)
	at org.apache.lucene.index.TestIndexReader.testFieldCacheReuseAfterReopen(TestIndexReader.java:1644)
	at org.apache.lucene.util.LuceneTestCase.runBare(LuceneTestCase.java:253)


REGRESSION:  org.apache.lucene.index.TestIndexReader.testReopenChangeReadonly

Error Message:
fileMap

Stack Trace:
java.lang.NoSuchFieldError: fileMap
	at org.apache.lucene.store.MockRAMDirectory.openInput(MockRAMDirectory.java:234)
	at org.apache.lucene.index.SegmentInfos$FindSegmentsFile.run(SegmentInfos.java:591)
	at org.apache.lucene.index.SegmentInfos$FindSegmentsFile.run(SegmentInfos.java:524)
	at org.apache.lucene.index.SegmentInfos.read(SegmentInfos.java:307)
	at org.apache.lucene.index.IndexWriter.<init>(IndexWriter.java:1093)
	at org.apache.lucene.index.IndexWriter.<init>(IndexWriter.java:914)
	at org.apache.lucene.index.TestIndexReader.testReopenChangeReadonly(TestIndexReader.java:1676)
	at org.apache.lucene.util.LuceneTestCase.runBare(LuceneTestCase.java:253)


REGRESSION:  org.apache.lucene.index.TestIndexReader.testUniqueTermCount

Error Message:
fileMap

Stack Trace:
java.lang.NoSuchFieldError: fileMap
	at org.apache.lucene.store.MockRAMDirectory.openInput(MockRAMDirectory.java:234)
	at org.apache.lucene.index.SegmentInfos$FindSegmentsFile.run(SegmentInfos.java:591)
	at org.apache.lucene.index.SegmentInfos$FindSegmentsFile.run(SegmentInfos.java:524)
	at org.apache.lucene.index.SegmentInfos.read(SegmentInfos.java:307)
	at org.apache.lucene.index.IndexWriter.<init>(IndexWriter.java:1093)
	at org.apache.lucene.index.IndexWriter.<init>(IndexWriter.java:914)
	at org.apache.lucene.index.TestIndexReader.testUniqueTermCount(TestIndexReader.java:1717)
	at org.apache.lucene.util.LuceneTestCase.runBare(LuceneTestCase.java:253)


REGRESSION:  org.apache.lucene.index.TestIndexReader.testNoTermsIndex

Error Message:
fileMap

Stack Trace:
java.lang.NoSuchFieldError: fileMap
	at org.apache.lucene.store.MockRAMDirectory.openInput(MockRAMDirectory.java:234)
	at org.apache.lucene.index.SegmentInfos$FindSegmentsFile.run(SegmentInfos.java:591)
	at org.apache.lucene.index.SegmentInfos$FindSegmentsFile.run(SegmentInfos.java:524)
	at org.apache.lucene.index.SegmentInfos.read(SegmentInfos.java:307)
	at org.apache.lucene.index.IndexWriter.<init>(IndexWriter.java:1093)
	at org.apache.lucene.index.IndexWriter.<init>(IndexWriter.java:914)
	at org.apache.lucene.index.TestIndexReader.testNoTermsIndex(TestIndexReader.java:1750)
	at org.apache.lucene.util.LuceneTestCase.runBare(LuceneTestCase.java:253)


REGRESSION:  org.apache.lucene.index.TestIndexReader.testPrepareCommitIsCurrent

Error Message:
fileMap

Stack Trace:
java.lang.NoSuchFieldError: fileMap
	at org.apache.lucene.store.MockRAMDirectory.openInput(MockRAMDirectory.java:234)
	at org.apache.lucene.index.SegmentInfos$FindSegmentsFile.run(SegmentInfos.java:591)
	at org.apache.lucene.index.SegmentInfos$FindSegmentsFile.run(SegmentInfos.java:524)
	at org.apache.lucene.index.SegmentInfos.read(SegmentInfos.java:307)
	at org.apache.lucene.index.IndexWriter.<init>(IndexWriter.java:1093)
	at org.apache.lucene.index.IndexWriter.<init>(IndexWriter.java:914)
	at org.apache.lucene.index.TestIndexReader.testPrepareCommitIsCurrent(TestIndexReader.java:1787)
	at org.apache.lucene.util.LuceneTestCase.runBare(LuceneTestCase.java:253)


REGRESSION:  org.apache.lucene.index.TestIndexReaderClone.testCloneReadOnlySegmentReader

Error Message:
fileMap

Stack Trace:
java.lang.NoSuchFieldError: fileMap
	at org.apache.lucene.store.MockRAMDirectory.openInput(MockRAMDirectory.java:234)
	at org.apache.lucene.index.SegmentInfos$FindSegmentsFile.run(SegmentInfos.java:591)
	at org.apache.lucene.index.SegmentInfos$FindSegmentsFile.run(SegmentInfos.java:524)
	at org.apache.lucene.index.SegmentInfos.read(SegmentInfos.java:307)
	at org.apache.lucene.index.IndexWriter.<init>(IndexWriter.java:1093)
	at org.apache.lucene.index.IndexWriter.<init>(IndexWriter.java:914)
	at org.apache.lucene.index.TestIndexReaderReopen.createIndex(TestIndexReaderReopen.java:952)
	at org.apache.lucene.index.TestIndexReaderClone.testCloneReadOnlySegmentReader(TestIndexReaderClone.java:45)
	at org.apache.lucene.util.LuceneTestCase.runBare(LuceneTestCase.java:253)


REGRESSION:  org.apache.lucene.index.TestIndexReaderClone.testCloneNoChangesStillReadOnly

Error Message:
fileMap

Stack Trace:
java.lang.NoSuchFieldError: fileMap
	at org.apache.lucene.store.MockRAMDirectory.openInput(MockRAMDirectory.java:234)
	at org.apache.lucene.index.SegmentInfos$FindSegmentsFile.run(SegmentInfos.java:591)
	at org.apache.lucene.index.SegmentInfos$FindSegmentsFile.run(SegmentInfos.java:524)
	at org.apache.lucene.index.SegmentInfos.read(SegmentInfos.java:307)
	at org.apache.lucene.index.IndexWriter.<init>(IndexWriter.java:1093)
	at org.apache.lucene.index.IndexWriter.<init>(IndexWriter.java:914)
	at org.apache.lucene.index.TestIndexReaderReopen.createIndex(TestIndexReaderReopen.java:952)
	at org.apache.lucene.index.TestIndexReaderClone.testCloneNoChangesStillReadOnly(TestIndexReaderClone.java:64)
	at org.apache.lucene.util.LuceneTestCase.runBare(LuceneTestCase.java:253)


REGRESSION:  org.apache.lucene.index.TestIndexReaderClone.testCloneWriteToOrig

Error Message:
fileMap

Stack Trace:
java.lang.NoSuchFieldError: fileMap
	at org.apache.lucene.store.MockRAMDirectory.openInput(MockRAMDirectory.java:234)
	at org.apache.lucene.index.SegmentInfos$FindSegmentsFile.run(SegmentInfos.java:591)
	at org.apache.lucene.index.SegmentInfos$FindSegmentsFile.run(SegmentInfos.java:524)
	at org.apache.lucene.index.SegmentInfos.read(SegmentInfos.java:307)
	at org.apache.lucene.index.IndexWriter.<init>(IndexWriter.java:1093)
	at org.apache.lucene.index.IndexWriter.<init>(IndexWriter.java:914)
	at org.apache.lucene.index.TestIndexReaderReopen.createIndex(TestIndexReaderReopen.java:952)
	at org.apache.lucene.index.TestIndexReaderClone.testCloneWriteToOrig(TestIndexReaderClone.java:80)
	at org.apache.lucene.util.LuceneTestCase.runBare(LuceneTestCase.java:253)


REGRESSION:  org.apache.lucene.index.TestIndexReaderClone.testCloneWriteToClone

Error Message:
fileMap

Stack Trace:
java.lang.NoSuchFieldError: fileMap
	at org.apache.lucene.store.MockRAMDirectory.openInput(MockRAMDirectory.java:234)
	at org.apache.lucene.index.SegmentInfos$FindSegmentsFile.run(SegmentInfos.java:591)
	at org.apache.lucene.index.SegmentInfos$FindSegmentsFile.run(SegmentInfos.java:524)
	at org.apache.lucene.index.SegmentInfos.read(SegmentInfos.java:307)
	at org.apache.lucene.index.IndexWriter.<init>(IndexWriter.java:1093)
	at org.apache.lucene.index.IndexWriter.<init>(IndexWriter.java:914)
	at org.apache.lucene.index.TestIndexReaderReopen.createIndex(TestIndexReaderReopen.java:952)
	at org.apache.lucene.index.TestIndexReaderClone.testCloneWriteToClone(TestIndexReaderClone.java:96)
	at org.apache.lucene.util.LuceneTestCase.runBare(LuceneTestCase.java:253)


REGRESSION:  org.apache.lucene.index.TestIndexReaderClone.testReopenSegmentReaderToMultiReader

Error Message:
fileMap

Stack Trace:
java.lang.NoSuchFieldError: fileMap
	at org.apache.lucene.store.MockRAMDirectory.openInput(MockRAMDirectory.java:234)
	at org.apache.lucene.index.SegmentInfos$FindSegmentsFile.run(SegmentInfos.java:591)
	at org.apache.lucene.index.SegmentInfos$FindSegmentsFile.run(SegmentInfos.java:524)
	at org.apache.lucene.index.SegmentInfos.read(SegmentInfos.java:307)
	at org.apache.lucene.index.IndexWriter.<init>(IndexWriter.java:1093)
	at org.apache.lucene.index.IndexWriter.<init>(IndexWriter.java:914)
	at org.apache.lucene.index.TestIndexReaderReopen.createIndex(TestIndexReaderReopen.java:952)
	at org.apache.lucene.index.TestIndexReaderClone.testReopenSegmentReaderToMultiReader(TestIndexReaderClone.java:119)
	at org.apache.lucene.util.LuceneTestCase.runBare(LuceneTestCase.java:253)


REGRESSION:  org.apache.lucene.index.TestIndexReaderClone.testCloneWriteableToReadOnly

Error Message:
fileMap

Stack Trace:
java.lang.NoSuchFieldError: fileMap
	at org.apache.lucene.store.MockRAMDirectory.openInput(MockRAMDirectory.java:234)
	at org.apache.lucene.index.SegmentInfos$FindSegmentsFile.run(SegmentInfos.java:591)
	at org.apache.lucene.index.SegmentInfos$FindSegmentsFile.run(SegmentInfos.java:524)
	at org.apache.lucene.index.SegmentInfos.read(SegmentInfos.java:307)
	at org.apache.lucene.index.IndexWriter.<init>(IndexWriter.java:1093)
	at org.apache.lucene.index.IndexWriter.<init>(IndexWriter.java:914)
	at org.apache.lucene.index.TestIndexReaderReopen.createIndex(TestIndexReaderReopen.java:952)
	at org.apache.lucene.index.TestIndexReaderClone.testCloneWriteableToReadOnly(TestIndexReaderClone.java:137)
	at org.apache.lucene.util.LuceneTestCase.runBare(LuceneTestCase.java:253)


REGRESSION:  org.apache.lucene.index.TestIndexReaderClone.testReopenWriteableToReadOnly

Error Message:
fileMap

Stack Trace:
java.lang.NoSuchFieldError: fileMap
	at org.apache.lucene.store.MockRAMDirectory.openInput(MockRAMDirectory.java:234)
	at org.apache.lucene.index.SegmentInfos$FindSegmentsFile.run(SegmentInfos.java:591)
	at org.apache.lucene.index.SegmentInfos$FindSegmentsFile.run(SegmentInfos.java:524)
	at org.apache.lucene.index.SegmentInfos.read(SegmentInfos.java:307)
	at org.apache.lucene.index.IndexWriter.<init>(IndexWriter.java:1093)
	at org.apache.lucene.index.IndexWriter.<init>(IndexWriter.java:914)
	at org.apache.lucene.index.TestIndexReaderReopen.createIndex(TestIndexReaderReopen.java:952)
	at org.apache.lucene.index.TestIndexReaderClone.testReopenWriteableToReadOnly(TestIndexReaderClone.java:159)
	at org.apache.lucene.util.LuceneTestCase.runBare(LuceneTestCase.java:253)


REGRESSION:  org.apache.lucene.index.TestIndexReaderClone.testCloneReadOnlyToWriteable

Error Message:
fileMap

Stack Trace:
java.lang.NoSuchFieldError: fileMap
	at org.apache.lucene.store.MockRAMDirectory.openInput(MockRAMDirectory.java:234)
	at org.apache.lucene.index.SegmentInfos$FindSegmentsFile.run(SegmentInfos.java:591)
	at org.apache.lucene.index.SegmentInfos$FindSegmentsFile.run(SegmentInfos.java:524)
	at org.apache.lucene.index.SegmentInfos.read(SegmentInfos.java:307)
	at org.apache.lucene.index.IndexWriter.<init>(IndexWriter.java:1093)
	at org.apache.lucene.index.IndexWriter.<init>(IndexWriter.java:914)
	at org.apache.lucene.index.TestIndexReaderReopen.createIndex(TestIndexReaderReopen.java:952)
	at org.apache.lucene.index.TestIndexReaderClone.testCloneReadOnlyToWriteable(TestIndexReaderClone.java:180)
	at org.apache.lucene.util.LuceneTestCase.runBare(LuceneTestCase.java:253)


REGRESSION:  org.apache.lucene.index.TestIndexReaderClone.testReadOnlyCloneAfterOptimize

Error Message:
fileMap

Stack Trace:
java.lang.NoSuchFieldError: fileMap
	at org.apache.lucene.store.MockRAMDirectory.openInput(MockRAMDirectory.java:234)
	at org.apache.lucene.index.SegmentInfos$FindSegmentsFile.run(SegmentInfos.java:591)
	at org.apache.lucene.index.SegmentInfos$FindSegmentsFile.run(SegmentInfos.java:524)
	at org.apache.lucene.index.SegmentInfos.read(SegmentInfos.java:307)
	at org.apache.lucene.index.IndexWriter.<init>(IndexWriter.java:1093)
	at org.apache.lucene.index.IndexWriter.<init>(IndexWriter.java:914)
	at org.apache.lucene.index.TestIndexReaderReopen.createIndex(TestIndexReaderReopen.java:952)
	at org.apache.lucene.index.TestIndexReaderClone.testReadOnlyCloneAfterOptimize(TestIndexReaderClone.java:203)
	at org.apache.lucene.util.LuceneTestCase.runBare(LuceneTestCase.java:253)


REGRESSION:  org.apache.lucene.index.TestIndexReaderClone.testCloneReadOnlyDirectoryReader

Error Message:
fileMap

Stack Trace:
java.lang.NoSuchFieldError: fileMap
	at org.apache.lucene.store.MockRAMDirectory.openInput(MockRAMDirectory.java:234)
	at org.apache.lucene.index.SegmentInfos$FindSegmentsFile.run(SegmentInfos.java:591)
	at org.apache.lucene.index.SegmentInfos$FindSegmentsFile.run(SegmentInfos.java:524)
	at org.apache.lucene.index.SegmentInfos.read(SegmentInfos.java:307)
	at org.apache.lucene.index.IndexWriter.<init>(IndexWriter.java:1093)
	at org.apache.lucene.index.IndexWriter.<init>(IndexWriter.java:914)
	at org.apache.lucene.index.TestIndexReaderReopen.createIndex(TestIndexReaderReopen.java:952)
	at org.apache.lucene.index.TestIndexReaderClone.testCloneReadOnlyDirectoryReader(TestIndexReaderClone.java:229)
	at org.apache.lucene.util.LuceneTestCase.runBare(LuceneTestCase.java:253)


REGRESSION:  org.apache.lucene.index.TestIndexReaderClone.testParallelReader

Error Message:
fileMap

Stack Trace:
java.lang.NoSuchFieldError: fileMap
	at org.apache.lucene.store.MockRAMDirectory.openInput(MockRAMDirectory.java:234)
	at org.apache.lucene.index.SegmentInfos$FindSegmentsFile.run(SegmentInfos.java:591)
	at org.apache.lucene.index.SegmentInfos$FindSegmentsFile.run(SegmentInfos.java:524)
	at org.apache.lucene.index.SegmentInfos.read(SegmentInfos.java:307)
	at org.apache.lucene.index.IndexWriter.<init>(IndexWriter.java:1093)
	at org.apache.lucene.index.IndexWriter.<init>(IndexWriter.java:914)
	at org.apache.lucene.index.TestIndexReaderReopen.createIndex(TestIndexReaderReopen.java:952)
	at org.apache.lucene.index.TestIndexReaderClone.testParallelReader(TestIndexReaderClone.java:249)
	at org.apache.lucene.util.LuceneTestCase.runBare(LuceneTestCase.java:253)


REGRESSION:  org.apache.lucene.index.TestIndexReaderClone.testMixedReaders

Error Message:
fileMap

Stack Trace:
java.lang.NoSuchFieldError: fileMap
	at org.apache.lucene.store.MockRAMDirectory.openInput(MockRAMDirectory.java:234)
	at org.apache.lucene.index.SegmentInfos$FindSegmentsFile.run(SegmentInfos.java:591)
	at org.apache.lucene.index.SegmentInfos$FindSegmentsFile.run(SegmentInfos.java:524)
	at org.apache.lucene.index.SegmentInfos.read(SegmentInfos.java:307)
	at org.apache.lucene.index.IndexWriter.<init>(IndexWriter.java:1093)
	at org.apache.lucene.index.IndexWriter.<init>(IndexWriter.java:914)
	at org.apache.lucene.index.TestIndexReaderReopen.createIndex(TestIndexReaderReopen.java:952)
	at org.apache.lucene.index.TestIndexReaderClone.testMixedReaders(TestIndexReaderClone.java:299)
	at org.apache.lucene.util.LuceneTestCase.runBare(LuceneTestCase.java:253)


REGRESSION:  org.apache.lucene.index.TestIndexReaderClone.testSegmentReaderUndeleteall

Error Message:
fileMap

Stack Trace:
java.lang.NoSuchFieldError: fileMap
	at org.apache.lucene.store.MockRAMDirectory.openInput(MockRAMDirectory.java:234)
	at org.apache.lucene.index.SegmentInfos$FindSegmentsFile.run(SegmentInfos.java:591)
	at org.apache.lucene.index.SegmentInfos$FindSegmentsFile.run(SegmentInfos.java:524)
	at org.apache.lucene.index.SegmentInfos.read(SegmentInfos.java:307)
	at org.apache.lucene.index.IndexWriter.<init>(IndexWriter.java:1093)
	at org.apache.lucene.index.IndexWriter.<init>(IndexWriter.java:914)
	at org.apache.lucene.index.TestIndexReaderReopen.createIndex(TestIndexReaderReopen.java:952)
	at org.apache.lucene.index.TestIndexReaderClone.testSegmentReaderUndeleteall(TestIndexReaderClone.java:314)
	at org.apache.lucene.util.LuceneTestCase.runBare(LuceneTestCase.java:253)


REGRESSION:  org.apache.lucene.index.TestIndexReaderClone.testCloneWithDeletes

Error Message:
fileMap

Stack Trace:
java.lang.NoSuchFieldError: fileMap
	at org.apache.lucene.store.MockRAMDirectory.openInput(MockRAMDirectory.java:234)
	at org.apache.lucene.index.SegmentInfos$FindSegmentsFile.run(SegmentInfos.java:591)
	at org.apache.lucene.index.SegmentInfos$FindSegmentsFile.run(SegmentInfos.java:524)
	at org.apache.lucene.index.SegmentInfos.read(SegmentInfos.java:307)
	at org.apache.lucene.index.IndexWriter.<init>(IndexWriter.java:1093)
	at org.apache.lucene.index.IndexWriter.<init>(IndexWriter.java:914)
	at org.apache.lucene.index.TestIndexReaderReopen.createIndex(TestIndexReaderReopen.java:952)
	at org.apache.lucene.index.TestIndexReaderClone.testCloneWithDeletes(TestIndexReaderClone.java:326)
	at org.apache.lucene.util.LuceneTestCase.runBare(LuceneTestCase.java:253)


REGRESSION:  org.apache.lucene.index.TestIndexReaderClone.testCloneWithSetNorm

Error Message:
fileMap

Stack Trace:
java.lang.NoSuchFieldError: fileMap
	at org.apache.lucene.store.MockRAMDirectory.openInput(MockRAMDirectory.java:234)
	at org.apache.lucene.index.SegmentInfos$FindSegmentsFile.run(SegmentInfos.java:591)
	at org.apache.lucene.index.SegmentInfos$FindSegmentsFile.run(SegmentInfos.java:524)
	at org.apache.lucene.index.SegmentInfos.read(SegmentInfos.java:307)
	at org.apache.lucene.index.IndexWriter.<init>(IndexWriter.java:1093)
	at org.apache.lucene.index.IndexWriter.<init>(IndexWriter.java:914)
	at org.apache.lucene.index.TestIndexReaderReopen.createIndex(TestIndexReaderReopen.java:952)
	at org.apache.lucene.index.TestIndexReaderClone.testCloneWithSetNorm(TestIndexReaderClone.java:343)
	at org.apache.lucene.util.LuceneTestCase.runBare(LuceneTestCase.java:253)


REGRESSION:  org.apache.lucene.index.TestIndexReaderClone.testCloneSubreaders

Error Message:
fileMap

Stack Trace:
java.lang.NoSuchFieldError: fileMap
	at org.apache.lucene.store.MockRAMDirectory.openInput(MockRAMDirectory.java:234)
	at org.apache.lucene.index.SegmentInfos$FindSegmentsFile.run(SegmentInfos.java:591)
	at org.apache.lucene.index.SegmentInfos$FindSegmentsFile.run(SegmentInfos.java:524)
	at org.apache.lucene.index.SegmentInfos.read(SegmentInfos.java:307)
	at org.apache.lucene.index.IndexWriter.<init>(IndexWriter.java:1093)
	at org.apache.lucene.index.IndexWriter.<init>(IndexWriter.java:914)
	at org.apache.lucene.index.TestIndexReaderReopen.createIndex(TestIndexReaderReopen.java:952)
	at org.apache.lucene.index.TestIndexReaderClone.testCloneSubreaders(TestIndexReaderClone.java:369)
	at org.apache.lucene.util.LuceneTestCase.runBare(LuceneTestCase.java:253)


REGRESSION:  org.apache.lucene.index.TestIndexReaderClone.testLucene1516Bug

Error Message:
fileMap

Stack Trace:
java.lang.NoSuchFieldError: fileMap
	at org.apache.lucene.store.MockRAMDirectory.openInput(MockRAMDirectory.java:234)
	at org.apache.lucene.index.SegmentInfos$FindSegmentsFile.run(SegmentInfos.java:591)
	at org.apache.lucene.index.SegmentInfos$FindSegmentsFile.run(SegmentInfos.java:524)
	at org.apache.lucene.index.SegmentInfos.read(SegmentInfos.java:307)
	at org.apache.lucene.index.IndexWriter.<init>(IndexWriter.java:1093)
	at org.apache.lucene.index.IndexWriter.<init>(IndexWriter.java:914)
	at org.apache.lucene.index.TestIndexReaderReopen.createIndex(TestIndexReaderReopen.java:952)
	at org.apache.lucene.index.TestIndexReaderClone.testLucene1516Bug(TestIndexReaderClone.java:388)
	at org.apache.lucene.util.LuceneTestCase.runBare(LuceneTestCase.java:253)


REGRESSION:  org.apache.lucene.index.TestIndexReaderClone.testCloseStoredFields

Error Message:
fileMap

Stack Trace:
java.lang.NoSuchFieldError: fileMap
	at org.apache.lucene.store.MockRAMDirectory.openInput(MockRAMDirectory.java:234)
	at org.apache.lucene.index.SegmentInfos$FindSegmentsFile.run(SegmentInfos.java:591)
	at org.apache.lucene.index.SegmentInfos$FindSegmentsFile.run(SegmentInfos.java:524)
	at org.apache.lucene.index.SegmentInfos.read(SegmentInfos.java:307)
	at org.apache.lucene.index.IndexWriter.<init>(IndexWriter.java:1093)
	at org.apache.lucene.index.IndexWriter.<init>(IndexWriter.java:914)
	at org.apache.lucene.index.TestIndexReaderClone.testCloseStoredFields(TestIndexReaderClone.java:405)
	at org.apache.lucene.util.LuceneTestCase.runBare(LuceneTestCase.java:253)


REGRESSION:  org.apache.lucene.index.TestIndexReaderCloneNorms.testNormsClose

Error Message:
fileMap

Stack Trace:
java.lang.NoSuchFieldError: fileMap
	at org.apache.lucene.store.MockRAMDirectory.openInput(MockRAMDirectory.java:234)
	at org.apache.lucene.index.SegmentInfos$FindSegmentsFile.run(SegmentInfos.java:591)
	at org.apache.lucene.index.SegmentInfos$FindSegmentsFile.run(SegmentInfos.java:524)
	at org.apache.lucene.index.SegmentInfos.read(SegmentInfos.java:307)
	at org.apache.lucene.index.IndexWriter.<init>(IndexWriter.java:1093)
	at org.apache.lucene.index.IndexWriter.<init>(IndexWriter.java:914)
	at org.apache.lucene.index.TestIndexReaderReopen.createIndex(TestIndexReaderReopen.java:952)
	at org.apache.lucene.index.TestIndexReaderCloneNorms.testNormsClose(TestIndexReaderCloneNorms.java:171)
	at org.apache.lucene.util.LuceneTestCase.runBare(LuceneTestCase.java:253)


REGRESSION:  org.apache.lucene.index.TestIndexReaderReopen.testReopen

Error Message:
fileMap

Stack Trace:
java.lang.NoSuchFieldError: fileMap
	at org.apache.lucene.store.MockRAMDirectory.openInput(MockRAMDirectory.java:234)
	at org.apache.lucene.index.SegmentInfos$FindSegmentsFile.run(SegmentInfos.java:591)
	at org.apache.lucene.index.SegmentInfos$FindSegmentsFile.run(SegmentInfos.java:524)
	at org.apache.lucene.index.SegmentInfos.read(SegmentInfos.java:307)
	at org.apache.lucene.index.IndexWriter.<init>(IndexWriter.java:1093)
	at org.apache.lucene.index.IndexWriter.<init>(IndexWriter.java:914)
	at org.apache.lucene.index.TestIndexReaderReopen.createIndex(TestIndexReaderReopen.java:952)
	at org.apache.lucene.index.TestIndexReaderReopen.testReopen(TestIndexReaderReopen.java:58)
	at org.apache.lucene.util.LuceneTestCase.runBare(LuceneTestCase.java:253)


REGRESSION:  org.apache.lucene.index.TestIndexReaderReopen.testParallelReaderReopen

Error Message:
fileMap

Stack Trace:
java.lang.NoSuchFieldError: fileMap
	at org.apache.lucene.store.MockRAMDirectory.openInput(MockRAMDirectory.java:234)
	at org.apache.lucene.index.SegmentInfos$FindSegmentsFile.run(SegmentInfos.java:591)
	at org.apache.lucene.index.SegmentInfos$FindSegmentsFile.run(SegmentInfos.java:524)
	at org.apache.lucene.index.SegmentInfos.read(SegmentInfos.java:307)
	at org.apache.lucene.index.IndexWriter.<init>(IndexWriter.java:1093)
	at org.apache.lucene.index.IndexWriter.<init>(IndexWriter.java:914)
	at org.apache.lucene.index.TestIndexReaderReopen.createIndex(TestIndexReaderReopen.java:952)
	at org.apache.lucene.index.TestIndexReaderReopen.testParallelReaderReopen(TestIndexReaderReopen.java:95)
	at org.apache.lucene.util.LuceneTestCase.runBare(LuceneTestCase.java:253)


REGRESSION:  org.apache.lucene.index.TestIndexReaderReopen.testCommitReopenRAM

Error Message:
fileMap

Stack Trace:
java.lang.NoSuchFieldError: fileMap
	at org.apache.lucene.store.MockRAMDirectory.openInput(MockRAMDirectory.java:234)
	at org.apache.lucene.index.SegmentInfos$FindSegmentsFile.run(SegmentInfos.java:591)
	at org.apache.lucene.index.SegmentInfos$FindSegmentsFile.run(SegmentInfos.java:524)
	at org.apache.lucene.index.SegmentInfos.read(SegmentInfos.java:307)
	at org.apache.lucene.index.IndexWriter.<init>(IndexWriter.java:1093)
	at org.apache.lucene.index.IndexWriter.<init>(IndexWriter.java:887)
	at org.apache.lucene.index.TestIndexReaderReopen.doTestReopenWithCommit(TestIndexReaderReopen.java:174)
	at org.apache.lucene.index.TestIndexReaderReopen.testCommitReopenRAM(TestIndexReaderReopen.java:165)
	at org.apache.lucene.util.LuceneTestCase.runBare(LuceneTestCase.java:253)


REGRESSION:  org.apache.lucene.index.TestIndexReaderReopen.testCommitRecreateRAM

Error Message:
fileMap

Stack Trace:
java.lang.NoSuchFieldError: fileMap
	at org.apache.lucene.store.MockRAMDirectory.openInput(MockRAMDirectory.java:234)
	at org.apache.lucene.index.SegmentInfos$FindSegmentsFile.run(SegmentInfos.java:591)
	at org.apache.lucene.index.SegmentInfos$FindSegmentsFile.run(SegmentInfos.java:524)
	at org.apache.lucene.index.SegmentInfos.read(SegmentInfos.java:307)
	at org.apache.lucene.index.IndexWriter.<init>(IndexWriter.java:1093)
	at org.apache.lucene.index.IndexWriter.<init>(IndexWriter.java:887)
	at org.apache.lucene.index.TestIndexReaderReopen.doTestReopenWithCommit(TestIndexReaderReopen.java:174)
	at org.apache.lucene.index.TestIndexReaderReopen.testCommitRecreateRAM(TestIndexReaderReopen.java:170)
	at org.apache.lucene.util.LuceneTestCase.runBare(LuceneTestCase.java:253)


REGRESSION:  org.apache.lucene.index.TestIndexReaderReopen.testMultiReaderReopen

Error Message:
fileMap

Stack Trace:
java.lang.NoSuchFieldError: fileMap
	at org.apache.lucene.store.MockRAMDirectory.openInput(MockRAMDirectory.java:234)
	at org.apache.lucene.index.SegmentInfos$FindSegmentsFile.run(SegmentInfos.java:591)
	at org.apache.lucene.index.SegmentInfos$FindSegmentsFile.run(SegmentInfos.java:524)
	at org.apache.lucene.index.SegmentInfos.read(SegmentInfos.java:307)
	at org.apache.lucene.index.IndexWriter.<init>(IndexWriter.java:1093)
	at org.apache.lucene.index.IndexWriter.<init>(IndexWriter.java:914)
	at org.apache.lucene.index.TestIndexReaderReopen.createIndex(TestIndexReaderReopen.java:952)
	at org.apache.lucene.index.TestIndexReaderReopen.testMultiReaderReopen(TestIndexReaderReopen.java:219)
	at org.apache.lucene.util.LuceneTestCase.runBare(LuceneTestCase.java:253)


REGRESSION:  org.apache.lucene.index.TestIndexReaderReopen.testMixedReaders

Error Message:
fileMap

Stack Trace:
java.lang.NoSuchFieldError: fileMap
	at org.apache.lucene.store.MockRAMDirectory.openInput(MockRAMDirectory.java:234)
	at org.apache.lucene.index.SegmentInfos$FindSegmentsFile.run(SegmentInfos.java:591)
	at org.apache.lucene.index.SegmentInfos$FindSegmentsFile.run(SegmentInfos.java:524)
	at org.apache.lucene.index.SegmentInfos.read(SegmentInfos.java:307)
	at org.apache.lucene.index.IndexWriter.<init>(IndexWriter.java:1093)
	at org.apache.lucene.index.IndexWriter.<init>(IndexWriter.java:914)
	at org.apache.lucene.index.TestIndexReaderReopen.createIndex(TestIndexReaderReopen.java:952)
	at org.apache.lucene.index.TestIndexReaderReopen.testMixedReaders(TestIndexReaderReopen.java:275)
	at org.apache.lucene.util.LuceneTestCase.runBare(LuceneTestCase.java:253)


REGRESSION:  org.apache.lucene.index.TestIndexReaderReopen.testReferenceCounting

Error Message:
fileMap

Stack Trace:
java.lang.NoSuchFieldError: fileMap
	at org.apache.lucene.store.MockRAMDirectory.openInput(MockRAMDirectory.java:234)
	at org.apache.lucene.index.SegmentInfos$FindSegmentsFile.run(SegmentInfos.java:591)
	at org.apache.lucene.index.SegmentInfos$FindSegmentsFile.run(SegmentInfos.java:524)
	at org.apache.lucene.index.SegmentInfos.read(SegmentInfos.java:307)
	at org.apache.lucene.index.IndexWriter.<init>(IndexWriter.java:1093)
	at org.apache.lucene.index.IndexWriter.<init>(IndexWriter.java:914)
	at org.apache.lucene.index.TestIndexReaderReopen.createIndex(TestIndexReaderReopen.java:952)
	at org.apache.lucene.index.TestIndexReaderReopen.testReferenceCounting(TestIndexReaderReopen.java:364)
	at org.apache.lucene.util.LuceneTestCase.runBare(LuceneTestCase.java:253)


REGRESSION:  org.apache.lucene.index.TestIndexReaderReopen.testReferenceCountingMultiReader

Error Message:
fileMap

Stack Trace:
java.lang.NoSuchFieldError: fileMap
	at org.apache.lucene.store.MockRAMDirectory.openInput(MockRAMDirectory.java:234)
	at org.apache.lucene.index.SegmentInfos$FindSegmentsFile.run(SegmentInfos.java:591)
	at org.apache.lucene.index.SegmentInfos$FindSegmentsFile.run(SegmentInfos.java:524)
	at org.apache.lucene.index.SegmentInfos.read(SegmentInfos.java:307)
	at org.apache.lucene.index.IndexWriter.<init>(IndexWriter.java:1093)
	at org.apache.lucene.index.IndexWriter.<init>(IndexWriter.java:914)
	at org.apache.lucene.index.TestIndexReaderReopen.createIndex(TestIndexReaderReopen.java:952)
	at org.apache.lucene.index.TestIndexReaderReopen.testReferenceCountingMultiReader(TestIndexReaderReopen.java:469)
	at org.apache.lucene.util.LuceneTestCase.runBare(LuceneTestCase.java:253)


REGRESSION:  org.apache.lucene.index.TestIndexReaderReopen.testReferenceCountingParallelReader

Error Message:
fileMap

Stack Trace:
java.lang.NoSuchFieldError: fileMap
	at org.apache.lucene.store.MockRAMDirectory.openInput(MockRAMDirectory.java:234)
	at org.apache.lucene.index.SegmentInfos$FindSegmentsFile.run(SegmentInfos.java:591)
	at org.apache.lucene.index.SegmentInfos$FindSegmentsFile.run(SegmentInfos.java:524)
	at org.apache.lucene.index.SegmentInfos.read(SegmentInfos.java:307)
	at org.apache.lucene.index.IndexWriter.<init>(IndexWriter.java:1093)
	at org.apache.lucene.index.IndexWriter.<init>(IndexWriter.java:914)
	at org.apache.lucene.index.TestIndexReaderReopen.createIndex(TestIndexReaderReopen.java:952)
	at org.apache.lucene.index.TestIndexReaderReopen.testReferenceCountingParallelReader(TestIndexReaderReopen.java:540)
	at org.apache.lucene.util.LuceneTestCase.runBare(LuceneTestCase.java:253)


REGRESSION:  org.apache.lucene.index.TestIndexReaderReopen.testNormsRefCounting

Error Message:
fileMap

Stack Trace:
java.lang.NoSuchFieldError: fileMap
	at org.apache.lucene.store.MockRAMDirectory.openInput(MockRAMDirectory.java:234)
	at org.apache.lucene.index.SegmentInfos$FindSegmentsFile.run(SegmentInfos.java:591)
	at org.apache.lucene.index.SegmentInfos$FindSegmentsFile.run(SegmentInfos.java:524)
	at org.apache.lucene.index.SegmentInfos.read(SegmentInfos.java:307)
	at org.apache.lucene.index.IndexWriter.<init>(IndexWriter.java:1093)
	at org.apache.lucene.index.IndexWriter.<init>(IndexWriter.java:914)
	at org.apache.lucene.index.TestIndexReaderReopen.createIndex(TestIndexReaderReopen.java:952)
	at org.apache.lucene.index.TestIndexReaderReopen.testNormsRefCounting(TestIndexReaderReopen.java:614)
	at org.apache.lucene.util.LuceneTestCase.runBare(LuceneTestCase.java:253)


REGRESSION:  org.apache.lucene.index.TestIndexReaderReopen.testThreadSafety

Error Message:
fileMap

Stack Trace:
java.lang.NoSuchFieldError: fileMap
	at org.apache.lucene.store.MockRAMDirectory.openInput(MockRAMDirectory.java:234)
	at org.apache.lucene.index.SegmentInfos$FindSegmentsFile.run(SegmentInfos.java:591)
	at org.apache.lucene.index.SegmentInfos$FindSegmentsFile.run(SegmentInfos.java:524)
	at org.apache.lucene.index.SegmentInfos.read(SegmentInfos.java:307)
	at org.apache.lucene.index.IndexWriter.<init>(IndexWriter.java:1093)
	at org.apache.lucene.index.IndexWriter.<init>(IndexWriter.java:914)
	at org.apache.lucene.index.TestIndexReaderReopen.testThreadSafety(TestIndexReaderReopen.java:706)
	at org.apache.lucene.util.LuceneTestCase.runBare(LuceneTestCase.java:253)


REGRESSION:  org.apache.lucene.index.TestIndexReaderReopen.testCloseOrig

Error Message:
fileMap

Stack Trace:
java.lang.NoSuchFieldError: fileMap
	at org.apache.lucene.store.MockRAMDirectory.openInput(MockRAMDirectory.java:234)
	at org.apache.lucene.index.SegmentInfos$FindSegmentsFile.run(SegmentInfos.java:591)
	at org.apache.lucene.index.SegmentInfos$FindSegmentsFile.run(SegmentInfos.java:524)
	at org.apache.lucene.index.SegmentInfos.read(SegmentInfos.java:307)
	at org.apache.lucene.index.IndexWriter.<init>(IndexWriter.java:1093)
	at org.apache.lucene.index.IndexWriter.<init>(IndexWriter.java:914)
	at org.apache.lucene.index.TestIndexReaderReopen.createIndex(TestIndexReaderReopen.java:952)
	at org.apache.lucene.index.TestIndexReaderReopen.testCloseOrig(TestIndexReaderReopen.java:1108)
	at org.apache.lucene.util.LuceneTestCase.runBare(LuceneTestCase.java:253)


REGRESSION:  org.apache.lucene.index.TestIndexReaderReopen.testDeletes

Error Message:
fileMap

Stack Trace:
java.lang.NoSuchFieldError: fileMap
	at org.apache.lucene.store.MockRAMDirectory.openInput(MockRAMDirectory.java:234)
	at org.apache.lucene.index.SegmentInfos$FindSegmentsFile.run(SegmentInfos.java:591)
	at org.apache.lucene.index.SegmentInfos$FindSegmentsFile.run(SegmentInfos.java:524)
	at org.apache.lucene.index.SegmentInfos.read(SegmentInfos.java:307)
	at org.apache.lucene.index.IndexWriter.<init>(IndexWriter.java:1093)
	at org.apache.lucene.index.IndexWriter.<init>(IndexWriter.java:914)
	at org.apache.lucene.index.TestIndexReaderReopen.createIndex(TestIndexReaderReopen.java:952)
	at org.apache.lucene.index.TestIndexReaderReopen.testDeletes(TestIndexReaderReopen.java:1129)
	at org.apache.lucene.util.LuceneTestCase.runBare(LuceneTestCase.java:253)


REGRESSION:  org.apache.lucene.index.TestIndexReaderReopen.testDeletes2

Error Message:
fileMap

Stack Trace:
java.lang.NoSuchFieldError: fileMap
	at org.apache.lucene.store.MockRAMDirectory.openInput(MockRAMDirectory.java:234)
	at org.apache.lucene.index.SegmentInfos$FindSegmentsFile.run(SegmentInfos.java:591)
	at org.apache.lucene.index.SegmentInfos$FindSegmentsFile.run(SegmentInfos.java:524)
	at org.apache.lucene.index.SegmentInfos.read(SegmentInfos.java:307)
	at org.apache.lucene.index.IndexWriter.<init>(IndexWriter.java:1093)
	at org.apache.lucene.index.IndexWriter.<init>(IndexWriter.java:914)
	at org.apache.lucene.index.TestIndexReaderReopen.createIndex(TestIndexReaderReopen.java:952)
	at org.apache.lucene.index.TestIndexReaderReopen.testDeletes2(TestIndexReaderReopen.java:1162)
	at org.apache.lucene.util.LuceneTestCase.runBare(LuceneTestCase.java:253)


REGRESSION:  org.apache.lucene.index.TestIndexReaderReopen.testReopenOnCommit

Error Message:
fileMap

Stack Trace:
java.lang.NoSuchFieldError: fileMap
	at org.apache.lucene.store.MockRAMDirectory.openInput(MockRAMDirectory.java:234)
	at org.apache.lucene.index.SegmentInfos$FindSegmentsFile.run(SegmentInfos.java:591)
	at org.apache.lucene.index.SegmentInfos$FindSegmentsFile.run(SegmentInfos.java:524)
	at org.apache.lucene.index.SegmentInfos.read(SegmentInfos.java:307)
	at org.apache.lucene.index.IndexWriter.<init>(IndexWriter.java:1093)
	at org.apache.lucene.index.IndexWriter.<init>(IndexWriter.java:940)
	at org.apache.lucene.index.TestIndexReaderReopen.testReopenOnCommit(TestIndexReaderReopen.java:1198)
	at org.apache.lucene.util.LuceneTestCase.runBare(LuceneTestCase.java:253)


FAILED:  org.apache.lucene.index.TestIndexWriter.testAddIndexOnDiskFull

Error Message:
fileMap

Stack Trace:
java.lang.NoSuchFieldError: fileMap
	at org.apache.lucene.store.MockRAMDirectory.createOutput(MockRAMDirectory.java:211)
	at org.apache.lucene.store.Directory.copy(Directory.java:224)
	at org.apache.lucene.store.RAMDirectory.<init>(RAMDirectory.java:77)
	at org.apache.lucene.store.RAMDirectory.<init>(RAMDirectory.java:68)
	at org.apache.lucene.store.MockRAMDirectory.<init>(MockRAMDirectory.java:71)
	at org.apache.lucene.index.TestIndexWriter.testAddIndexOnDiskFull(TestIndexWriter.java:256)
	at org.apache.lucene.util.LuceneTestCase.runBare(LuceneTestCase.java:253)


FAILED:  org.apache.lucene.index.TestIndexWriter.testAddDocumentOnDiskFull

Error Message:
fileMap

Stack Trace:
java.lang.NoSuchFieldError: fileMap
	at org.apache.lucene.store.MockRAMDirectory.openInput(MockRAMDirectory.java:234)
	at org.apache.lucene.index.SegmentInfos$FindSegmentsFile.run(SegmentInfos.java:591)
	at org.apache.lucene.index.SegmentInfos$FindSegmentsFile.run(SegmentInfos.java:524)
	at org.apache.lucene.index.SegmentInfos.read(SegmentInfos.java:307)
	at org.apache.lucene.index.IndexWriter.<init>(IndexWriter.java:1093)
	at org.apache.lucene.index.IndexWriter.<init>(IndexWriter.java:887)
	at org.apache.lucene.index.TestIndexWriter.testAddDocumentOnDiskFull(TestIndexWriter.java:469)
	at org.apache.lucene.util.LuceneTestCase.runBare(LuceneTestCase.java:253)


REGRESSION:  org.apache.lucene.index.TestIndexWriter.testOptimizeTempSpaceUsage

Error Message:
fileMap

Stack Trace:
java.lang.NoSuchFieldError: fileMap
	at org.apache.lucene.store.MockRAMDirectory.openInput(MockRAMDirectory.java:234)
	at org.apache.lucene.index.SegmentInfos$FindSegmentsFile.run(SegmentInfos.java:591)
	at org.apache.lucene.index.SegmentInfos$FindSegmentsFile.run(SegmentInfos.java:524)
	at org.apache.lucene.index.SegmentInfos.read(SegmentInfos.java:307)
	at org.apache.lucene.index.IndexWriter.<init>(IndexWriter.java:1093)
	at org.apache.lucene.index.IndexWriter.<init>(IndexWriter.java:887)
	at org.apache.lucene.index.TestIndexWriter.testOptimizeTempSpaceUsage(TestIndexWriter.java:693)
	at org.apache.lucene.util.LuceneTestCase.runBare(LuceneTestCase.java:253)


REGRESSION:  org.apache.lucene.index.TestIndexWriter.testCommitOnCloseAbort

Error Message:
fileMap

Stack Trace:
java.lang.NoSuchFieldError: fileMap
	at org.apache.lucene.store.MockRAMDirectory.openInput(MockRAMDirectory.java:234)
	at org.apache.lucene.index.SegmentInfos$FindSegmentsFile.run(SegmentInfos.java:591)
	at org.apache.lucene.index.SegmentInfos$FindSegmentsFile.run(SegmentInfos.java:524)
	at org.apache.lucene.index.SegmentInfos.read(SegmentInfos.java:307)
	at org.apache.lucene.index.IndexWriter.<init>(IndexWriter.java:1093)
	at org.apache.lucene.index.IndexWriter.<init>(IndexWriter.java:887)
	at org.apache.lucene.index.TestIndexWriter.testCommitOnCloseAbort(TestIndexWriter.java:980)
	at org.apache.lucene.util.LuceneTestCase.runBare(LuceneTestCase.java:253)


REGRESSION:  org.apache.lucene.index.TestIndexWriter.testCommitOnCloseDiskUsage

Error Message:
fileMap

Stack Trace:
java.lang.NoSuchFieldError: fileMap
	at org.apache.lucene.store.MockRAMDirectory.openInput(MockRAMDirectory.java:234)
	at org.apache.lucene.index.SegmentInfos$FindSegmentsFile.run(SegmentInfos.java:591)
	at org.apache.lucene.index.SegmentInfos$FindSegmentsFile.run(SegmentInfos.java:524)
	at org.apache.lucene.index.SegmentInfos.read(SegmentInfos.java:307)
	at org.apache.lucene.index.IndexWriter.<init>(IndexWriter.java:1093)
	at org.apache.lucene.index.IndexWriter.<init>(IndexWriter.java:887)
	at org.apache.lucene.index.TestIndexWriter.testCommitOnCloseDiskUsage(TestIndexWriter.java:1053)
	at org.apache.lucene.util.LuceneTestCase.runBare(LuceneTestCase.java:253)


REGRESSION:  org.apache.lucene.index.TestIndexWriter.testBackgroundOptimize

Error Message:
fileMap

Stack Trace:
java.lang.NoSuchFieldError: fileMap
	at org.apache.lucene.store.MockRAMDirectory.openInput(MockRAMDirectory.java:234)
	at org.apache.lucene.index.SegmentInfos$FindSegmentsFile.run(SegmentInfos.java:591)
	at org.apache.lucene.index.SegmentInfos$FindSegmentsFile.run(SegmentInfos.java:524)
	at org.apache.lucene.index.SegmentInfos.read(SegmentInfos.java:307)
	at org.apache.lucene.index.IndexWriter.<init>(IndexWriter.java:1093)
	at org.apache.lucene.index.IndexWriter.<init>(IndexWriter.java:887)
	at org.apache.lucene.index.TestIndexWriter.testBackgroundOptimize(TestIndexWriter.java:1527)
	at org.apache.lucene.util.LuceneTestCase.runBare(LuceneTestCase.java:253)


REGRESSION:  org.apache.lucene.index.TestIndexWriter.testBadSegment

Error Message:
fileMap

Stack Trace:
java.lang.NoSuchFieldError: fileMap
	at org.apache.lucene.store.MockRAMDirectory.openInput(MockRAMDirectory.java:234)
	at org.apache.lucene.index.SegmentInfos$FindSegmentsFile.run(SegmentInfos.java:591)
	at org.apache.lucene.index.SegmentInfos$FindSegmentsFile.run(SegmentInfos.java:524)
	at org.apache.lucene.index.SegmentInfos.read(SegmentInfos.java:307)
	at org.apache.lucene.index.IndexWriter.<init>(IndexWriter.java:1093)
	at org.apache.lucene.index.IndexWriter.<init>(IndexWriter.java:887)
	at org.apache.lucene.index.TestIndexWriter.testBadSegment(TestIndexWriter.java:1581)
	at org.apache.lucene.util.LuceneTestCase.runBare(LuceneTestCase.java:253)


FAILED:  org.apache.lucene.index.TestIndexWriter.testNoTermVectorAfterTermVector

Error Message:
fileMap

Stack Trace:
java.lang.NoSuchFieldError: fileMap
	at org.apache.lucene.store.MockRAMDirectory.openInput(MockRAMDirectory.java:234)
	at org.apache.lucene.index.SegmentInfos$FindSegmentsFile.run(SegmentInfos.java:591)
	at org.apache.lucene.index.SegmentInfos$FindSegmentsFile.run(SegmentInfos.java:524)
	at org.apache.lucene.index.SegmentInfos.read(SegmentInfos.java:307)
	at org.apache.lucene.index.IndexWriter.<init>(IndexWriter.java:1093)
	at org.apache.lucene.index.IndexWriter.<init>(IndexWriter.java:887)
	at org.apache.lucene.index.TestIndexWriter.testNoTermVectorAfterTermVector(TestIndexWriter.java:1594)
	at org.apache.lucene.util.LuceneTestCase.runBare(LuceneTestCase.java:253)


FAILED:  org.apache.lucene.index.TestIndexWriter.testNoTermVectorAfterTermVectorMerge

Error Message:
fileMap

Stack Trace:
java.lang.NoSuchFieldError: fileMap
	at org.apache.lucene.store.MockRAMDirectory.openInput(MockRAMDirectory.java:234)
	at org.apache.lucene.index.SegmentInfos$FindSegmentsFile.run(SegmentInfos.java:591)
	at org.apache.lucene.index.SegmentInfos$FindSegmentsFile.run(SegmentInfos.java:524)
	at org.apache.lucene.index.SegmentInfos.read(SegmentInfos.java:307)
	at org.apache.lucene.index.IndexWriter.<init>(IndexWriter.java:1093)
	at org.apache.lucene.index.IndexWriter.<init>(IndexWriter.java:887)
	at org.apache.lucene.index.TestIndexWriter.testNoTermVectorAfterTermVectorMerge(TestIndexWriter.java:1620)
	at org.apache.lucene.util.LuceneTestCase.runBare(LuceneTestCase.java:253)


REGRESSION:  org.apache.lucene.index.TestIndexWriter.testMaxThreadPriority

Error Message:
fileMap

Stack Trace:
java.lang.NoSuchFieldError: fileMap
	at org.apache.lucene.store.MockRAMDirectory.openInput(MockRAMDirectory.java:234)
	at org.apache.lucene.index.SegmentInfos$FindSegmentsFile.run(SegmentInfos.java:591)
	at org.apache.lucene.index.SegmentInfos$FindSegmentsFile.run(SegmentInfos.java:524)
	at org.apache.lucene.index.SegmentInfos.read(SegmentInfos.java:307)
	at org.apache.lucene.index.IndexWriter.<init>(IndexWriter.java:1093)
	at org.apache.lucene.index.IndexWriter.<init>(IndexWriter.java:887)
	at org.apache.lucene.index.TestIndexWriter.testMaxThreadPriority(TestIndexWriter.java:1652)
	at org.apache.lucene.util.LuceneTestCase.runBare(LuceneTestCase.java:253)


REGRESSION:  org.apache.lucene.index.TestIndexWriter.testSetMaxMergeDocs

Error Message:
fileMap

Stack Trace:
java.lang.NoSuchFieldError: fileMap
	at org.apache.lucene.store.MockRAMDirectory.openInput(MockRAMDirectory.java:234)
	at org.apache.lucene.index.SegmentInfos$FindSegmentsFile.run(SegmentInfos.java:591)
	at org.apache.lucene.index.SegmentInfos$FindSegmentsFile.run(SegmentInfos.java:524)
	at org.apache.lucene.index.SegmentInfos.read(SegmentInfos.java:307)
	at org.apache.lucene.index.IndexWriter.<init>(IndexWriter.java:1093)
	at org.apache.lucene.index.IndexWriter.<init>(IndexWriter.java:887)
	at org.apache.lucene.index.TestIndexWriter.testSetMaxMergeDocs(TestIndexWriter.java:1692)
	at org.apache.lucene.util.LuceneTestCase.runBare(LuceneTestCase.java:253)


FAILED:  org.apache.lucene.index.TestIndexWriter.testExceptionFromTokenStream

Error Message:
fileMap

Stack Trace:
java.lang.NoSuchFieldError: fileMap
	at org.apache.lucene.store.MockRAMDirectory.openInput(MockRAMDirectory.java:234)
	at org.apache.lucene.index.SegmentInfos$FindSegmentsFile.run(SegmentInfos.java:591)
	at org.apache.lucene.index.SegmentInfos$FindSegmentsFile.run(SegmentInfos.java:524)
	at org.apache.lucene.index.SegmentInfos.read(SegmentInfos.java:307)
	at org.apache.lucene.index.IndexWriter.<init>(IndexWriter.java:1093)
	at org.apache.lucene.index.IndexWriter.<init>(IndexWriter.java:887)
	at org.apache.lucene.index.TestIndexWriter.testExceptionFromTokenStream(TestIndexWriter.java:1708)
	at org.apache.lucene.util.LuceneTestCase.runBare(LuceneTestCase.java:253)


FAILED:  org.apache.lucene.index.TestIndexWriter.testDocumentsWriterAbort

Error Message:
fileMap

Stack Trace:
java.lang.NoSuchFieldError: fileMap
	at org.apache.lucene.store.MockRAMDirectory.openInput(MockRAMDirectory.java:234)
	at org.apache.lucene.index.SegmentInfos$FindSegmentsFile.run(SegmentInfos.java:591)
	at org.apache.lucene.index.SegmentInfos$FindSegmentsFile.run(SegmentInfos.java:524)
	at org.apache.lucene.index.SegmentInfos.read(SegmentInfos.java:307)
	at org.apache.lucene.index.IndexWriter.<init>(IndexWriter.java:1093)
	at org.apache.lucene.index.IndexWriter.<init>(IndexWriter.java:914)
	at org.apache.lucene.index.TestIndexWriter.testDocumentsWriterAbort(TestIndexWriter.java:1810)
	at org.apache.lucene.util.LuceneTestCase.runBare(LuceneTestCase.java:253)


FAILED:  org.apache.lucene.index.TestIndexWriter.testDocumentsWriterExceptions

Error Message:
fileMap

Stack Trace:
java.lang.NoSuchFieldError: fileMap
	at org.apache.lucene.store.MockRAMDirectory.openInput(MockRAMDirectory.java:234)
	at org.apache.lucene.index.SegmentInfos$FindSegmentsFile.run(SegmentInfos.java:591)
	at org.apache.lucene.index.SegmentInfos$FindSegmentsFile.run(SegmentInfos.java:524)
	at org.apache.lucene.index.SegmentInfos.read(SegmentInfos.java:307)
	at org.apache.lucene.index.IndexWriter.<init>(IndexWriter.java:1093)
	at org.apache.lucene.index.IndexWriter.<init>(IndexWriter.java:914)
	at org.apache.lucene.index.TestIndexWriter.testDocumentsWriterExceptions(TestIndexWriter.java:1866)
	at org.apache.lucene.util.LuceneTestCase.runBare(LuceneTestCase.java:253)


FAILED:  org.apache.lucene.index.TestIndexWriter.testDocumentsWriterExceptionThreads

Error Message:
fileMap

Stack Trace:
java.lang.NoSuchFieldError: fileMap
	at org.apache.lucene.store.MockRAMDirectory.openInput(MockRAMDirectory.java:234)
	at org.apache.lucene.index.SegmentInfos$FindSegmentsFile.run(SegmentInfos.java:591)
	at org.apache.lucene.index.SegmentInfos$FindSegmentsFile.run(SegmentInfos.java:524)
	at org.apache.lucene.index.SegmentInfos.read(SegmentInfos.java:307)
	at org.apache.lucene.index.IndexWriter.<init>(IndexWriter.java:1093)
	at org.apache.lucene.index.IndexWriter.<init>(IndexWriter.java:914)
	at org.apache.lucene.index.TestIndexWriter.testDocumentsWriterExceptionThreads(TestIndexWriter.java:1954)
	at org.apache.lucene.util.LuceneTestCase.runBare(LuceneTestCase.java:253)


REGRESSION:  org.apache.lucene.index.TestIndexWriter.testVariableSchema

Error Message:
fileMap

Stack Trace:
java.lang.NoSuchFieldError: fileMap
	at org.apache.lucene.store.MockRAMDirectory.openInput(MockRAMDirectory.java:234)
	at org.apache.lucene.index.SegmentInfos$FindSegmentsFile.run(SegmentInfos.java:591)
	at org.apache.lucene.index.SegmentInfos$FindSegmentsFile.run(SegmentInfos.java:524)
	at org.apache.lucene.index.SegmentInfos.read(SegmentInfos.java:307)
	at org.apache.lucene.index.IndexWriter.<init>(IndexWriter.java:1093)
	at org.apache.lucene.index.IndexWriter.<init>(IndexWriter.java:914)
	at org.apache.lucene.index.TestIndexWriter.testVariableSchema(TestIndexWriter.java:2057)
	at org.apache.lucene.util.LuceneTestCase.runBare(LuceneTestCase.java:253)


REGRESSION:  org.apache.lucene.index.TestIndexWriter.testNoWaitClose

Error Message:
fileMap

Stack Trace:
java.lang.NoSuchFieldError: fileMap
	at org.apache.lucene.store.MockRAMDirectory.openInput(MockRAMDirectory.java:234)
	at org.apache.lucene.index.SegmentInfos$FindSegmentsFile.run(SegmentInfos.java:591)
	at org.apache.lucene.index.SegmentInfos$FindSegmentsFile.run(SegmentInfos.java:524)
	at org.apache.lucene.index.SegmentInfos.read(SegmentInfos.java:307)
	at org.apache.lucene.index.IndexWriter.<init>(IndexWriter.java:1093)
	at org.apache.lucene.index.IndexWriter.<init>(IndexWriter.java:887)
	at org.apache.lucene.index.TestIndexWriter.testNoWaitClose(TestIndexWriter.java:2110)
	at org.apache.lucene.util.LuceneTestCase.runBare(LuceneTestCase.java:253)


FAILED:  org.apache.lucene.index.TestIndexWriter.testCloseWithThreads

Error Message:
fileMap

Stack Trace:
java.lang.NoSuchFieldError: fileMap
	at org.apache.lucene.store.MockRAMDirectory.openInput(MockRAMDirectory.java:234)
	at org.apache.lucene.index.SegmentInfos$FindSegmentsFile.run(SegmentInfos.java:591)
	at org.apache.lucene.index.SegmentInfos$FindSegmentsFile.run(SegmentInfos.java:524)
	at org.apache.lucene.index.SegmentInfos.read(SegmentInfos.java:307)
	at org.apache.lucene.index.IndexWriter.<init>(IndexWriter.java:1093)
	at org.apache.lucene.index.IndexWriter.<init>(IndexWriter.java:914)
	at org.apache.lucene.index.TestIndexWriter.testCloseWithThreads(TestIndexWriter.java:2262)
	at org.apache.lucene.util.LuceneTestCase.runBare(LuceneTestCase.java:253)


FAILED:  org.apache.lucene.index.TestIndexWriter.testImmediateDiskFull

Error Message:
fileMap

Stack Trace:
java.lang.NoSuchFieldError: fileMap
	at org.apache.lucene.store.MockRAMDirectory.openInput(MockRAMDirectory.java:234)
	at org.apache.lucene.index.SegmentInfos$FindSegmentsFile.run(SegmentInfos.java:591)
	at org.apache.lucene.index.SegmentInfos$FindSegmentsFile.run(SegmentInfos.java:524)
	at org.apache.lucene.index.SegmentInfos.read(SegmentInfos.java:307)
	at org.apache.lucene.index.IndexWriter.<init>(IndexWriter.java:1093)
	at org.apache.lucene.index.IndexWriter.<init>(IndexWriter.java:914)
	at org.apache.lucene.index.TestIndexWriter.testImmediateDiskFull(TestIndexWriter.java:2321)
	at org.apache.lucene.util.LuceneTestCase.runBare(LuceneTestCase.java:253)


FAILED:  org.apache.lucene.index.TestIndexWriter.testImmediateDiskFullWithThreads

Error Message:
fileMap

Stack Trace:
java.lang.NoSuchFieldError: fileMap
	at org.apache.lucene.store.MockRAMDirectory.openInput(MockRAMDirectory.java:234)
	at org.apache.lucene.index.SegmentInfos$FindSegmentsFile.run(SegmentInfos.java:591)
	at org.apache.lucene.index.SegmentInfos$FindSegmentsFile.run(SegmentInfos.java:524)
	at org.apache.lucene.index.SegmentInfos.read(SegmentInfos.java:307)
	at org.apache.lucene.index.IndexWriter.<init>(IndexWriter.java:1093)
	at org.apache.lucene.index.IndexWriter.<init>(IndexWriter.java:914)
	at org.apache.lucene.index.TestIndexWriter.testImmediateDiskFullWithThreads(TestIndexWriter.java:2359)
	at org.apache.lucene.util.LuceneTestCase.runBare(LuceneTestCase.java:253)


FAILED:  org.apache.lucene.index.TestIndexWriter.testIOExceptionDuringAbort

Error Message:
fileMap

Stack Trace:
java.lang.NoSuchFieldError: fileMap
	at org.apache.lucene.store.MockRAMDirectory.openInput(MockRAMDirectory.java:234)
	at org.apache.lucene.index.SegmentInfos$FindSegmentsFile.run(SegmentInfos.java:591)
	at org.apache.lucene.index.SegmentInfos$FindSegmentsFile.run(SegmentInfos.java:524)
	at org.apache.lucene.index.SegmentInfos.read(SegmentInfos.java:307)
	at org.apache.lucene.index.IndexWriter.<init>(IndexWriter.java:1093)
	at org.apache.lucene.index.IndexWriter.<init>(IndexWriter.java:914)
	at org.apache.lucene.index.TestIndexWriter._testSingleThreadFailure(TestIndexWriter.java:2420)
	at org.apache.lucene.index.TestIndexWriter.testIOExceptionDuringAbort(TestIndexWriter.java:2503)
	at org.apache.lucene.util.LuceneTestCase.runBare(LuceneTestCase.java:253)


FAILED:  org.apache.lucene.index.TestIndexWriter.testIOExceptionDuringAbortOnlyOnce

Error Message:
fileMap

Stack Trace:
java.lang.NoSuchFieldError: fileMap
	at org.apache.lucene.store.MockRAMDirectory.openInput(MockRAMDirectory.java:234)
	at org.apache.lucene.index.SegmentInfos$FindSegmentsFile.run(SegmentInfos.java:591)
	at org.apache.lucene.index.SegmentInfos$FindSegmentsFile.run(SegmentInfos.java:524)
	at org.apache.lucene.index.SegmentInfos.read(SegmentInfos.java:307)
	at org.apache.lucene.index.IndexWriter.<init>(IndexWriter.java:1093)
	at org.apache.lucene.index.IndexWriter.<init>(IndexWriter.java:914)
	at org.apache.lucene.index.TestIndexWriter._testSingleThreadFailure(TestIndexWriter.java:2420)
	at org.apache.lucene.index.TestIndexWriter.testIOExceptionDuringAbortOnlyOnce(TestIndexWriter.java:2509)
	at org.apache.lucene.util.LuceneTestCase.runBare(LuceneTestCase.java:253)


FAILED:  org.apache.lucene.index.TestIndexWriter.testIOExceptionDuringAbortWithThreads

Error Message:
fileMap

Stack Trace:
java.lang.NoSuchFieldError: fileMap
	at org.apache.lucene.store.MockRAMDirectory.openInput(MockRAMDirectory.java:234)
	at org.apache.lucene.index.SegmentInfos$FindSegmentsFile.run(SegmentInfos.java:591)
	at org.apache.lucene.index.SegmentInfos$FindSegmentsFile.run(SegmentInfos.java:524)
	at org.apache.lucene.index.SegmentInfos.read(SegmentInfos.java:307)
	at org.apache.lucene.index.IndexWriter.<init>(IndexWriter.java:1093)
	at org.apache.lucene.index.IndexWriter.<init>(IndexWriter.java:914)
	at org.apache.lucene.index.TestIndexWriter._testMultipleThreadsFailure(TestIndexWriter.java:2450)
	at org.apache.lucene.index.TestIndexWriter.testIOExceptionDuringAbortWithThreads(TestIndexWriter.java:2515)
	at org.apache.lucene.util.LuceneTestCase.runBare(LuceneTestCase.java:253)


FAILED:  org.apache.lucene.index.TestIndexWriter.testIOExceptionDuringAbortWithThreadsOnlyOnce

Error Message:
fileMap

Stack Trace:
java.lang.NoSuchFieldError: fileMap
	at org.apache.lucene.store.MockRAMDirectory.openInput(MockRAMDirectory.java:234)
	at org.apache.lucene.index.SegmentInfos$FindSegmentsFile.run(SegmentInfos.java:591)
	at org.apache.lucene.index.SegmentInfos$FindSegmentsFile.run(SegmentInfos.java:524)
	at org.apache.lucene.index.SegmentInfos.read(SegmentInfos.java:307)
	at org.apache.lucene.index.IndexWriter.<init>(IndexWriter.java:1093)
	at org.apache.lucene.index.IndexWriter.<init>(IndexWriter.java:914)
	at org.apache.lucene.index.TestIndexWriter._testMultipleThreadsFailure(TestIndexWriter.java:2450)
	at org.apache.lucene.index.TestIndexWriter.testIOExceptionDuringAbortWithThreadsOnlyOnce(TestIndexWriter.java:2521)
	at org.apache.lucene.util.LuceneTestCase.runBare(LuceneTestCase.java:253)


FAILED:  org.apache.lucene.index.TestIndexWriter.testIOExceptionDuringCloseDocStore

Error Message:
fileMap

Stack Trace:
java.lang.NoSuchFieldError: fileMap
	at org.apache.lucene.store.MockRAMDirectory.openInput(MockRAMDirectory.java:234)
	at org.apache.lucene.index.SegmentInfos$FindSegmentsFile.run(SegmentInfos.java:591)
	at org.apache.lucene.index.SegmentInfos$FindSegmentsFile.run(SegmentInfos.java:524)
	at org.apache.lucene.index.SegmentInfos.read(SegmentInfos.java:307)
	at org.apache.lucene.index.IndexWriter.<init>(IndexWriter.java:1093)
	at org.apache.lucene.index.IndexWriter.<init>(IndexWriter.java:914)
	at org.apache.lucene.index.TestIndexWriter._testSingleThreadFailure(TestIndexWriter.java:2420)
	at org.apache.lucene.index.TestIndexWriter.testIOExceptionDuringCloseDocStore(TestIndexWriter.java:2547)
	at org.apache.lucene.util.LuceneTestCase.runBare(LuceneTestCase.java:253)


FAILED:  org.apache.lucene.index.TestIndexWriter.testIOExceptionDuringCloseDocStoreOnlyOnce

Error Message:
fileMap

Stack Trace:
java.lang.NoSuchFieldError: fileMap
	at org.apache.lucene.store.MockRAMDirectory.openInput(MockRAMDirectory.java:234)
	at org.apache.lucene.index.SegmentInfos$FindSegmentsFile.run(SegmentInfos.java:591)
	at org.apache.lucene.index.SegmentInfos$FindSegmentsFile.run(SegmentInfos.java:524)
	at org.apache.lucene.index.SegmentInfos.read(SegmentInfos.java:307)
	at org.apache.lucene.index.IndexWriter.<init>(IndexWriter.java:1093)
	at org.apache.lucene.index.IndexWriter.<init>(IndexWriter.java:914)
	at org.apache.lucene.index.TestIndexWriter._testSingleThreadFailure(TestIndexWriter.java:2420)
	at org.apache.lucene.index.TestIndexWriter.testIOExceptionDuringCloseDocStoreOnlyOnce(TestIndexWriter.java:2552)
	at org.apache.lucene.util.LuceneTestCase.runBare(LuceneTestCase.java:253)


FAILED:  org.apache.lucene.index.TestIndexWriter.testIOExceptionDuringCloseDocStoreWithThreads

Error Message:
fileMap

Stack Trace:
java.lang.NoSuchFieldError: fileMap
	at org.apache.lucene.store.MockRAMDirectory.openInput(MockRAMDirectory.java:234)
	at org.apache.lucene.index.SegmentInfos$FindSegmentsFile.run(SegmentInfos.java:591)
	at org.apache.lucene.index.SegmentInfos$FindSegmentsFile.run(SegmentInfos.java:524)
	at org.apache.lucene.index.SegmentInfos.read(SegmentInfos.java:307)
	at org.apache.lucene.index.IndexWriter.<init>(IndexWriter.java:1093)
	at org.apache.lucene.index.IndexWriter.<init>(IndexWriter.java:914)
	at org.apache.lucene.index.TestIndexWriter._testMultipleThreadsFailure(TestIndexWriter.java:2450)
	at org.apache.lucene.index.TestIndexWriter.testIOExceptionDuringCloseDocStoreWithThreads(TestIndexWriter.java:2557)
	at org.apache.lucene.util.LuceneTestCase.runBare(LuceneTestCase.java:253)


FAILED:  org.apache.lucene.index.TestIndexWriter.testIOExceptionDuringCloseDocStoreWithThreadsOnlyOnce

Error Message:
fileMap

Stack Trace:
java.lang.NoSuchFieldError: fileMap
	at org.apache.lucene.store.MockRAMDirectory.openInput(MockRAMDirectory.java:234)
	at org.apache.lucene.index.SegmentInfos$FindSegmentsFile.run(SegmentInfos.java:591)
	at org.apache.lucene.index.SegmentInfos$FindSegmentsFile.run(SegmentInfos.java:524)
	at org.apache.lucene.index.SegmentInfos.read(SegmentInfos.java:307)
	at org.apache.lucene.index.IndexWriter.<init>(IndexWriter.java:1093)
	at org.apache.lucene.index.IndexWriter.<init>(IndexWriter.java:914)
	at org.apache.lucene.index.TestIndexWriter._testMultipleThreadsFailure(TestIndexWriter.java:2450)
	at org.apache.lucene.index.TestIndexWriter.testIOExceptionDuringCloseDocStoreWithThreadsOnlyOnce(TestIndexWriter.java:2562)
	at org.apache.lucene.util.LuceneTestCase.runBare(LuceneTestCase.java:253)


FAILED:  org.apache.lucene.index.TestIndexWriter.testIOExceptionDuringWriteSegment

Error Message:
fileMap

Stack Trace:
java.lang.NoSuchFieldError: fileMap
	at org.apache.lucene.store.MockRAMDirectory.openInput(MockRAMDirectory.java:234)
	at org.apache.lucene.index.SegmentInfos$FindSegmentsFile.run(SegmentInfos.java:591)
	at org.apache.lucene.index.SegmentInfos$FindSegmentsFile.run(SegmentInfos.java:524)
	at org.apache.lucene.index.SegmentInfos.read(SegmentInfos.java:307)
	at org.apache.lucene.index.IndexWriter.<init>(IndexWriter.java:1093)
	at org.apache.lucene.index.IndexWriter.<init>(IndexWriter.java:914)
	at org.apache.lucene.index.TestIndexWriter._testSingleThreadFailure(TestIndexWriter.java:2420)
	at org.apache.lucene.index.TestIndexWriter.testIOExceptionDuringWriteSegment(TestIndexWriter.java:2588)
	at org.apache.lucene.util.LuceneTestCase.runBare(LuceneTestCase.java:253)


FAILED:  org.apache.lucene.index.TestIndexWriter.testIOExceptionDuringWriteSegmentOnlyOnce

Error Message:
fileMap

Stack Trace:
java.lang.NoSuchFieldError: fileMap
	at org.apache.lucene.store.MockRAMDirectory.openInput(MockRAMDirectory.java:234)
	at org.apache.lucene.index.SegmentInfos$FindSegmentsFile.run(SegmentInfos.java:591)
	at org.apache.lucene.index.SegmentInfos$FindSegmentsFile.run(SegmentInfos.java:524)
	at org.apache.lucene.index.SegmentInfos.read(SegmentInfos.java:307)
	at org.apache.lucene.index.IndexWriter.<init>(IndexWriter.java:1093)
	at org.apache.lucene.index.IndexWriter.<init>(IndexWriter.java:914)
	at org.apache.lucene.index.TestIndexWriter._testSingleThreadFailure(TestIndexWriter.java:2420)
	at org.apache.lucene.index.TestIndexWriter.testIOExceptionDuringWriteSegmentOnlyOnce(TestIndexWriter.java:2593)
	at org.apache.lucene.util.LuceneTestCase.runBare(LuceneTestCase.java:253)


FAILED:  org.apache.lucene.index.TestIndexWriter.testIOExceptionDuringWriteSegmentWithThreads

Error Message:
fileMap

Stack Trace:
java.lang.NoSuchFieldError: fileMap
	at org.apache.lucene.store.MockRAMDirectory.openInput(MockRAMDirectory.java:234)
	at org.apache.lucene.index.SegmentInfos$FindSegmentsFile.run(SegmentInfos.java:591)
	at org.apache.lucene.index.SegmentInfos$FindSegmentsFile.run(SegmentInfos.java:524)
	at org.apache.lucene.index.SegmentInfos.read(SegmentInfos.java:307)
	at org.apache.lucene.index.IndexWriter.<init>(IndexWriter.java:1093)
	at org.apache.lucene.index.IndexWriter.<init>(IndexWriter.java:914)
	at org.apache.lucene.index.TestIndexWriter._testMultipleThreadsFailure(TestIndexWriter.java:2450)
	at org.apache.lucene.index.TestIndexWriter.testIOExceptionDuringWriteSegmentWithThreads(TestIndexWriter.java:2598)
	at org.apache.lucene.util.LuceneTestCase.runBare(LuceneTestCase.java:253)


FAILED:  org.apache.lucene.index.TestIndexWriter.testIOExceptionDuringWriteSegmentWithThreadsOnlyOnce

Error Message:
fileMap

Stack Trace:
java.lang.NoSuchFieldError: fileMap
	at org.apache.lucene.store.MockRAMDirectory.openInput(MockRAMDirectory.java:234)
	at org.apache.lucene.index.SegmentInfos$FindSegmentsFile.run(SegmentInfos.java:591)
	at org.apache.lucene.index.SegmentInfos$FindSegmentsFile.run(SegmentInfos.java:524)
	at org.apache.lucene.index.SegmentInfos.read(SegmentInfos.java:307)
	at org.apache.lucene.index.IndexWriter.<init>(IndexWriter.java:1093)
	at org.apache.lucene.index.IndexWriter.<init>(IndexWriter.java:914)
	at org.apache.lucene.index.TestIndexWriter._testMultipleThreadsFailure(TestIndexWriter.java:2450)
	at org.apache.lucene.index.TestIndexWriter.testIOExceptionDuringWriteSegmentWithThreadsOnlyOnce(TestIndexWriter.java:2603)
	at org.apache.lucene.util.LuceneTestCase.runBare(LuceneTestCase.java:253)


REGRESSION:  org.apache.lucene.index.TestIndexWriter.testUnlimitedMaxFieldLength

Error Message:
fileMap

Stack Trace:
java.lang.NoSuchFieldError: fileMap
	at org.apache.lucene.store.MockRAMDirectory.openInput(MockRAMDirectory.java:234)
	at org.apache.lucene.index.SegmentInfos$FindSegmentsFile.run(SegmentInfos.java:591)
	at org.apache.lucene.index.SegmentInfos$FindSegmentsFile.run(SegmentInfos.java:524)
	at org.apache.lucene.index.SegmentInfos.read(SegmentInfos.java:307)
	at org.apache.lucene.index.IndexWriter.<init>(IndexWriter.java:1093)
	at org.apache.lucene.index.IndexWriter.<init>(IndexWriter.java:914)
	at org.apache.lucene.index.TestIndexWriter.testUnlimitedMaxFieldLength(TestIndexWriter.java:2610)
	at org.apache.lucene.util.LuceneTestCase.runBare(LuceneTestCase.java:253)


FAILED:  org.apache.lucene.index.TestIndexWriter.testSegmentsChecksumError

Error Message:
fileMap

Stack Trace:
java.lang.NoSuchFieldError: fileMap
	at org.apache.lucene.store.MockRAMDirectory.openInput(MockRAMDirectory.java:234)
	at org.apache.lucene.index.SegmentInfos$FindSegmentsFile.run(SegmentInfos.java:591)
	at org.apache.lucene.index.SegmentInfos$FindSegmentsFile.run(SegmentInfos.java:524)
	at org.apache.lucene.index.SegmentInfos.read(SegmentInfos.java:307)
	at org.apache.lucene.index.IndexWriter.<init>(IndexWriter.java:1093)
	at org.apache.lucene.index.IndexWriter.<init>(IndexWriter.java:887)
	at org.apache.lucene.index.TestIndexWriter.testSegmentsChecksumError(TestIndexWriter.java:2634)
	at org.apache.lucene.util.LuceneTestCase.runBare(LuceneTestCase.java:253)


REGRESSION:  org.apache.lucene.index.TestIndexWriter.testForceCommit

Error Message:
fileMap

Stack Trace:
java.lang.NoSuchFieldError: fileMap
	at org.apache.lucene.store.MockRAMDirectory.openInput(MockRAMDirectory.java:234)
	at org.apache.lucene.index.SegmentInfos$FindSegmentsFile.run(SegmentInfos.java:591)
	at org.apache.lucene.index.SegmentInfos$FindSegmentsFile.run(SegmentInfos.java:524)
	at org.apache.lucene.index.SegmentInfos.read(SegmentInfos.java:307)
	at org.apache.lucene.index.IndexWriter.<init>(IndexWriter.java:1093)
	at org.apache.lucene.index.IndexWriter.<init>(IndexWriter.java:914)
	at org.apache.lucene.index.TestIndexWriter.testForceCommit(TestIndexWriter.java:2670)
	at org.apache.lucene.util.LuceneTestCase.runBare(LuceneTestCase.java:253)


FAILED:  org.apache.lucene.index.TestIndexWriter.testExceptionDuringSync

Error Message:
fileMap

Stack Trace:
java.lang.NoSuchFieldError: fileMap
	at org.apache.lucene.store.MockRAMDirectory.openInput(MockRAMDirectory.java:234)
	at org.apache.lucene.index.SegmentInfos$FindSegmentsFile.run(SegmentInfos.java:591)
	at org.apache.lucene.index.SegmentInfos$FindSegmentsFile.run(SegmentInfos.java:524)
	at org.apache.lucene.index.SegmentInfos.read(SegmentInfos.java:307)
	at org.apache.lucene.index.IndexWriter.<init>(IndexWriter.java:1093)
	at org.apache.lucene.index.IndexWriter.<init>(IndexWriter.java:914)
	at org.apache.lucene.index.TestIndexWriter.testExceptionDuringSync(TestIndexWriter.java:2725)
	at org.apache.lucene.util.LuceneTestCase.runBare(LuceneTestCase.java:253)


REGRESSION:  org.apache.lucene.index.TestIndexWriter.testUserSpecifiedMaxFieldLength

Error Message:
fileMap

Stack Trace:
java.lang.NoSuchFieldError: fileMap
	at org.apache.lucene.store.MockRAMDirectory.openInput(MockRAMDirectory.java:234)
	at org.apache.lucene.index.SegmentInfos$FindSegmentsFile.run(SegmentInfos.java:591)
	at org.apache.lucene.index.SegmentInfos$FindSegmentsFile.run(SegmentInfos.java:524)
	at org.apache.lucene.index.SegmentInfos.read(SegmentInfos.java:307)
	at org.apache.lucene.index.IndexWriter.<init>(IndexWriter.java:1093)
	at org.apache.lucene.index.IndexWriter.<init>(IndexWriter.java:914)
	at org.apache.lucene.index.TestIndexWriter.testUserSpecifiedMaxFieldLength(TestIndexWriter.java:2899)
	at org.apache.lucene.util.LuceneTestCase.runBare(LuceneTestCase.java:253)


REGRESSION:  org.apache.lucene.index.TestIndexWriter.testExpungeDeletes

Error Message:
fileMap

Stack Trace:
java.lang.NoSuchFieldError: fileMap
	at org.apache.lucene.store.MockRAMDirectory.openInput(MockRAMDirectory.java:234)
	at org.apache.lucene.index.SegmentInfos$FindSegmentsFile.run(SegmentInfos.java:591)
	at org.apache.lucene.index.SegmentInfos$FindSegmentsFile.run(SegmentInfos.java:524)
	at org.apache.lucene.index.SegmentInfos.read(SegmentInfos.java:307)
	at org.apache.lucene.index.IndexWriter.<init>(IndexWriter.java:1093)
	at org.apache.lucene.index.IndexWriter.<init>(IndexWriter.java:914)
	at org.apache.lucene.index.TestIndexWriter.testExpungeDeletes(TestIndexWriter.java:2921)
	at org.apache.lucene.util.LuceneTestCase.runBare(LuceneTestCase.java:253)


REGRESSION:  org.apache.lucene.index.TestIndexWriter.testExpungeDeletes2

Error Message:
fileMap

Stack Trace:
java.lang.NoSuchFieldError: fileMap
	at org.apache.lucene.store.MockRAMDirectory.openInput(MockRAMDirectory.java:234)
	at org.apache.lucene.index.SegmentInfos$FindSegmentsFile.run(SegmentInfos.java:591)
	at org.apache.lucene.index.SegmentInfos$FindSegmentsFile.run(SegmentInfos.java:524)
	at org.apache.lucene.index.SegmentInfos.read(SegmentInfos.java:307)
	at org.apache.lucene.index.IndexWriter.<init>(IndexWriter.java:1093)
	at org.apache.lucene.index.IndexWriter.<init>(IndexWriter.java:914)
	at org.apache.lucene.index.TestIndexWriter.testExpungeDeletes2(TestIndexWriter.java:2967)
	at org.apache.lucene.util.LuceneTestCase.runBare(LuceneTestCase.java:253)


REGRESSION:  org.apache.lucene.index.TestIndexWriter.testExpungeDeletes3

Error Message:
fileMap

Stack Trace:
java.lang.NoSuchFieldError: fileMap
	at org.apache.lucene.store.MockRAMDirectory.openInput(MockRAMDirectory.java:234)
	at org.apache.lucene.index.SegmentInfos$FindSegmentsFile.run(SegmentInfos.java:591)
	at org.apache.lucene.index.SegmentInfos$FindSegmentsFile.run(SegmentInfos.java:524)
	at org.apache.lucene.index.SegmentInfos.read(SegmentInfos.java:307)
	at org.apache.lucene.index.IndexWriter.<init>(IndexWriter.java:1093)
	at org.apache.lucene.index.IndexWriter.<init>(IndexWriter.java:914)
	at org.apache.lucene.index.TestIndexWriter.testExpungeDeletes3(TestIndexWriter.java:3014)
	at org.apache.lucene.util.LuceneTestCase.runBare(LuceneTestCase.java:253)


REGRESSION:  org.apache.lucene.index.TestIndexWriter.testEmptyFieldName

Error Message:
fileMap

Stack Trace:
java.lang.NoSuchFieldError: fileMap
	at org.apache.lucene.store.MockRAMDirectory.openInput(MockRAMDirectory.java:234)
	at org.apache.lucene.index.SegmentInfos$FindSegmentsFile.run(SegmentInfos.java:591)
	at org.apache.lucene.index.SegmentInfos$FindSegmentsFile.run(SegmentInfos.java:524)
	at org.apache.lucene.index.SegmentInfos.read(SegmentInfos.java:307)
	at org.apache.lucene.index.IndexWriter.<init>(IndexWriter.java:1093)
	at org.apache.lucene.index.IndexWriter.<init>(IndexWriter.java:914)
	at org.apache.lucene.index.TestIndexWriter.testEmptyFieldName(TestIndexWriter.java:3060)
	at org.apache.lucene.util.LuceneTestCase.runBare(LuceneTestCase.java:253)


FAILED:  org.apache.lucene.index.TestIndexWriter.testExceptionDocumentsWriterInit

Error Message:
fileMap

Stack Trace:
java.lang.NoSuchFieldError: fileMap
	at org.apache.lucene.store.MockRAMDirectory.openInput(MockRAMDirectory.java:234)
	at org.apache.lucene.index.SegmentInfos$FindSegmentsFile.run(SegmentInfos.java:591)
	at org.apache.lucene.index.SegmentInfos$FindSegmentsFile.run(SegmentInfos.java:524)
	at org.apache.lucene.index.SegmentInfos.read(SegmentInfos.java:307)
	at org.apache.lucene.index.IndexWriter.<init>(IndexWriter.java:1093)
	at org.apache.lucene.index.IndexWriter.<init>(IndexWriter.java:887)
	at org.apache.lucene.index.TestIndexWriter$MockIndexWriter.<init>(TestIndexWriter.java:3071)
	at org.apache.lucene.index.TestIndexWriter.testExceptionDocumentsWriterInit(TestIndexWriter.java:3086)
	at org.apache.lucene.util.LuceneTestCase.runBare(LuceneTestCase.java:253)


FAILED:  org.apache.lucene.index.TestIndexWriter.testExceptionJustBeforeFlush

Error Message:
fileMap

Stack Trace:
java.lang.NoSuchFieldError: fileMap
	at org.apache.lucene.store.MockRAMDirectory.openInput(MockRAMDirectory.java:234)
	at org.apache.lucene.index.SegmentInfos$FindSegmentsFile.run(SegmentInfos.java:591)
	at org.apache.lucene.index.SegmentInfos$FindSegmentsFile.run(SegmentInfos.java:524)
	at org.apache.lucene.index.SegmentInfos.read(SegmentInfos.java:307)
	at org.apache.lucene.index.IndexWriter.<init>(IndexWriter.java:1093)
	at org.apache.lucene.index.IndexWriter.<init>(IndexWriter.java:887)
	at org.apache.lucene.index.TestIndexWriter$MockIndexWriter.<init>(TestIndexWriter.java:3071)
	at org.apache.lucene.index.TestIndexWriter.testExceptionJustBeforeFlush(TestIndexWriter.java:3106)
	at org.apache.lucene.util.LuceneTestCase.runBare(LuceneTestCase.java:253)


FAILED:  org.apache.lucene.index.TestIndexWriter.testExceptionOnMergeInit

Error Message:
fileMap

Stack Trace:
java.lang.NoSuchFieldError: fileMap
	at org.apache.lucene.store.MockRAMDirectory.openInput(MockRAMDirectory.java:234)
	at org.apache.lucene.index.SegmentInfos$FindSegmentsFile.run(SegmentInfos.java:591)
	at org.apache.lucene.index.SegmentInfos$FindSegmentsFile.run(SegmentInfos.java:524)
	at org.apache.lucene.index.SegmentInfos.read(SegmentInfos.java:307)
	at org.apache.lucene.index.IndexWriter.<init>(IndexWriter.java:1093)
	at org.apache.lucene.index.IndexWriter.<init>(IndexWriter.java:887)
	at org.apache.lucene.index.TestIndexWriter$MockIndexWriter2.<init>(TestIndexWriter.java:3137)
	at org.apache.lucene.index.TestIndexWriter.testExceptionOnMergeInit(TestIndexWriter.java:3156)
	at org.apache.lucene.util.LuceneTestCase.runBare(LuceneTestCase.java:253)


FAILED:  org.apache.lucene.index.TestIndexWriter.testDoAfterFlush

Error Message:
fileMap

Stack Trace:
java.lang.NoSuchFieldError: fileMap
	at org.apache.lucene.store.MockRAMDirectory.openInput(MockRAMDirectory.java:234)
	at org.apache.lucene.index.SegmentInfos$FindSegmentsFile.run(SegmentInfos.java:591)
	at org.apache.lucene.index.SegmentInfos$FindSegmentsFile.run(SegmentInfos.java:524)
	at org.apache.lucene.index.SegmentInfos.read(SegmentInfos.java:307)
	at org.apache.lucene.index.IndexWriter.<init>(IndexWriter.java:1093)
	at org.apache.lucene.index.IndexWriter.<init>(IndexWriter.java:887)
	at org.apache.lucene.index.TestIndexWriter$MockIndexWriter3.<init>(TestIndexWriter.java:3180)
	at org.apache.lucene.index.TestIndexWriter.testDoAfterFlush(TestIndexWriter.java:3194)
	at org.apache.lucene.util.LuceneTestCase.runBare(LuceneTestCase.java:253)


FAILED:  org.apache.lucene.index.TestIndexWriter.testExceptionsDuringCommit

Error Message:
fileMap

Stack Trace:
java.lang.NoSuchFieldError: fileMap
	at org.apache.lucene.store.MockRAMDirectory.openInput(MockRAMDirectory.java:234)
	at org.apache.lucene.index.SegmentInfos$FindSegmentsFile.run(SegmentInfos.java:591)
	at org.apache.lucene.index.SegmentInfos$FindSegmentsFile.run(SegmentInfos.java:524)
	at org.apache.lucene.index.SegmentInfos.read(SegmentInfos.java:307)
	at org.apache.lucene.index.IndexWriter.<init>(IndexWriter.java:1093)
	at org.apache.lucene.index.IndexWriter.<init>(IndexWriter.java:887)
	at org.apache.lucene.index.TestIndexWriter.testExceptionsDuringCommit(TestIndexWriter.java:3247)
	at org.apache.lucene.util.LuceneTestCase.runBare(LuceneTestCase.java:253)


REGRESSION:  org.apache.lucene.index.TestIndexWriter.testInvalidUTF16

Error Message:
fileMap

Stack Trace:
java.lang.NoSuchFieldError: fileMap
	at org.apache.lucene.store.MockRAMDirectory.openInput(MockRAMDirectory.java:234)
	at org.apache.lucene.index.SegmentInfos$FindSegmentsFile.run(SegmentInfos.java:591)
	at org.apache.lucene.index.SegmentInfos$FindSegmentsFile.run(SegmentInfos.java:524)
	at org.apache.lucene.index.SegmentInfos.read(SegmentInfos.java:307)
	at org.apache.lucene.index.IndexWriter.<init>(IndexWriter.java:1093)
	at org.apache.lucene.index.IndexWriter.<init>(IndexWriter.java:887)
	at org.apache.lucene.index.TestIndexWriter.testInvalidUTF16(TestIndexWriter.java:3295)
	at org.apache.lucene.util.LuceneTestCase.runBare(LuceneTestCase.java:253)


REGRESSION:  org.apache.lucene.index.TestIndexWriter.testNegativePositions

Error Message:
fileMap

Stack Trace:
java.lang.NoSuchFieldError: fileMap
	at org.apache.lucene.store.MockRAMDirectory.openInput(MockRAMDirectory.java:234)
	at org.apache.lucene.index.SegmentInfos$FindSegmentsFile.run(SegmentInfos.java:591)
	at org.apache.lucene.index.SegmentInfos$FindSegmentsFile.run(SegmentInfos.java:524)
	at org.apache.lucene.index.SegmentInfos.read(SegmentInfos.java:307)
	at org.apache.lucene.index.IndexWriter.<init>(IndexWriter.java:1093)
	at org.apache.lucene.index.IndexWriter.<init>(IndexWriter.java:887)
	at org.apache.lucene.index.TestIndexWriter.testNegativePositions(TestIndexWriter.java:3508)
	at org.apache.lucene.util.LuceneTestCase.runBare(LuceneTestCase.java:253)


REGRESSION:  org.apache.lucene.index.TestIndexWriter.testPrepareCommit

Error Message:
fileMap

Stack Trace:
java.lang.NoSuchFieldError: fileMap
	at org.apache.lucene.store.MockRAMDirectory.openInput(MockRAMDirectory.java:234)
	at org.apache.lucene.index.SegmentInfos$FindSegmentsFile.run(SegmentInfos.java:591)
	at org.apache.lucene.index.SegmentInfos$FindSegmentsFile.run(SegmentInfos.java:524)
	at org.apache.lucene.index.SegmentInfos.read(SegmentInfos.java:307)
	at org.apache.lucene.index.IndexWriter.<init>(IndexWriter.java:1093)
	at org.apache.lucene.index.IndexWriter.<init>(IndexWriter.java:914)
	at org.apache.lucene.index.TestIndexWriter.testPrepareCommit(TestIndexWriter.java:3540)
	at org.apache.lucene.util.LuceneTestCase.runBare(LuceneTestCase.java:253)


REGRESSION:  org.apache.lucene.index.TestIndexWriter.testPrepareCommitRollback

Error Message:
fileMap

Stack Trace:
java.lang.NoSuchFieldError: fileMap
	at org.apache.lucene.store.MockRAMDirectory.openInput(MockRAMDirectory.java:234)
	at org.apache.lucene.index.SegmentInfos$FindSegmentsFile.run(SegmentInfos.java:591)
	at org.apache.lucene.index.SegmentInfos$FindSegmentsFile.run(SegmentInfos.java:524)
	at org.apache.lucene.index.SegmentInfos.read(SegmentInfos.java:307)
	at org.apache.lucene.index.IndexWriter.<init>(IndexWriter.java:1093)
	at org.apache.lucene.index.IndexWriter.<init>(IndexWriter.java:914)
	at org.apache.lucene.index.TestIndexWriter.testPrepareCommitRollback(TestIndexWriter.java:3593)
	at org.apache.lucene.util.LuceneTestCase.runBare(LuceneTestCase.java:253)


REGRESSION:  org.apache.lucene.index.TestIndexWriter.testPrepareCommitNoChanges

Error Message:
fileMap

Stack Trace:
java.lang.NoSuchFieldError: fileMap
	at org.apache.lucene.store.MockRAMDirectory.openInput(MockRAMDirectory.java:234)
	at org.apache.lucene.index.SegmentInfos$FindSegmentsFile.run(SegmentInfos.java:591)
	at org.apache.lucene.index.SegmentInfos$FindSegmentsFile.run(SegmentInfos.java:524)
	at org.apache.lucene.index.SegmentInfos.read(SegmentInfos.java:307)
	at org.apache.lucene.index.IndexWriter.<init>(IndexWriter.java:1093)
	at org.apache.lucene.index.IndexWriter.<init>(IndexWriter.java:914)
	at org.apache.lucene.index.TestIndexWriter.testPrepareCommitNoChanges(TestIndexWriter.java:3647)
	at org.apache.lucene.util.LuceneTestCase.runBare(LuceneTestCase.java:253)


FAILED:  org.apache.lucene.index.TestIndexWriter.testAddIndexesWithThreads

Error Message:
fileMap

Stack Trace:
java.lang.NoSuchFieldError: fileMap
	at org.apache.lucene.store.MockRAMDirectory.openInput(MockRAMDirectory.java:234)
	at org.apache.lucene.index.SegmentInfos$FindSegmentsFile.run(SegmentInfos.java:591)
	at org.apache.lucene.index.SegmentInfos$FindSegmentsFile.run(SegmentInfos.java:524)
	at org.apache.lucene.index.SegmentInfos.read(SegmentInfos.java:307)
	at org.apache.lucene.index.IndexWriter.<init>(IndexWriter.java:1093)
	at org.apache.lucene.index.IndexWriter.<init>(IndexWriter.java:914)
	at org.apache.lucene.index.TestIndexWriter$RunAddIndexesThreads.<init>(TestIndexWriter.java:3674)
	at org.apache.lucene.index.TestIndexWriter$CommitAndAddIndexes.<init>(TestIndexWriter.java:3743)
	at org.apache.lucene.index.TestIndexWriter.testAddIndexesWithThreads(TestIndexWriter.java:3779)
	at org.apache.lucene.util.LuceneTestCase.runBare(LuceneTestCase.java:253)


FAILED:  org.apache.lucene.index.TestIndexWriter.testAddIndexesWithClose

Error Message:
fileMap

Stack Trace:
java.lang.NoSuchFieldError: fileMap
	at org.apache.lucene.store.MockRAMDirectory.openInput(MockRAMDirectory.java:234)
	at org.apache.lucene.index.SegmentInfos$FindSegmentsFile.run(SegmentInfos.java:591)
	at org.apache.lucene.index.SegmentInfos$FindSegmentsFile.run(SegmentInfos.java:524)
	at org.apache.lucene.index.SegmentInfos.read(SegmentInfos.java:307)
	at org.apache.lucene.index.IndexWriter.<init>(IndexWriter.java:1093)
	at org.apache.lucene.index.IndexWriter.<init>(IndexWriter.java:914)
	at org.apache.lucene.index.TestIndexWriter$RunAddIndexesThreads.<init>(TestIndexWriter.java:3674)
	at org.apache.lucene.index.TestIndexWriter$CommitAndAddIndexes.<init>(TestIndexWriter.java:3743)
	at org.apache.lucene.index.TestIndexWriter$CommitAndAddIndexes2.<init>(TestIndexWriter.java:3804)
	at org.apache.lucene.index.TestIndexWriter.testAddIndexesWithClose(TestIndexWriter.java:3821)
	at org.apache.lucene.util.LuceneTestCase.runBare(LuceneTestCase.java:253)


FAILED:  org.apache.lucene.index.TestIndexWriter.testAddIndexesWithCloseNoWait

Error Message:
fileMap

Stack Trace:
java.lang.NoSuchFieldError: fileMap
	at org.apache.lucene.store.MockRAMDirectory.openInput(MockRAMDirectory.java:234)
	at org.apache.lucene.index.SegmentInfos$FindSegmentsFile.run(SegmentInfos.java:591)
	at org.apache.lucene.index.SegmentInfos$FindSegmentsFile.run(SegmentInfos.java:524)
	at org.apache.lucene.index.SegmentInfos.read(SegmentInfos.java:307)
	at org.apache.lucene.index.IndexWriter.<init>(IndexWriter.java:1093)
	at org.apache.lucene.index.IndexWriter.<init>(IndexWriter.java:914)
	at org.apache.lucene.index.TestIndexWriter$RunAddIndexesThreads.<init>(TestIndexWriter.java:3674)
	at org.apache.lucene.index.TestIndexWriter$CommitAndAddIndexes3.<init>(TestIndexWriter.java:3840)
	at org.apache.lucene.index.TestIndexWriter.testAddIndexesWithCloseNoWait(TestIndexWriter.java:3888)
	at org.apache.lucene.util.LuceneTestCase.runBare(LuceneTestCase.java:253)


FAILED:  org.apache.lucene.index.TestIndexWriter.testAddIndexesWithRollback

Error Message:
fileMap

Stack Trace:
java.lang.NoSuchFieldError: fileMap
	at org.apache.lucene.store.MockRAMDirectory.openInput(MockRAMDirectory.java:234)
	at org.apache.lucene.index.SegmentInfos$FindSegmentsFile.run(SegmentInfos.java:591)
	at org.apache.lucene.index.SegmentInfos$FindSegmentsFile.run(SegmentInfos.java:524)
	at org.apache.lucene.index.SegmentInfos.read(SegmentInfos.java:307)
	at org.apache.lucene.index.IndexWriter.<init>(IndexWriter.java:1093)
	at org.apache.lucene.index.IndexWriter.<init>(IndexWriter.java:914)
	at org.apache.lucene.index.TestIndexWriter$RunAddIndexesThreads.<init>(TestIndexWriter.java:3674)
	at org.apache.lucene.index.TestIndexWriter$CommitAndAddIndexes3.<init>(TestIndexWriter.java:3840)
	at org.apache.lucene.index.TestIndexWriter.testAddIndexesWithRollback(TestIndexWriter.java:3909)
	at org.apache.lucene.util.LuceneTestCase.runBare(LuceneTestCase.java:253)


FAILED:  org.apache.lucene.index.TestIndexWriter.testRollbackExceptionHang

Error Message:
fileMap

Stack Trace:
java.lang.NoSuchFieldError: fileMap
	at org.apache.lucene.store.MockRAMDirectory.openInput(MockRAMDirectory.java:234)
	at org.apache.lucene.index.SegmentInfos$FindSegmentsFile.run(SegmentInfos.java:591)
	at org.apache.lucene.index.SegmentInfos$FindSegmentsFile.run(SegmentInfos.java:524)
	at org.apache.lucene.index.SegmentInfos.read(SegmentInfos.java:307)
	at org.apache.lucene.index.IndexWriter.<init>(IndexWriter.java:1093)
	at org.apache.lucene.index.IndexWriter.<init>(IndexWriter.java:887)
	at org.apache.lucene.index.TestIndexWriter$MockIndexWriter4.<init>(TestIndexWriter.java:3931)
	at org.apache.lucene.index.TestIndexWriter.testRollbackExceptionHang(TestIndexWriter.java:3947)
	at org.apache.lucene.util.LuceneTestCase.runBare(LuceneTestCase.java:253)


REGRESSION:  org.apache.lucene.index.TestIndexWriter.testBinaryFieldOffsetLength

Error Message:
fileMap

Stack Trace:
java.lang.NoSuchFieldError: fileMap
	at org.apache.lucene.store.MockRAMDirectory.openInput(MockRAMDirectory.java:234)
	at org.apache.lucene.index.SegmentInfos$FindSegmentsFile.run(SegmentInfos.java:591)
	at org.apache.lucene.index.SegmentInfos$FindSegmentsFile.run(SegmentInfos.java:524)
	at org.apache.lucene.index.SegmentInfos.read(SegmentInfos.java:307)
	at org.apache.lucene.index.IndexWriter.<init>(IndexWriter.java:1093)
	at org.apache.lucene.index.IndexWriter.<init>(IndexWriter.java:887)
	at org.apache.lucene.index.TestIndexWriter.testBinaryFieldOffsetLength(TestIndexWriter.java:3966)
	at org.apache.lucene.util.LuceneTestCase.runBare(LuceneTestCase.java:253)


REGRESSION:  org.apache.lucene.index.TestIndexWriter.testCommitUserData

Error Message:
fileMap

Stack Trace:
java.lang.NoSuchFieldError: fileMap
	at org.apache.lucene.store.MockRAMDirectory.openInput(MockRAMDirectory.java:234)
	at org.apache.lucene.index.SegmentInfos$FindSegmentsFile.run(SegmentInfos.java:591)
	at org.apache.lucene.index.SegmentInfos$FindSegmentsFile.run(SegmentInfos.java:524)
	at org.apache.lucene.index.SegmentInfos.read(SegmentInfos.java:307)
	at org.apache.lucene.index.IndexWriter.<init>(IndexWriter.java:1093)
	at org.apache.lucene.index.IndexWriter.<init>(IndexWriter.java:914)
	at org.apache.lucene.index.TestIndexWriter.testCommitUserData(TestIndexWriter.java:3996)
	at org.apache.lucene.util.LuceneTestCase.runBare(LuceneTestCase.java:253)


FAILED:  org.apache.lucene.index.TestIndexWriter.testOptimizeExceptions

Error Message:
fileMap

Stack Trace:
java.lang.NoSuchFieldError: fileMap
	at org.apache.lucene.store.MockRAMDirectory.openInput(MockRAMDirectory.java:234)
	at org.apache.lucene.index.SegmentInfos$FindSegmentsFile.run(SegmentInfos.java:591)
	at org.apache.lucene.index.SegmentInfos$FindSegmentsFile.run(SegmentInfos.java:524)
	at org.apache.lucene.index.SegmentInfos.read(SegmentInfos.java:307)
	at org.apache.lucene.index.IndexWriter.<init>(IndexWriter.java:1093)
	at org.apache.lucene.index.IndexWriter.<init>(IndexWriter.java:914)
	at org.apache.lucene.index.TestIndexWriter.testOptimizeExceptions(TestIndexWriter.java:4035)
	at org.apache.lucene.util.LuceneTestCase.runBare(LuceneTestCase.java:253)


FAILED:  org.apache.lucene.index.TestIndexWriter.testOutOfMemoryErrorCausesCloseToFail

Error Message:
fileMap

Stack Trace:
java.lang.NoSuchFieldError: fileMap
	at org.apache.lucene.store.MockRAMDirectory.openInput(MockRAMDirectory.java:234)
	at org.apache.lucene.index.SegmentInfos$FindSegmentsFile.run(SegmentInfos.java:591)
	at org.apache.lucene.index.SegmentInfos$FindSegmentsFile.run(SegmentInfos.java:524)
	at org.apache.lucene.index.SegmentInfos.read(SegmentInfos.java:307)
	at org.apache.lucene.index.IndexWriter.<init>(IndexWriter.java:1093)
	at org.apache.lucene.index.IndexWriter.<init>(IndexWriter.java:914)
	at org.apache.lucene.index.TestIndexWriter$8.<init>(TestIndexWriter.java:4063)
	at org.apache.lucene.index.TestIndexWriter.testOutOfMemoryErrorCausesCloseToFail(TestIndexWriter.java:4063)
	at org.apache.lucene.util.LuceneTestCase.runBare(LuceneTestCase.java:253)


FAILED:  org.apache.lucene.index.TestIndexWriter.testDoubleOffsetCounting

Error Message:
fileMap

Stack Trace:
java.lang.NoSuchFieldError: fileMap
	at org.apache.lucene.store.MockRAMDirectory.openInput(MockRAMDirectory.java:234)
	at org.apache.lucene.index.SegmentInfos$FindSegmentsFile.run(SegmentInfos.java:591)
	at org.apache.lucene.index.SegmentInfos$FindSegmentsFile.run(SegmentInfos.java:524)
	at org.apache.lucene.index.SegmentInfos.read(SegmentInfos.java:307)
	at org.apache.lucene.index.IndexWriter.<init>(IndexWriter.java:1093)
	at org.apache.lucene.index.IndexWriter.<init>(IndexWriter.java:914)
	at org.apache.lucene.index.TestIndexWriter.testDoubleOffsetCounting(TestIndexWriter.java:4088)
	at org.apache.lucene.util.LuceneTestCase.runBare(LuceneTestCase.java:253)


FAILED:  org.apache.lucene.index.TestIndexWriter.testDoubleOffsetCounting2

Error Message:
fileMap

Stack Trace:
java.lang.NoSuchFieldError: fileMap
	at org.apache.lucene.store.MockRAMDirectory.openInput(MockRAMDirectory.java:234)
	at org.apache.lucene.index.SegmentInfos$FindSegmentsFile.run(SegmentInfos.java:591)
	at org.apache.lucene.index.SegmentInfos$FindSegmentsFile.run(SegmentInfos.java:524)
	at org.apache.lucene.index.SegmentInfos.read(SegmentInfos.java:307)
	at org.apache.lucene.index.IndexWriter.<init>(IndexWriter.java:1093)
	at org.apache.lucene.index.IndexWriter.<init>(IndexWriter.java:914)
	at org.apache.lucene.index.TestIndexWriter.testDoubleOffsetCounting2(TestIndexWriter.java:4123)
	at org.apache.lucene.util.LuceneTestCase.runBare(LuceneTestCase.java:253)


FAILED:  org.apache.lucene.index.TestIndexWriter.testEndOffsetPositionCharAnalyzer

Error Message:
fileMap

Stack Trace:
java.lang.NoSuchFieldError: fileMap
	at org.apache.lucene.store.MockRAMDirectory.openInput(MockRAMDirectory.java:234)
	at org.apache.lucene.index.SegmentInfos$FindSegmentsFile.run(SegmentInfos.java:591)
	at org.apache.lucene.index.SegmentInfos$FindSegmentsFile.run(SegmentInfos.java:524)
	at org.apache.lucene.index.SegmentInfos.read(SegmentInfos.java:307)
	at org.apache.lucene.index.IndexWriter.<init>(IndexWriter.java:1093)
	at org.apache.lucene.index.IndexWriter.<init>(IndexWriter.java:914)
	at org.apache.lucene.index.TestIndexWriter.testEndOffsetPositionCharAnalyzer(TestIndexWriter.java:4145)
	at org.apache.lucene.util.LuceneTestCase.runBare(LuceneTestCase.java:253)


FAILED:  org.apache.lucene.index.TestIndexWriter.testEndOffsetPositionWithCachingTokenFilter

Error Message:
fileMap

Stack Trace:
java.lang.NoSuchFieldError: fileMap
	at org.apache.lucene.store.MockRAMDirectory.openInput(MockRAMDirectory.java:234)
	at org.apache.lucene.index.SegmentInfos$FindSegmentsFile.run(SegmentInfos.java:591)
	at org.apache.lucene.index.SegmentInfos$FindSegmentsFile.run(SegmentInfos.java:524)
	at org.apache.lucene.index.SegmentInfos.read(SegmentInfos.java:307)
	at org.apache.lucene.index.IndexWriter.<init>(IndexWriter.java:1093)
	at org.apache.lucene.index.IndexWriter.<init>(IndexWriter.java:914)
	at org.apache.lucene.index.TestIndexWriter.testEndOffsetPositionWithCachingTokenFilter(TestIndexWriter.java:4168)
	at org.apache.lucene.util.LuceneTestCase.runBare(LuceneTestCase.java:253)


FAILED:  org.apache.lucene.index.TestIndexWriter.testEndOffsetPositionWithTeeSinkTokenFilter

Error Message:
fileMap

Stack Trace:
java.lang.NoSuchFieldError: fileMap
	at org.apache.lucene.store.MockRAMDirectory.openInput(MockRAMDirectory.java:234)
	at org.apache.lucene.index.SegmentInfos$FindSegmentsFile.run(SegmentInfos.java:591)
	at org.apache.lucene.index.SegmentInfos$FindSegmentsFile.run(SegmentInfos.java:524)
	at org.apache.lucene.index.SegmentInfos.read(SegmentInfos.java:307)
	at org.apache.lucene.index.IndexWriter.<init>(IndexWriter.java:1093)
	at org.apache.lucene.index.IndexWriter.<init>(IndexWriter.java:914)
	at org.apache.lucene.index.TestIndexWriter.testEndOffsetPositionWithTeeSinkTokenFilter(TestIndexWriter.java:4192)
	at org.apache.lucene.util.LuceneTestCase.runBare(LuceneTestCase.java:253)


FAILED:  org.apache.lucene.index.TestIndexWriter.testEndOffsetPositionStopFilter

Error Message:
fileMap

Stack Trace:
java.lang.NoSuchFieldError: fileMap
	at org.apache.lucene.store.MockRAMDirectory.openInput(MockRAMDirectory.java:234)
	at org.apache.lucene.index.SegmentInfos$FindSegmentsFile.run(SegmentInfos.java:591)
	at org.apache.lucene.index.SegmentInfos$FindSegmentsFile.run(SegmentInfos.java:524)
	at org.apache.lucene.index.SegmentInfos.read(SegmentInfos.java:307)
	at org.apache.lucene.index.IndexWriter.<init>(IndexWriter.java:1093)
	at org.apache.lucene.index.IndexWriter.<init>(IndexWriter.java:914)
	at org.apache.lucene.index.TestIndexWriter.testEndOffsetPositionStopFilter(TestIndexWriter.java:4217)
	at org.apache.lucene.util.LuceneTestCase.runBare(LuceneTestCase.java:253)


FAILED:  org.apache.lucene.index.TestIndexWriter.testEndOffsetPositionStandard

Error Message:
fileMap

Stack Trace:
java.lang.NoSuchFieldError: fileMap
	at org.apache.lucene.store.MockRAMDirectory.openInput(MockRAMDirectory.java:234)
	at org.apache.lucene.index.SegmentInfos$FindSegmentsFile.run(SegmentInfos.java:591)
	at org.apache.lucene.index.SegmentInfos$FindSegmentsFile.run(SegmentInfos.java:524)
	at org.apache.lucene.index.SegmentInfos.read(SegmentInfos.java:307)
	at org.apache.lucene.index.IndexWriter.<init>(IndexWriter.java:1093)
	at org.apache.lucene.index.IndexWriter.<init>(IndexWriter.java:914)
	at org.apache.lucene.index.TestIndexWriter.testEndOffsetPositionStandard(TestIndexWriter.java:4239)
	at org.apache.lucene.util.LuceneTestCase.runBare(LuceneTestCase.java:253)


FAILED:  org.apache.lucene.index.TestIndexWriter.testEndOffsetPositionStandardEmptyField

Error Message:
fileMap

Stack Trace:
java.lang.NoSuchFieldError: fileMap
	at org.apache.lucene.store.MockRAMDirectory.openInput(MockRAMDirectory.java:234)
	at org.apache.lucene.index.SegmentInfos$FindSegmentsFile.run(SegmentInfos.java:591)
	at org.apache.lucene.index.SegmentInfos$FindSegmentsFile.run(SegmentInfos.java:524)
	at org.apache.lucene.index.SegmentInfos.read(SegmentInfos.java:307)
	at org.apache.lucene.index.IndexWriter.<init>(IndexWriter.java:1093)
	at org.apache.lucene.index.IndexWriter.<init>(IndexWriter.java:914)
	at org.apache.lucene.index.TestIndexWriter.testEndOffsetPositionStandardEmptyField(TestIndexWriter.java:4269)
	at org.apache.lucene.util.LuceneTestCase.runBare(LuceneTestCase.java:253)


FAILED:  org.apache.lucene.index.TestIndexWriter.testEndOffsetPositionStandardEmptyField2

Error Message:
fileMap

Stack Trace:
java.lang.NoSuchFieldError: fileMap
	at org.apache.lucene.store.MockRAMDirectory.openInput(MockRAMDirectory.java:234)
	at org.apache.lucene.index.SegmentInfos$FindSegmentsFile.run(SegmentInfos.java:591)
	at org.apache.lucene.index.SegmentInfos$FindSegmentsFile.run(SegmentInfos.java:524)
	at org.apache.lucene.index.SegmentInfos.read(SegmentInfos.java:307)
	at org.apache.lucene.index.IndexWriter.<init>(IndexWriter.java:1093)
	at org.apache.lucene.index.IndexWriter.<init>(IndexWriter.java:914)
	at org.apache.lucene.index.TestIndexWriter.testEndOffsetPositionStandardEmptyField2(TestIndexWriter.java:4296)
	at org.apache.lucene.util.LuceneTestCase.runBare(LuceneTestCase.java:253)


REGRESSION:  org.apache.lucene.index.TestIndexWriter.testDeadlock

Error Message:
fileMap

Stack Trace:
java.lang.NoSuchFieldError: fileMap
	at org.apache.lucene.store.MockRAMDirectory.openInput(MockRAMDirectory.java:234)
	at org.apache.lucene.index.SegmentInfos$FindSegmentsFile.run(SegmentInfos.java:591)
	at org.apache.lucene.index.SegmentInfos$FindSegmentsFile.run(SegmentInfos.java:524)
	at org.apache.lucene.index.SegmentInfos.read(SegmentInfos.java:307)
	at org.apache.lucene.index.IndexWriter.<init>(IndexWriter.java:1093)
	at org.apache.lucene.index.IndexWriter.<init>(IndexWriter.java:914)
	at org.apache.lucene.index.TestIndexWriter.testDeadlock(TestIndexWriter.java:4354)
	at org.apache.lucene.util.LuceneTestCase.runBare(LuceneTestCase.java:253)


REGRESSION:  org.apache.lucene.index.TestIndexWriter.testIndexStoreCombos

Error Message:
fileMap

Stack Trace:
java.lang.NoSuchFieldError: fileMap
	at org.apache.lucene.store.MockRAMDirectory.openInput(MockRAMDirectory.java:234)
	at org.apache.lucene.index.SegmentInfos$FindSegmentsFile.run(SegmentInfos.java:591)
	at org.apache.lucene.index.SegmentInfos$FindSegmentsFile.run(SegmentInfos.java:524)
	at org.apache.lucene.index.SegmentInfos.read(SegmentInfos.java:307)
	at org.apache.lucene.index.IndexWriter.<init>(IndexWriter.java:1093)
	at org.apache.lucene.index.IndexWriter.<init>(IndexWriter.java:887)
	at org.apache.lucene.index.TestIndexWriter.testIndexStoreCombos(TestIndexWriter.java:4513)
	at org.apache.lucene.util.LuceneTestCase.runBare(LuceneTestCase.java:253)


REGRESSION:  org.apache.lucene.index.TestIndexWriter.testStoredFieldsOrder

Error Message:
fileMap

Stack Trace:
java.lang.NoSuchFieldError: fileMap
	at org.apache.lucene.store.MockRAMDirectory.openInput(MockRAMDirectory.java:234)
	at org.apache.lucene.index.SegmentInfos$FindSegmentsFile.run(SegmentInfos.java:591)
	at org.apache.lucene.index.SegmentInfos$FindSegmentsFile.run(SegmentInfos.java:524)
	at org.apache.lucene.index.SegmentInfos.read(SegmentInfos.java:307)
	at org.apache.lucene.index.IndexWriter.<init>(IndexWriter.java:1093)
	at org.apache.lucene.index.IndexWriter.<init>(IndexWriter.java:914)
	at org.apache.lucene.index.TestIndexWriter.testStoredFieldsOrder(TestIndexWriter.java:4575)
	at org.apache.lucene.util.LuceneTestCase.runBare(LuceneTestCase.java:253)


REGRESSION:  org.apache.lucene.index.TestIndexWriter.testEmbeddedFFFF

Error Message:
fileMap

Stack Trace:
java.lang.NoSuchFieldError: fileMap
	at org.apache.lucene.store.MockRAMDirectory.openInput(MockRAMDirectory.java:234)
	at org.apache.lucene.index.SegmentInfos$FindSegmentsFile.run(SegmentInfos.java:591)
	at org.apache.lucene.index.SegmentInfos$FindSegmentsFile.run(SegmentInfos.java:524)
	at org.apache.lucene.index.SegmentInfos.read(SegmentInfos.java:307)
	at org.apache.lucene.index.IndexWriter.<init>(IndexWriter.java:1093)
	at org.apache.lucene.index.IndexWriter.<init>(IndexWriter.java:914)
	at org.apache.lucene.index.TestIndexWriter.testEmbeddedFFFF(TestIndexWriter.java:4607)
	at org.apache.lucene.util.LuceneTestCase.runBare(LuceneTestCase.java:253)


REGRESSION:  org.apache.lucene.index.TestIndexWriter.testNoDocsIndex

Error Message:
fileMap

Stack Trace:
java.lang.NoSuchFieldError: fileMap
	at org.apache.lucene.store.MockRAMDirectory.openInput(MockRAMDirectory.java:234)
	at org.apache.lucene.index.SegmentInfos$FindSegmentsFile.run(SegmentInfos.java:591)
	at org.apache.lucene.index.SegmentInfos$FindSegmentsFile.run(SegmentInfos.java:524)
	at org.apache.lucene.index.SegmentInfos.read(SegmentInfos.java:307)
	at org.apache.lucene.index.IndexWriter.<init>(IndexWriter.java:1093)
	at org.apache.lucene.index.IndexWriter.<init>(IndexWriter.java:914)
	at org.apache.lucene.index.TestIndexWriter.testNoDocsIndex(TestIndexWriter.java:4622)
	at org.apache.lucene.util.LuceneTestCase.runBare(LuceneTestCase.java:253)


REGRESSION:  org.apache.lucene.index.TestIndexWriterDelete.testSimpleCase

Error Message:
fileMap

Stack Trace:
java.lang.NoSuchFieldError: fileMap
	at org.apache.lucene.store.MockRAMDirectory.openInput(MockRAMDirectory.java:234)
	at org.apache.lucene.index.SegmentInfos$FindSegmentsFile.run(SegmentInfos.java:591)
	at org.apache.lucene.index.SegmentInfos$FindSegmentsFile.run(SegmentInfos.java:524)
	at org.apache.lucene.index.SegmentInfos.read(SegmentInfos.java:307)
	at org.apache.lucene.index.IndexWriter.<init>(IndexWriter.java:1093)
	at org.apache.lucene.index.IndexWriter.<init>(IndexWriter.java:887)
	at org.apache.lucene.index.TestIndexWriterDelete.testSimpleCase(TestIndexWriterDelete.java:45)
	at org.apache.lucene.util.LuceneTestCase.runBare(LuceneTestCase.java:253)


REGRESSION:  org.apache.lucene.index.TestIndexWriterDelete.testNonRAMDelete

Error Message:
fileMap

Stack Trace:
java.lang.NoSuchFieldError: fileMap
	at org.apache.lucene.store.MockRAMDirectory.openInput(MockRAMDirectory.java:234)
	at org.apache.lucene.index.SegmentInfos$FindSegmentsFile.run(SegmentInfos.java:591)
	at org.apache.lucene.index.SegmentInfos$FindSegmentsFile.run(SegmentInfos.java:524)
	at org.apache.lucene.index.SegmentInfos.read(SegmentInfos.java:307)
	at org.apache.lucene.index.IndexWriter.<init>(IndexWriter.java:1093)
	at org.apache.lucene.index.IndexWriter.<init>(IndexWriter.java:887)
	at org.apache.lucene.index.TestIndexWriterDelete.testNonRAMDelete(TestIndexWriterDelete.java:82)
	at org.apache.lucene.util.LuceneTestCase.runBare(LuceneTestCase.java:253)


REGRESSION:  org.apache.lucene.index.TestIndexWriterDelete.testMaxBufferedDeletes

Error Message:
fileMap

Stack Trace:
java.lang.NoSuchFieldError: fileMap
	at org.apache.lucene.store.MockRAMDirectory.openInput(MockRAMDirectory.java:234)
	at org.apache.lucene.index.SegmentInfos$FindSegmentsFile.run(SegmentInfos.java:591)
	at org.apache.lucene.index.SegmentInfos$FindSegmentsFile.run(SegmentInfos.java:524)
	at org.apache.lucene.index.SegmentInfos.read(SegmentInfos.java:307)
	at org.apache.lucene.index.IndexWriter.<init>(IndexWriter.java:1093)
	at org.apache.lucene.index.IndexWriter.<init>(IndexWriter.java:887)
	at org.apache.lucene.index.TestIndexWriterDelete.testMaxBufferedDeletes(TestIndexWriterDelete.java:117)
	at org.apache.lucene.util.LuceneTestCase.runBare(LuceneTestCase.java:253)


REGRESSION:  org.apache.lucene.index.TestIndexWriterDelete.testRAMDeletes

Error Message:
fileMap

Stack Trace:
java.lang.NoSuchFieldError: fileMap
	at org.apache.lucene.store.MockRAMDirectory.openInput(MockRAMDirectory.java:234)
	at org.apache.lucene.index.SegmentInfos$FindSegmentsFile.run(SegmentInfos.java:591)
	at org.apache.lucene.index.SegmentInfos$FindSegmentsFile.run(SegmentInfos.java:524)
	at org.apache.lucene.index.SegmentInfos.read(SegmentInfos.java:307)
	at org.apache.lucene.index.IndexWriter.<init>(IndexWriter.java:1093)
	at org.apache.lucene.index.IndexWriter.<init>(IndexWriter.java:887)
	at org.apache.lucene.index.TestIndexWriterDelete.testRAMDeletes(TestIndexWriterDelete.java:132)
	at org.apache.lucene.util.LuceneTestCase.runBare(LuceneTestCase.java:253)


REGRESSION:  org.apache.lucene.index.TestIndexWriterDelete.testBothDeletes

Error Message:
fileMap

Stack Trace:
java.lang.NoSuchFieldError: fileMap
	at org.apache.lucene.store.MockRAMDirectory.openInput(MockRAMDirectory.java:234)
	at org.apache.lucene.index.SegmentInfos$FindSegmentsFile.run(SegmentInfos.java:591)
	at org.apache.lucene.index.SegmentInfos$FindSegmentsFile.run(SegmentInfos.java:524)
	at org.apache.lucene.index.SegmentInfos.read(SegmentInfos.java:307)
	at org.apache.lucene.index.IndexWriter.<init>(IndexWriter.java:1093)
	at org.apache.lucene.index.IndexWriter.<init>(IndexWriter.java:887)
	at org.apache.lucene.index.TestIndexWriterDelete.testBothDeletes(TestIndexWriterDelete.java:174)
	at org.apache.lucene.util.LuceneTestCase.runBare(LuceneTestCase.java:253)


REGRESSION:  org.apache.lucene.index.TestIndexWriterDelete.testBatchDeletes

Error Message:
fileMap

Stack Trace:
java.lang.NoSuchFieldError: fileMap
	at org.apache.lucene.store.MockRAMDirectory.openInput(MockRAMDirectory.java:234)
	at org.apache.lucene.index.SegmentInfos$FindSegmentsFile.run(SegmentInfos.java:591)
	at org.apache.lucene.index.SegmentInfos$FindSegmentsFile.run(SegmentInfos.java:524)
	at org.apache.lucene.index.SegmentInfos.read(SegmentInfos.java:307)
	at org.apache.lucene.index.IndexWriter.<init>(IndexWriter.java:1093)
	at org.apache.lucene.index.IndexWriter.<init>(IndexWriter.java:887)
	at org.apache.lucene.index.TestIndexWriterDelete.testBatchDeletes(TestIndexWriterDelete.java:207)
	at org.apache.lucene.util.LuceneTestCase.runBare(LuceneTestCase.java:253)


REGRESSION:  org.apache.lucene.index.TestIndexWriterDelete.testDeleteAll

Error Message:
fileMap

Stack Trace:
java.lang.NoSuchFieldError: fileMap
	at org.apache.lucene.store.MockRAMDirectory.openInput(MockRAMDirectory.java:234)
	at org.apache.lucene.index.SegmentInfos$FindSegmentsFile.run(SegmentInfos.java:591)
	at org.apache.lucene.index.SegmentInfos$FindSegmentsFile.run(SegmentInfos.java:524)
	at org.apache.lucene.index.SegmentInfos.read(SegmentInfos.java:307)
	at org.apache.lucene.index.IndexWriter.<init>(IndexWriter.java:1093)
	at org.apache.lucene.index.IndexWriter.<init>(IndexWriter.java:887)
	at org.apache.lucene.index.TestIndexWriterDelete.testDeleteAll(TestIndexWriterDelete.java:251)
	at org.apache.lucene.util.LuceneTestCase.runBare(LuceneTestCase.java:253)


REGRESSION:  org.apache.lucene.index.TestIndexWriterDelete.testDeleteAllRollback

Error Message:
fileMap

Stack Trace:
java.lang.NoSuchFieldError: fileMap
	at org.apache.lucene.store.MockRAMDirectory.openInput(MockRAMDirectory.java:234)
	at org.apache.lucene.index.SegmentInfos$FindSegmentsFile.run(SegmentInfos.java:591)
	at org.apache.lucene.index.SegmentInfos$FindSegmentsFile.run(SegmentInfos.java:524)
	at org.apache.lucene.index.SegmentInfos.read(SegmentInfos.java:307)
	at org.apache.lucene.index.IndexWriter.<init>(IndexWriter.java:1093)
	at org.apache.lucene.index.IndexWriter.<init>(IndexWriter.java:887)
	at org.apache.lucene.index.TestIndexWriterDelete.testDeleteAllRollback(TestIndexWriterDelete.java:298)
	at org.apache.lucene.util.LuceneTestCase.runBare(LuceneTestCase.java:253)


REGRESSION:  org.apache.lucene.index.TestIndexWriterDelete.testDeleteAllNRT

Error Message:
fileMap

Stack Trace:
java.lang.NoSuchFieldError: fileMap
	at org.apache.lucene.store.MockRAMDirectory.openInput(MockRAMDirectory.java:234)
	at org.apache.lucene.index.SegmentInfos$FindSegmentsFile.run(SegmentInfos.java:591)
	at org.apache.lucene.index.SegmentInfos$FindSegmentsFile.run(SegmentInfos.java:524)
	at org.apache.lucene.index.SegmentInfos.read(SegmentInfos.java:307)
	at org.apache.lucene.index.IndexWriter.<init>(IndexWriter.java:1093)
	at org.apache.lucene.index.IndexWriter.<init>(IndexWriter.java:887)
	at org.apache.lucene.index.TestIndexWriterDelete.testDeleteAllNRT(TestIndexWriterDelete.java:336)
	at org.apache.lucene.util.LuceneTestCase.runBare(LuceneTestCase.java:253)


REGRESSION:  org.apache.lucene.index.TestIndexWriterDelete.testDeletesOnDiskFull

Error Message:
fileMap

Stack Trace:
java.lang.NoSuchFieldError: fileMap
	at org.apache.lucene.store.MockRAMDirectory.openInput(MockRAMDirectory.java:234)
	at org.apache.lucene.index.SegmentInfos$FindSegmentsFile.run(SegmentInfos.java:591)
	at org.apache.lucene.index.SegmentInfos$FindSegmentsFile.run(SegmentInfos.java:524)
	at org.apache.lucene.index.SegmentInfos.read(SegmentInfos.java:307)
	at org.apache.lucene.index.IndexWriter.<init>(IndexWriter.java:1093)
	at org.apache.lucene.index.IndexWriter.<init>(IndexWriter.java:887)
	at org.apache.lucene.index.TestIndexWriterDelete.testOperationsOnDiskFull(TestIndexWriterDelete.java:428)
	at org.apache.lucene.index.TestIndexWriterDelete.testDeletesOnDiskFull(TestIndexWriterDelete.java:408)
	at org.apache.lucene.util.LuceneTestCase.runBare(LuceneTestCase.java:253)


REGRESSION:  org.apache.lucene.index.TestIndexWriterDelete.testUpdatesOnDiskFull

Error Message:
fileMap

Stack Trace:
java.lang.NoSuchFieldError: fileMap
	at org.apache.lucene.store.MockRAMDirectory.openInput(MockRAMDirectory.java:234)
	at org.apache.lucene.index.SegmentInfos$FindSegmentsFile.run(SegmentInfos.java:591)
	at org.apache.lucene.index.SegmentInfos$FindSegmentsFile.run(SegmentInfos.java:524)
	at org.apache.lucene.index.SegmentInfos.read(SegmentInfos.java:307)
	at org.apache.lucene.index.IndexWriter.<init>(IndexWriter.java:1093)
	at org.apache.lucene.index.IndexWriter.<init>(IndexWriter.java:887)
	at org.apache.lucene.index.TestIndexWriterDelete.testOperationsOnDiskFull(TestIndexWriterDelete.java:428)
	at org.apache.lucene.index.TestIndexWriterDelete.testUpdatesOnDiskFull(TestIndexWriterDelete.java:412)
	at org.apache.lucene.util.LuceneTestCase.runBare(LuceneTestCase.java:253)


REGRESSION:  org.apache.lucene.index.TestIndexWriterDelete.testErrorAfterApplyDeletes

Error Message:
fileMap

Stack Trace:
java.lang.NoSuchFieldError: fileMap
	at org.apache.lucene.store.MockRAMDirectory.openInput(MockRAMDirectory.java:234)
	at org.apache.lucene.index.SegmentInfos$FindSegmentsFile.run(SegmentInfos.java:591)
	at org.apache.lucene.index.SegmentInfos$FindSegmentsFile.run(SegmentInfos.java:524)
	at org.apache.lucene.index.SegmentInfos.read(SegmentInfos.java:307)
	at org.apache.lucene.index.IndexWriter.<init>(IndexWriter.java:1093)
	at org.apache.lucene.index.IndexWriter.<init>(IndexWriter.java:887)
	at org.apache.lucene.index.TestIndexWriterDelete.testErrorAfterApplyDeletes(TestIndexWriterDelete.java:657)
	at org.apache.lucene.util.LuceneTestCase.runBare(LuceneTestCase.java:253)


REGRESSION:  org.apache.lucene.index.TestIndexWriterDelete.testErrorInDocsWriterAdd

Error Message:
fileMap

Stack Trace:
java.lang.NoSuchFieldError: fileMap
	at org.apache.lucene.store.MockRAMDirectory.openInput(MockRAMDirectory.java:234)
	at org.apache.lucene.index.SegmentInfos$FindSegmentsFile.run(SegmentInfos.java:591)
	at org.apache.lucene.index.SegmentInfos$FindSegmentsFile.run(SegmentInfos.java:524)
	at org.apache.lucene.index.SegmentInfos.read(SegmentInfos.java:307)
	at org.apache.lucene.index.IndexWriter.<init>(IndexWriter.java:1093)
	at org.apache.lucene.index.IndexWriter.<init>(IndexWriter.java:887)
	at org.apache.lucene.index.TestIndexWriterDelete.testErrorInDocsWriterAdd(TestIndexWriterDelete.java:766)
	at org.apache.lucene.util.LuceneTestCase.runBare(LuceneTestCase.java:253)


REGRESSION:  org.apache.lucene.index.TestIndexWriterExceptions.testRandomExceptions

Error Message:
fileMap

Stack Trace:
java.lang.NoSuchFieldError: fileMap
	at org.apache.lucene.store.MockRAMDirectory.openInput(MockRAMDirectory.java:234)
	at org.apache.lucene.index.SegmentInfos$FindSegmentsFile.run(SegmentInfos.java:591)
	at org.apache.lucene.index.SegmentInfos$FindSegmentsFile.run(SegmentInfos.java:524)
	at org.apache.lucene.index.SegmentInfos.read(SegmentInfos.java:307)
	at org.apache.lucene.index.IndexWriter.<init>(IndexWriter.java:1093)
	at org.apache.lucene.index.IndexWriter.<init>(IndexWriter.java:887)
	at org.apache.lucene.index.TestIndexWriterExceptions$MockIndexWriter.<init>(TestIndexWriterExceptions.java:118)
	at org.apache.lucene.index.TestIndexWriterExceptions.testRandomExceptions(TestIndexWriterExceptions.java:137)
	at org.apache.lucene.util.LuceneTestCase.runBare(LuceneTestCase.java:253)


REGRESSION:  org.apache.lucene.index.TestIndexWriterExceptions.testRandomExceptionsThreads

Error Message:
fileMap

Stack Trace:
java.lang.NoSuchFieldError: fileMap
	at org.apache.lucene.store.MockRAMDirectory.openInput(MockRAMDirectory.java:234)
	at org.apache.lucene.index.SegmentInfos$FindSegmentsFile.run(SegmentInfos.java:591)
	at org.apache.lucene.index.SegmentInfos$FindSegmentsFile.run(SegmentInfos.java:524)
	at org.apache.lucene.index.SegmentInfos.read(SegmentInfos.java:307)
	at org.apache.lucene.index.IndexWriter.<init>(IndexWriter.java:1093)
	at org.apache.lucene.index.IndexWriter.<init>(IndexWriter.java:887)
	at org.apache.lucene.index.TestIndexWriterExceptions$MockIndexWriter.<init>(TestIndexWriterExceptions.java:118)
	at org.apache.lucene.index.TestIndexWriterExceptions.testRandomExceptionsThreads(TestIndexWriterExceptions.java:176)
	at org.apache.lucene.util.LuceneTestCase.runBare(LuceneTestCase.java:253)


REGRESSION:  org.apache.lucene.index.TestIndexWriterMerging.testLucene

Error Message:
fileMap

Stack Trace:
java.lang.NoSuchFieldError: fileMap
	at org.apache.lucene.store.MockRAMDirectory.openInput(MockRAMDirectory.java:234)
	at org.apache.lucene.index.SegmentInfos$FindSegmentsFile.run(SegmentInfos.java:591)
	at org.apache.lucene.index.SegmentInfos$FindSegmentsFile.run(SegmentInfos.java:524)
	at org.apache.lucene.index.SegmentInfos.read(SegmentInfos.java:307)
	at org.apache.lucene.index.IndexWriter.<init>(IndexWriter.java:1093)
	at org.apache.lucene.index.IndexWriter.<init>(IndexWriter.java:887)
	at org.apache.lucene.index.TestIndexWriterMerging.fillIndex(TestIndexWriterMerging.java:96)
	at org.apache.lucene.index.TestIndexWriterMerging.testLucene(TestIndexWriterMerging.java:43)
	at org.apache.lucene.util.LuceneTestCase.runBare(LuceneTestCase.java:253)


REGRESSION:  org.apache.lucene.index.TestIndexWriterReader.testUpdateDocument

Error Message:
fileMap

Stack Trace:
java.lang.NoSuchFieldError: fileMap
	at org.apache.lucene.store.MockRAMDirectory.openInput(MockRAMDirectory.java:234)
	at org.apache.lucene.index.SegmentInfos$FindSegmentsFile.run(SegmentInfos.java:591)
	at org.apache.lucene.index.SegmentInfos$FindSegmentsFile.run(SegmentInfos.java:524)
	at org.apache.lucene.index.SegmentInfos.read(SegmentInfos.java:307)
	at org.apache.lucene.index.IndexWriter.<init>(IndexWriter.java:1093)
	at org.apache.lucene.index.IndexWriter.<init>(IndexWriter.java:914)
	at org.apache.lucene.index.TestIndexWriterReader.testUpdateDocument(TestIndexWriterReader.java:80)
	at org.apache.lucene.util.LuceneTestCase.runBare(LuceneTestCase.java:253)


REGRESSION:  org.apache.lucene.index.TestIndexWriterReader.testAddIndexes

Error Message:
fileMap

Stack Trace:
java.lang.NoSuchFieldError: fileMap
	at org.apache.lucene.store.MockRAMDirectory.openInput(MockRAMDirectory.java:234)
	at org.apache.lucene.index.SegmentInfos$FindSegmentsFile.run(SegmentInfos.java:591)
	at org.apache.lucene.index.SegmentInfos$FindSegmentsFile.run(SegmentInfos.java:524)
	at org.apache.lucene.index.SegmentInfos.read(SegmentInfos.java:307)
	at org.apache.lucene.index.IndexWriter.<init>(IndexWriter.java:1093)
	at org.apache.lucene.index.IndexWriter.<init>(IndexWriter.java:914)
	at org.apache.lucene.index.TestIndexWriterReader.testAddIndexes(TestIndexWriterReader.java:143)
	at org.apache.lucene.util.LuceneTestCase.runBare(LuceneTestCase.java:253)


REGRESSION:  org.apache.lucene.index.TestIndexWriterReader.testAddIndexes2

Error Message:
fileMap

Stack Trace:
java.lang.NoSuchFieldError: fileMap
	at org.apache.lucene.store.MockRAMDirectory.openInput(MockRAMDirectory.java:234)
	at org.apache.lucene.index.SegmentInfos$FindSegmentsFile.run(SegmentInfos.java:591)
	at org.apache.lucene.index.SegmentInfos$FindSegmentsFile.run(SegmentInfos.java:524)
	at org.apache.lucene.index.SegmentInfos.read(SegmentInfos.java:307)
	at org.apache.lucene.index.IndexWriter.<init>(IndexWriter.java:1093)
	at org.apache.lucene.index.IndexWriter.<init>(IndexWriter.java:914)
	at org.apache.lucene.index.TestIndexWriterReader.testAddIndexes2(TestIndexWriterReader.java:190)
	at org.apache.lucene.util.LuceneTestCase.runBare(LuceneTestCase.java:253)


REGRESSION:  org.apache.lucene.index.TestIndexWriterReader.testDeleteFromIndexWriter

Error Message:
fileMap

Stack Trace:
java.lang.NoSuchFieldError: fileMap
	at org.apache.lucene.store.MockRAMDirectory.openInput(MockRAMDirectory.java:234)
	at org.apache.lucene.index.SegmentInfos$FindSegmentsFile.run(SegmentInfos.java:591)
	at org.apache.lucene.index.SegmentInfos$FindSegmentsFile.run(SegmentInfos.java:524)
	at org.apache.lucene.index.SegmentInfos.read(SegmentInfos.java:307)
	at org.apache.lucene.index.IndexWriter.<init>(IndexWriter.java:1093)
	at org.apache.lucene.index.IndexWriter.<init>(IndexWriter.java:914)
	at org.apache.lucene.index.TestIndexWriterReader.testDeleteFromIndexWriter(TestIndexWriterReader.java:225)
	at org.apache.lucene.util.LuceneTestCase.runBare(LuceneTestCase.java:253)


REGRESSION:  org.apache.lucene.index.TestIndexWriterReader.testAddIndexesAndDoDeletesThreads

Error Message:
fileMap

Stack Trace:
java.lang.NoSuchFieldError: fileMap
	at org.apache.lucene.store.MockRAMDirectory.openInput(MockRAMDirectory.java:234)
	at org.apache.lucene.index.SegmentInfos$FindSegmentsFile.run(SegmentInfos.java:591)
	at org.apache.lucene.index.SegmentInfos$FindSegmentsFile.run(SegmentInfos.java:524)
	at org.apache.lucene.index.SegmentInfos.read(SegmentInfos.java:307)
	at org.apache.lucene.index.IndexWriter.<init>(IndexWriter.java:1093)
	at org.apache.lucene.index.IndexWriter.<init>(IndexWriter.java:914)
	at org.apache.lucene.index.TestIndexWriterReader.testAddIndexesAndDoDeletesThreads(TestIndexWriterReader.java:279)
	at org.apache.lucene.util.LuceneTestCase.runBare(LuceneTestCase.java:253)


REGRESSION:  org.apache.lucene.index.TestIndexWriterReader.testIndexWriterReopenSegmentOptimize

Error Message:
fileMap

Stack Trace:
java.lang.NoSuchFieldError: fileMap
	at org.apache.lucene.store.MockRAMDirectory.openInput(MockRAMDirectory.java:234)
	at org.apache.lucene.index.SegmentInfos$FindSegmentsFile.run(SegmentInfos.java:591)
	at org.apache.lucene.index.SegmentInfos$FindSegmentsFile.run(SegmentInfos.java:524)
	at org.apache.lucene.index.SegmentInfos.read(SegmentInfos.java:307)
	at org.apache.lucene.index.IndexWriter.<init>(IndexWriter.java:1093)
	at org.apache.lucene.index.IndexWriter.<init>(IndexWriter.java:914)
	at org.apache.lucene.index.TestIndexWriterReader.doTestIndexWriterReopenSegment(TestIndexWriterReader.java:495)
	at org.apache.lucene.index.TestIndexWriterReader.testIndexWriterReopenSegmentOptimize(TestIndexWriterReader.java:482)
	at org.apache.lucene.util.LuceneTestCase.runBare(LuceneTestCase.java:253)


REGRESSION:  org.apache.lucene.index.TestIndexWriterReader.testIndexWriterReopenSegment

Error Message:
fileMap

Stack Trace:
java.lang.NoSuchFieldError: fileMap
	at org.apache.lucene.store.MockRAMDirectory.openInput(MockRAMDirectory.java:234)
	at org.apache.lucene.index.SegmentInfos$FindSegmentsFile.run(SegmentInfos.java:591)
	at org.apache.lucene.index.SegmentInfos$FindSegmentsFile.run(SegmentInfos.java:524)
	at org.apache.lucene.index.SegmentInfos.read(SegmentInfos.java:307)
	at org.apache.lucene.index.IndexWriter.<init>(IndexWriter.java:1093)
	at org.apache.lucene.index.IndexWriter.<init>(IndexWriter.java:914)
	at org.apache.lucene.index.TestIndexWriterReader.doTestIndexWriterReopenSegment(TestIndexWriterReader.java:495)
	at org.apache.lucene.index.TestIndexWriterReader.testIndexWriterReopenSegment(TestIndexWriterReader.java:486)
	at org.apache.lucene.util.LuceneTestCase.runBare(LuceneTestCase.java:253)


REGRESSION:  org.apache.lucene.index.TestIndexWriterReader.testMergeWarmer

Error Message:
fileMap

Stack Trace:
java.lang.NoSuchFieldError: fileMap
	at org.apache.lucene.store.MockRAMDirectory.openInput(MockRAMDirectory.java:234)
	at org.apache.lucene.index.SegmentInfos$FindSegmentsFile.run(SegmentInfos.java:591)
	at org.apache.lucene.index.SegmentInfos$FindSegmentsFile.run(SegmentInfos.java:524)
	at org.apache.lucene.index.SegmentInfos.read(SegmentInfos.java:307)
	at org.apache.lucene.index.IndexWriter.<init>(IndexWriter.java:1093)
	at org.apache.lucene.index.IndexWriter.<init>(IndexWriter.java:914)
	at org.apache.lucene.index.TestIndexWriterReader.testMergeWarmer(TestIndexWriterReader.java:609)
	at org.apache.lucene.util.LuceneTestCase.runBare(LuceneTestCase.java:253)


REGRESSION:  org.apache.lucene.index.TestIndexWriterReader.testAfterCommit

Error Message:
fileMap

Stack Trace:
java.lang.NoSuchFieldError: fileMap
	at org.apache.lucene.store.MockRAMDirectory.openInput(MockRAMDirectory.java:234)
	at org.apache.lucene.index.SegmentInfos$FindSegmentsFile.run(SegmentInfos.java:591)
	at org.apache.lucene.index.SegmentInfos$FindSegmentsFile.run(SegmentInfos.java:524)
	at org.apache.lucene.index.SegmentInfos.read(SegmentInfos.java:307)
	at org.apache.lucene.index.IndexWriter.<init>(IndexWriter.java:1093)
	at org.apache.lucene.index.IndexWriter.<init>(IndexWriter.java:914)
	at org.apache.lucene.index.TestIndexWriterReader.testAfterCommit(TestIndexWriterReader.java:644)
	at org.apache.lucene.util.LuceneTestCase.runBare(LuceneTestCase.java:253)


REGRESSION:  org.apache.lucene.index.TestIndexWriterReader.testAfterClose

Error Message:
fileMap

Stack Trace:
java.lang.NoSuchFieldError: fileMap
	at org.apache.lucene.store.MockRAMDirectory.openInput(MockRAMDirectory.java:234)
	at org.apache.lucene.index.SegmentInfos$FindSegmentsFile.run(SegmentInfos.java:591)
	at org.apache.lucene.index.SegmentInfos$FindSegmentsFile.run(SegmentInfos.java:524)
	at org.apache.lucene.index.SegmentInfos.read(SegmentInfos.java:307)
	at org.apache.lucene.index.IndexWriter.<init>(IndexWriter.java:1093)
	at org.apache.lucene.index.IndexWriter.<init>(IndexWriter.java:914)
	at org.apache.lucene.index.TestIndexWriterReader.testAfterClose(TestIndexWriterReader.java:678)
	at org.apache.lucene.util.LuceneTestCase.runBare(LuceneTestCase.java:253)


REGRESSION:  org.apache.lucene.index.TestIndexWriterReader.testDuringAddIndexes

Error Message:
fileMap

Stack Trace:
java.lang.NoSuchFieldError: fileMap
	at org.apache.lucene.store.MockRAMDirectory.openInput(MockRAMDirectory.java:234)
	at org.apache.lucene.index.SegmentInfos$FindSegmentsFile.run(SegmentInfos.java:591)
	at org.apache.lucene.index.SegmentInfos$FindSegmentsFile.run(SegmentInfos.java:524)
	at org.apache.lucene.index.SegmentInfos.read(SegmentInfos.java:307)
	at org.apache.lucene.index.IndexWriter.<init>(IndexWriter.java:1093)
	at org.apache.lucene.index.IndexWriter.<init>(IndexWriter.java:914)
	at org.apache.lucene.index.TestIndexWriterReader.testDuringAddIndexes(TestIndexWriterReader.java:708)
	at org.apache.lucene.util.LuceneTestCase.runBare(LuceneTestCase.java:253)


REGRESSION:  org.apache.lucene.index.TestIndexWriterReader.testDuringAddDelete

Error Message:
fileMap

Stack Trace:
java.lang.NoSuchFieldError: fileMap
	at org.apache.lucene.store.MockRAMDirectory.openInput(MockRAMDirectory.java:234)
	at org.apache.lucene.index.SegmentInfos$FindSegmentsFile.run(SegmentInfos.java:591)
	at org.apache.lucene.index.SegmentInfos$FindSegmentsFile.run(SegmentInfos.java:524)
	at org.apache.lucene.index.SegmentInfos.read(SegmentInfos.java:307)
	at org.apache.lucene.index.IndexWriter.<init>(IndexWriter.java:1093)
	at org.apache.lucene.index.IndexWriter.<init>(IndexWriter.java:914)
	at org.apache.lucene.index.TestIndexWriterReader.testDuringAddDelete(TestIndexWriterReader.java:786)
	at org.apache.lucene.util.LuceneTestCase.runBare(LuceneTestCase.java:253)


REGRESSION:  org.apache.lucene.index.TestIndexWriterReader.testExpungeDeletes

Error Message:
fileMap

Stack Trace:
java.lang.NoSuchFieldError: fileMap
	at org.apache.lucene.store.MockRAMDirectory.openInput(MockRAMDirectory.java:234)
	at org.apache.lucene.index.SegmentInfos$FindSegmentsFile.run(SegmentInfos.java:591)
	at org.apache.lucene.index.SegmentInfos$FindSegmentsFile.run(SegmentInfos.java:524)
	at org.apache.lucene.index.SegmentInfos.read(SegmentInfos.java:307)
	at org.apache.lucene.index.IndexWriter.<init>(IndexWriter.java:1093)
	at org.apache.lucene.index.IndexWriter.<init>(IndexWriter.java:914)
	at org.apache.lucene.index.TestIndexWriterReader.testExpungeDeletes(TestIndexWriterReader.java:867)
	at org.apache.lucene.util.LuceneTestCase.runBare(LuceneTestCase.java:253)


REGRESSION:  org.apache.lucene.index.TestNRTReaderWithThreads.testIndexing

Error Message:
fileMap

Stack Trace:
java.lang.NoSuchFieldError: fileMap
	at org.apache.lucene.store.MockRAMDirectory.openInput(MockRAMDirectory.java:234)
	at org.apache.lucene.index.SegmentInfos$FindSegmentsFile.run(SegmentInfos.java:591)
	at org.apache.lucene.index.SegmentInfos$FindSegmentsFile.run(SegmentInfos.java:524)
	at org.apache.lucene.index.SegmentInfos.read(SegmentInfos.java:307)
	at org.apache.lucene.index.IndexWriter.<init>(IndexWriter.java:1093)
	at org.apache.lucene.index.IndexWriter.<init>(IndexWriter.java:914)
	at org.apache.lucene.index.TestNRTReaderWithThreads.testIndexing(TestNRTReaderWithThreads.java:35)
	at org.apache.lucene.util.LuceneTestCase.runBare(LuceneTestCase.java:253)


REGRESSION:  org.apache.lucene.index.TestOmitTf.testOmitTermFreqAndPositions

Error Message:
fileMap

Stack Trace:
java.lang.NoSuchFieldError: fileMap
	at org.apache.lucene.store.MockRAMDirectory.openInput(MockRAMDirectory.java:234)
	at org.apache.lucene.index.SegmentInfos$FindSegmentsFile.run(SegmentInfos.java:591)
	at org.apache.lucene.index.SegmentInfos$FindSegmentsFile.run(SegmentInfos.java:524)
	at org.apache.lucene.index.SegmentInfos.read(SegmentInfos.java:307)
	at org.apache.lucene.index.IndexWriter.<init>(IndexWriter.java:1093)
	at org.apache.lucene.index.IndexWriter.<init>(IndexWriter.java:887)
	at org.apache.lucene.index.TestOmitTf.testOmitTermFreqAndPositions(TestOmitTf.java:70)
	at org.apache.lucene.util.LuceneTestCase.runBare(LuceneTestCase.java:253)


REGRESSION:  org.apache.lucene.index.TestOmitTf.testMixedMerge

Error Message:
fileMap

Stack Trace:
java.lang.NoSuchFieldError: fileMap
	at org.apache.lucene.store.MockRAMDirectory.openInput(MockRAMDirectory.java:234)
	at org.apache.lucene.index.SegmentInfos$FindSegmentsFile.run(SegmentInfos.java:591)
	at org.apache.lucene.index.SegmentInfos$FindSegmentsFile.run(SegmentInfos.java:524)
	at org.apache.lucene.index.SegmentInfos.read(SegmentInfos.java:307)
	at org.apache.lucene.index.IndexWriter.<init>(IndexWriter.java:1093)
	at org.apache.lucene.index.IndexWriter.<init>(IndexWriter.java:887)
	at org.apache.lucene.index.TestOmitTf.testMixedMerge(TestOmitTf.java:116)
	at org.apache.lucene.util.LuceneTestCase.runBare(LuceneTestCase.java:253)


REGRESSION:  org.apache.lucene.index.TestOmitTf.testMixedRAM

Error Message:
fileMap

Stack Trace:
java.lang.NoSuchFieldError: fileMap
	at org.apache.lucene.store.MockRAMDirectory.openInput(MockRAMDirectory.java:234)
	at org.apache.lucene.index.SegmentInfos$FindSegmentsFile.run(SegmentInfos.java:591)
	at org.apache.lucene.index.SegmentInfos$FindSegmentsFile.run(SegmentInfos.java:524)
	at org.apache.lucene.index.SegmentInfos.read(SegmentInfos.java:307)
	at org.apache.lucene.index.IndexWriter.<init>(IndexWriter.java:1093)
	at org.apache.lucene.index.IndexWriter.<init>(IndexWriter.java:887)
	at org.apache.lucene.index.TestOmitTf.testMixedRAM(TestOmitTf.java:169)
	at org.apache.lucene.util.LuceneTestCase.runBare(LuceneTestCase.java:253)


REGRESSION:  org.apache.lucene.index.TestOmitTf.testNoPrxFile

Error Message:
fileMap

Stack Trace:
java.lang.NoSuchFieldError: fileMap
	at org.apache.lucene.store.MockRAMDirectory.openInput(MockRAMDirectory.java:234)
	at org.apache.lucene.index.SegmentInfos$FindSegmentsFile.run(SegmentInfos.java:591)
	at org.apache.lucene.index.SegmentInfos$FindSegmentsFile.run(SegmentInfos.java:524)
	at org.apache.lucene.index.SegmentInfos.read(SegmentInfos.java:307)
	at org.apache.lucene.index.IndexWriter.<init>(IndexWriter.java:1093)
	at org.apache.lucene.index.IndexWriter.<init>(IndexWriter.java:887)
	at org.apache.lucene.index.TestOmitTf.testNoPrxFile(TestOmitTf.java:217)
	at org.apache.lucene.util.LuceneTestCase.runBare(LuceneTestCase.java:253)


REGRESSION:  org.apache.lucene.index.TestOmitTf.testBasic

Error Message:
fileMap

Stack Trace:
java.lang.NoSuchFieldError: fileMap
	at org.apache.lucene.store.MockRAMDirectory.openInput(MockRAMDirectory.java:234)
	at org.apache.lucene.index.SegmentInfos$FindSegmentsFile.run(SegmentInfos.java:591)
	at org.apache.lucene.index.SegmentInfos$FindSegmentsFile.run(SegmentInfos.java:524)
	at org.apache.lucene.index.SegmentInfos.read(SegmentInfos.java:307)
	at org.apache.lucene.index.IndexWriter.<init>(IndexWriter.java:1093)
	at org.apache.lucene.index.IndexWriter.<init>(IndexWriter.java:887)
	at org.apache.lucene.index.TestOmitTf.testBasic(TestOmitTf.java:248)
	at org.apache.lucene.util.LuceneTestCase.runBare(LuceneTestCase.java:253)


REGRESSION:  org.apache.lucene.index.TestParallelReader.testQueries

Error Message:
fileMap

Stack Trace:
java.lang.NoSuchFieldError: fileMap
	at org.apache.lucene.store.MockRAMDirectory.openInput(MockRAMDirectory.java:234)
	at org.apache.lucene.index.SegmentInfos$FindSegmentsFile.run(SegmentInfos.java:591)
	at org.apache.lucene.index.SegmentInfos$FindSegmentsFile.run(SegmentInfos.java:524)
	at org.apache.lucene.index.SegmentInfos.read(SegmentInfos.java:307)
	at org.apache.lucene.index.IndexWriter.<init>(IndexWriter.java:1093)
	at org.apache.lucene.index.IndexWriter.<init>(IndexWriter.java:887)
	at org.apache.lucene.index.TestParallelReader.single(TestParallelReader.java:236)
	at org.apache.lucene.index.TestParallelReader.setUp(TestParallelReader.java:48)
	at org.apache.lucene.util.LuceneTestCase.runBare(LuceneTestCase.java:253)


REGRESSION:  org.apache.lucene.index.TestParallelReader.testFieldNames

Error Message:
fileMap

Stack Trace:
java.lang.NoSuchFieldError: fileMap
	at org.apache.lucene.store.MockRAMDirectory.openInput(MockRAMDirectory.java:234)
	at org.apache.lucene.index.SegmentInfos$FindSegmentsFile.run(SegmentInfos.java:591)
	at org.apache.lucene.index.SegmentInfos$FindSegmentsFile.run(SegmentInfos.java:524)
	at org.apache.lucene.index.SegmentInfos.read(SegmentInfos.java:307)
	at org.apache.lucene.index.IndexWriter.<init>(IndexWriter.java:1093)
	at org.apache.lucene.index.IndexWriter.<init>(IndexWriter.java:887)
	at org.apache.lucene.index.TestParallelReader.single(TestParallelReader.java:236)
	at org.apache.lucene.index.TestParallelReader.setUp(TestParallelReader.java:48)
	at org.apache.lucene.util.LuceneTestCase.runBare(LuceneTestCase.java:253)


REGRESSION:  org.apache.lucene.index.TestParallelReader.testDocument

Error Message:
fileMap

Stack Trace:
java.lang.NoSuchFieldError: fileMap
	at org.apache.lucene.store.MockRAMDirectory.openInput(MockRAMDirectory.java:234)
	at org.apache.lucene.index.SegmentInfos$FindSegmentsFile.run(SegmentInfos.java:591)
	at org.apache.lucene.index.SegmentInfos$FindSegmentsFile.run(SegmentInfos.java:524)
	at org.apache.lucene.index.SegmentInfos.read(SegmentInfos.java:307)
	at org.apache.lucene.index.IndexWriter.<init>(IndexWriter.java:1093)
	at org.apache.lucene.index.IndexWriter.<init>(IndexWriter.java:887)
	at org.apache.lucene.index.TestParallelReader.single(TestParallelReader.java:236)
	at org.apache.lucene.index.TestParallelReader.setUp(TestParallelReader.java:48)
	at org.apache.lucene.util.LuceneTestCase.runBare(LuceneTestCase.java:253)


REGRESSION:  org.apache.lucene.index.TestParallelReader.testIncompatibleIndexes

Error Message:
fileMap

Stack Trace:
java.lang.NoSuchFieldError: fileMap
	at org.apache.lucene.store.MockRAMDirectory.openInput(MockRAMDirectory.java:234)
	at org.apache.lucene.index.SegmentInfos$FindSegmentsFile.run(SegmentInfos.java:591)
	at org.apache.lucene.index.SegmentInfos$FindSegmentsFile.run(SegmentInfos.java:524)
	at org.apache.lucene.index.SegmentInfos.read(SegmentInfos.java:307)
	at org.apache.lucene.index.IndexWriter.<init>(IndexWriter.java:1093)
	at org.apache.lucene.index.IndexWriter.<init>(IndexWriter.java:887)
	at org.apache.lucene.index.TestParallelReader.single(TestParallelReader.java:236)
	at org.apache.lucene.index.TestParallelReader.setUp(TestParallelReader.java:48)
	at org.apache.lucene.util.LuceneTestCase.runBare(LuceneTestCase.java:253)


REGRESSION:  org.apache.lucene.index.TestParallelReader.testIsCurrent

Error Message:
fileMap

Stack Trace:
java.lang.NoSuchFieldError: fileMap
	at org.apache.lucene.store.MockRAMDirectory.openInput(MockRAMDirectory.java:234)
	at org.apache.lucene.index.SegmentInfos$FindSegmentsFile.run(SegmentInfos.java:591)
	at org.apache.lucene.index.SegmentInfos$FindSegmentsFile.run(SegmentInfos.java:524)
	at org.apache.lucene.index.SegmentInfos.read(SegmentInfos.java:307)
	at org.apache.lucene.index.IndexWriter.<init>(IndexWriter.java:1093)
	at org.apache.lucene.index.IndexWriter.<init>(IndexWriter.java:887)
	at org.apache.lucene.index.TestParallelReader.single(TestParallelReader.java:236)
	at org.apache.lucene.index.TestParallelReader.setUp(TestParallelReader.java:48)
	at org.apache.lucene.util.LuceneTestCase.runBare(LuceneTestCase.java:253)


REGRESSION:  org.apache.lucene.index.TestParallelReader.testIsOptimized

Error Message:
fileMap

Stack Trace:
java.lang.NoSuchFieldError: fileMap
	at org.apache.lucene.store.MockRAMDirectory.openInput(MockRAMDirectory.java:234)
	at org.apache.lucene.index.SegmentInfos$FindSegmentsFile.run(SegmentInfos.java:591)
	at org.apache.lucene.index.SegmentInfos$FindSegmentsFile.run(SegmentInfos.java:524)
	at org.apache.lucene.index.SegmentInfos.read(SegmentInfos.java:307)
	at org.apache.lucene.index.IndexWriter.<init>(IndexWriter.java:1093)
	at org.apache.lucene.index.IndexWriter.<init>(IndexWriter.java:887)
	at org.apache.lucene.index.TestParallelReader.single(TestParallelReader.java:236)
	at org.apache.lucene.index.TestParallelReader.setUp(TestParallelReader.java:48)
	at org.apache.lucene.util.LuceneTestCase.runBare(LuceneTestCase.java:253)


REGRESSION:  org.apache.lucene.index.TestParallelReader.testAllTermDocs

Error Message:
fileMap

Stack Trace:
java.lang.NoSuchFieldError: fileMap
	at org.apache.lucene.store.MockRAMDirectory.openInput(MockRAMDirectory.java:234)
	at org.apache.lucene.index.SegmentInfos$FindSegmentsFile.run(SegmentInfos.java:591)
	at org.apache.lucene.index.SegmentInfos$FindSegmentsFile.run(SegmentInfos.java:524)
	at org.apache.lucene.index.SegmentInfos.read(SegmentInfos.java:307)
	at org.apache.lucene.index.IndexWriter.<init>(IndexWriter.java:1093)
	at org.apache.lucene.index.IndexWriter.<init>(IndexWriter.java:887)
	at org.apache.lucene.index.TestParallelReader.single(TestParallelReader.java:236)
	at org.apache.lucene.index.TestParallelReader.setUp(TestParallelReader.java:48)
	at org.apache.lucene.util.LuceneTestCase.runBare(LuceneTestCase.java:253)


REGRESSION:  org.apache.lucene.index.TestParallelReaderEmptyIndex.testEmptyIndex

Error Message:
fileMap

Stack Trace:
java.lang.NoSuchFieldError: fileMap
	at org.apache.lucene.store.MockRAMDirectory.openInput(MockRAMDirectory.java:234)
	at org.apache.lucene.index.SegmentInfos$FindSegmentsFile.run(SegmentInfos.java:591)
	at org.apache.lucene.index.SegmentInfos$FindSegmentsFile.run(SegmentInfos.java:524)
	at org.apache.lucene.index.SegmentInfos.read(SegmentInfos.java:307)
	at org.apache.lucene.index.IndexWriter.<init>(IndexWriter.java:1093)
	at org.apache.lucene.index.IndexWriter.<init>(IndexWriter.java:887)
	at org.apache.lucene.index.TestParallelReaderEmptyIndex.testEmptyIndex(TestParallelReaderEmptyIndex.java:50)
	at org.apache.lucene.util.LuceneTestCase.runBare(LuceneTestCase.java:253)


REGRESSION:  org.apache.lucene.index.TestParallelReaderEmptyIndex.testEmptyIndexWithVectors

Error Message:
fileMap

Stack Trace:
java.lang.NoSuchFieldError: fileMap
	at org.apache.lucene.store.MockRAMDirectory.openInput(MockRAMDirectory.java:234)
	at org.apache.lucene.index.SegmentInfos$FindSegmentsFile.run(SegmentInfos.java:591)
	at org.apache.lucene.index.SegmentInfos$FindSegmentsFile.run(SegmentInfos.java:524)
	at org.apache.lucene.index.SegmentInfos.read(SegmentInfos.java:307)
	at org.apache.lucene.index.IndexWriter.<init>(IndexWriter.java:1093)
	at org.apache.lucene.index.IndexWriter.<init>(IndexWriter.java:887)
	at org.apache.lucene.index.TestParallelReaderEmptyIndex.testEmptyIndexWithVectors(TestParallelReaderEmptyIndex.java:83)
	at org.apache.lucene.util.LuceneTestCase.runBare(LuceneTestCase.java:253)


REGRESSION:  org.apache.lucene.index.TestSegmentTermDocs.testIndexDivisor

Error Message:
fileMap

Stack Trace:
java.lang.NoSuchFieldError: fileMap
	at org.apache.lucene.store.MockRAMDirectory.openInput(MockRAMDirectory.java:234)
	at org.apache.lucene.index.SegmentInfos$FindSegmentsFile.run(SegmentInfos.java:591)
	at org.apache.lucene.index.SegmentInfos$FindSegmentsFile.run(SegmentInfos.java:524)
	at org.apache.lucene.index.SegmentInfos.read(SegmentInfos.java:307)
	at org.apache.lucene.index.IndexWriter.<init>(IndexWriter.java:1093)
	at org.apache.lucene.index.IndexWriter.<init>(IndexWriter.java:914)
	at org.apache.lucene.index.DocHelper.writeDoc(DocHelper.java:237)
	at org.apache.lucene.index.DocHelper.writeDoc(DocHelper.java:222)
	at org.apache.lucene.index.TestSegmentTermDocs.testIndexDivisor(TestSegmentTermDocs.java:233)
	at org.apache.lucene.util.LuceneTestCase.runBare(LuceneTestCase.java:253)


REGRESSION:  org.apache.lucene.index.TestSegmentTermEnum.testPrevTermAtEnd

Error Message:
fileMap

Stack Trace:
java.lang.NoSuchFieldError: fileMap
	at org.apache.lucene.store.MockRAMDirectory.openInput(MockRAMDirectory.java:234)
	at org.apache.lucene.index.SegmentInfos$FindSegmentsFile.run(SegmentInfos.java:591)
	at org.apache.lucene.index.SegmentInfos$FindSegmentsFile.run(SegmentInfos.java:524)
	at org.apache.lucene.index.SegmentInfos.read(SegmentInfos.java:307)
	at org.apache.lucene.index.IndexWriter.<init>(IndexWriter.java:1093)
	at org.apache.lucene.index.IndexWriter.<init>(IndexWriter.java:887)
	at org.apache.lucene.index.TestSegmentTermEnum.testPrevTermAtEnd(TestSegmentTermEnum.java:67)
	at org.apache.lucene.util.LuceneTestCase.runBare(LuceneTestCase.java:253)


REGRESSION:  org.apache.lucene.index.TestStressIndexing.testStressIndexAndSearching

Error Message:
fileMap

Stack Trace:
java.lang.NoSuchFieldError: fileMap
	at org.apache.lucene.store.MockRAMDirectory.openInput(MockRAMDirectory.java:234)
	at org.apache.lucene.index.SegmentInfos$FindSegmentsFile.run(SegmentInfos.java:591)
	at org.apache.lucene.index.SegmentInfos$FindSegmentsFile.run(SegmentInfos.java:524)
	at org.apache.lucene.index.SegmentInfos.read(SegmentInfos.java:307)
	at org.apache.lucene.index.IndexWriter.<init>(IndexWriter.java:1093)
	at org.apache.lucene.index.IndexWriter.<init>(IndexWriter.java:887)
	at org.apache.lucene.index.TestStressIndexing.runStressTest(TestStressIndexing.java:124)
	at org.apache.lucene.index.TestStressIndexing.testStressIndexAndSearching(TestStressIndexing.java:176)
	at org.apache.lucene.util.LuceneTestCase.runBare(LuceneTestCase.java:253)


REGRESSION:  org.apache.lucene.index.TestStressIndexing2.testRandomIWReader

Error Message:
fileMap

Stack Trace:
java.lang.NoSuchFieldError: fileMap
	at org.apache.lucene.store.MockRAMDirectory.openInput(MockRAMDirectory.java:234)
	at org.apache.lucene.index.SegmentInfos$FindSegmentsFile.run(SegmentInfos.java:591)
	at org.apache.lucene.index.SegmentInfos$FindSegmentsFile.run(SegmentInfos.java:524)
	at org.apache.lucene.index.SegmentInfos.read(SegmentInfos.java:307)
	at org.apache.lucene.index.IndexWriter.<init>(IndexWriter.java:1093)
	at org.apache.lucene.index.IndexWriter.<init>(IndexWriter.java:887)
	at org.apache.lucene.index.TestStressIndexing2$MockIndexWriter.<init>(TestStressIndexing2.java:45)
	at org.apache.lucene.index.TestStressIndexing2.indexRandomIWReader(TestStressIndexing2.java:127)
	at org.apache.lucene.index.TestStressIndexing2.testRandomIWReader(TestStressIndexing2.java:62)
	at org.apache.lucene.util.LuceneTestCase.runBare(LuceneTestCase.java:253)


REGRESSION:  org.apache.lucene.index.TestStressIndexing2.testRandom

Error Message:
fileMap

Stack Trace:
java.lang.NoSuchFieldError: fileMap
	at org.apache.lucene.store.MockRAMDirectory.openInput(MockRAMDirectory.java:234)
	at org.apache.lucene.index.SegmentInfos$FindSegmentsFile.run(SegmentInfos.java:591)
	at org.apache.lucene.index.SegmentInfos$FindSegmentsFile.run(SegmentInfos.java:524)
	at org.apache.lucene.index.SegmentInfos.read(SegmentInfos.java:307)
	at org.apache.lucene.index.IndexWriter.<init>(IndexWriter.java:1093)
	at org.apache.lucene.index.IndexWriter.<init>(IndexWriter.java:887)
	at org.apache.lucene.index.TestStressIndexing2$MockIndexWriter.<init>(TestStressIndexing2.java:45)
	at org.apache.lucene.index.TestStressIndexing2.indexRandom(TestStressIndexing2.java:180)
	at org.apache.lucene.index.TestStressIndexing2.testRandom(TestStressIndexing2.java:77)
	at org.apache.lucene.util.LuceneTestCase.runBare(LuceneTestCase.java:253)


REGRESSION:  org.apache.lucene.index.TestStressIndexing2.testMultiConfig

Error Message:
fileMap

Stack Trace:
java.lang.NoSuchFieldError: fileMap
	at org.apache.lucene.store.MockRAMDirectory.openInput(MockRAMDirectory.java:234)
	at org.apache.lucene.index.SegmentInfos$FindSegmentsFile.run(SegmentInfos.java:591)
	at org.apache.lucene.index.SegmentInfos$FindSegmentsFile.run(SegmentInfos.java:524)
	at org.apache.lucene.index.SegmentInfos.read(SegmentInfos.java:307)
	at org.apache.lucene.index.IndexWriter.<init>(IndexWriter.java:1093)
	at org.apache.lucene.index.IndexWriter.<init>(IndexWriter.java:887)
	at org.apache.lucene.index.TestStressIndexing2$MockIndexWriter.<init>(TestStressIndexing2.java:45)
	at org.apache.lucene.index.TestStressIndexing2.indexRandom(TestStressIndexing2.java:180)
	at org.apache.lucene.index.TestStressIndexing2.testMultiConfig(TestStressIndexing2.java:101)
	at org.apache.lucene.util.LuceneTestCase.runBare(LuceneTestCase.java:253)


REGRESSION:  org.apache.lucene.index.TestTermVectorsReader.test

Error Message:
fileMap

Stack Trace:
java.lang.NoSuchFieldError: fileMap
	at org.apache.lucene.store.MockRAMDirectory.openInput(MockRAMDirectory.java:234)
	at org.apache.lucene.index.SegmentInfos$FindSegmentsFile.run(SegmentInfos.java:591)
	at org.apache.lucene.index.SegmentInfos$FindSegmentsFile.run(SegmentInfos.java:524)
	at org.apache.lucene.index.SegmentInfos.read(SegmentInfos.java:307)
	at org.apache.lucene.index.IndexWriter.<init>(IndexWriter.java:1093)
	at org.apache.lucene.index.IndexWriter.<init>(IndexWriter.java:887)
	at org.apache.lucene.index.TestTermVectorsReader.setUp(TestTermVectorsReader.java:96)
	at org.apache.lucene.util.LuceneTestCase.runBare(LuceneTestCase.java:253)


REGRESSION:  org.apache.lucene.index.TestTermVectorsReader.testReader

Error Message:
fileMap

Stack Trace:
java.lang.NoSuchFieldError: fileMap
	at org.apache.lucene.store.MockRAMDirectory.openInput(MockRAMDirectory.java:234)
	at org.apache.lucene.index.SegmentInfos$FindSegmentsFile.run(SegmentInfos.java:591)
	at org.apache.lucene.index.SegmentInfos$FindSegmentsFile.run(SegmentInfos.java:524)
	at org.apache.lucene.index.SegmentInfos.read(SegmentInfos.java:307)
	at org.apache.lucene.index.IndexWriter.<init>(IndexWriter.java:1093)
	at org.apache.lucene.index.IndexWriter.<init>(IndexWriter.java:887)
	at org.apache.lucene.index.TestTermVectorsReader.setUp(TestTermVectorsReader.java:96)
	at org.apache.lucene.util.LuceneTestCase.runBare(LuceneTestCase.java:253)


REGRESSION:  org.apache.lucene.index.TestTermVectorsReader.testPositionReader

Error Message:
fileMap

Stack Trace:
java.lang.NoSuchFieldError: fileMap
	at org.apache.lucene.store.MockRAMDirectory.openInput(MockRAMDirectory.java:234)
	at org.apache.lucene.index.SegmentInfos$FindSegmentsFile.run(SegmentInfos.java:591)
	at org.apache.lucene.index.SegmentInfos$FindSegmentsFile.run(SegmentInfos.java:524)
	at org.apache.lucene.index.SegmentInfos.read(SegmentInfos.java:307)
	at org.apache.lucene.index.IndexWriter.<init>(IndexWriter.java:1093)
	at org.apache.lucene.index.IndexWriter.<init>(IndexWriter.java:887)
	at org.apache.lucene.index.TestTermVectorsReader.setUp(TestTermVectorsReader.java:96)
	at org.apache.lucene.util.LuceneTestCase.runBare(LuceneTestCase.java:253)


REGRESSION:  org.apache.lucene.index.TestTermVectorsReader.testOffsetReader

Error Message:
fileMap

Stack Trace:
java.lang.NoSuchFieldError: fileMap
	at org.apache.lucene.store.MockRAMDirectory.openInput(MockRAMDirectory.java:234)
	at org.apache.lucene.index.SegmentInfos$FindSegmentsFile.run(SegmentInfos.java:591)
	at org.apache.lucene.index.SegmentInfos$FindSegmentsFile.run(SegmentInfos.java:524)
	at org.apache.lucene.index.SegmentInfos.read(SegmentInfos.java:307)
	at org.apache.lucene.index.IndexWriter.<init>(IndexWriter.java:1093)
	at org.apache.lucene.index.IndexWriter.<init>(IndexWriter.java:887)
	at org.apache.lucene.index.TestTermVectorsReader.setUp(TestTermVectorsReader.java:96)
	at org.apache.lucene.util.LuceneTestCase.runBare(LuceneTestCase.java:253)


REGRESSION:  org.apache.lucene.index.TestTermVectorsReader.testMapper

Error Message:
fileMap

Stack Trace:
java.lang.NoSuchFieldError: fileMap
	at org.apache.lucene.store.MockRAMDirectory.openInput(MockRAMDirectory.java:234)
	at org.apache.lucene.index.SegmentInfos$FindSegmentsFile.run(SegmentInfos.java:591)
	at org.apache.lucene.index.SegmentInfos$FindSegmentsFile.run(SegmentInfos.java:524)
	at org.apache.lucene.index.SegmentInfos.read(SegmentInfos.java:307)
	at org.apache.lucene.index.IndexWriter.<init>(IndexWriter.java:1093)
	at org.apache.lucene.index.IndexWriter.<init>(IndexWriter.java:887)
	at org.apache.lucene.index.TestTermVectorsReader.setUp(TestTermVectorsReader.java:96)
	at org.apache.lucene.util.LuceneTestCase.runBare(LuceneTestCase.java:253)


REGRESSION:  org.apache.lucene.index.TestTermVectorsReader.testBadParams

Error Message:
fileMap

Stack Trace:
java.lang.NoSuchFieldError: fileMap
	at org.apache.lucene.store.MockRAMDirectory.openInput(MockRAMDirectory.java:234)
	at org.apache.lucene.index.SegmentInfos$FindSegmentsFile.run(SegmentInfos.java:591)
	at org.apache.lucene.index.SegmentInfos$FindSegmentsFile.run(SegmentInfos.java:524)
	at org.apache.lucene.index.SegmentInfos.read(SegmentInfos.java:307)
	at org.apache.lucene.index.IndexWriter.<init>(IndexWriter.java:1093)
	at org.apache.lucene.index.IndexWriter.<init>(IndexWriter.java:887)
	at org.apache.lucene.index.TestTermVectorsReader.setUp(TestTermVectorsReader.java:96)
	at org.apache.lucene.util.LuceneTestCase.runBare(LuceneTestCase.java:253)


REGRESSION:  org.apache.lucene.index.TestThreadedOptimize.testThreadedOptimize

Error Message:
fileMap

Stack Trace:
java.lang.NoSuchFieldError: fileMap
	at org.apache.lucene.store.MockRAMDirectory.openInput(MockRAMDirectory.java:234)
	at org.apache.lucene.index.SegmentInfos$FindSegmentsFile.run(SegmentInfos.java:591)
	at org.apache.lucene.index.SegmentInfos$FindSegmentsFile.run(SegmentInfos.java:524)
	at org.apache.lucene.index.SegmentInfos.read(SegmentInfos.java:307)
	at org.apache.lucene.index.IndexWriter.<init>(IndexWriter.java:1093)
	at org.apache.lucene.index.IndexWriter.<init>(IndexWriter.java:887)
	at org.apache.lucene.index.TestThreadedOptimize.runTest(TestThreadedOptimize.java:56)
	at org.apache.lucene.index.TestThreadedOptimize.testThreadedOptimize(TestThreadedOptimize.java:138)
	at org.apache.lucene.util.LuceneTestCase.runBare(LuceneTestCase.java:253)


REGRESSION:  org.apache.lucene.index.TestTransactionRollback.testRepeatedRollBacks

Error Message:
fileMap

Stack Trace:
java.lang.NoSuchFieldError: fileMap
	at org.apache.lucene.store.MockRAMDirectory.openInput(MockRAMDirectory.java:234)
	at org.apache.lucene.index.SegmentInfos$FindSegmentsFile.run(SegmentInfos.java:591)
	at org.apache.lucene.index.SegmentInfos$FindSegmentsFile.run(SegmentInfos.java:524)
	at org.apache.lucene.index.SegmentInfos.read(SegmentInfos.java:307)
	at org.apache.lucene.index.IndexWriter.<init>(IndexWriter.java:1093)
	at org.apache.lucene.index.IndexWriter.<init>(IndexWriter.java:940)
	at org.apache.lucene.index.TestTransactionRollback.setUp(TestTransactionRollback.java:131)
	at org.apache.lucene.util.LuceneTestCase.runBare(LuceneTestCase.java:253)


REGRESSION:  org.apache.lucene.index.TestTransactionRollback.testRollbackDeletionPolicy

Error Message:
fileMap

Stack Trace:
java.lang.NoSuchFieldError: fileMap
	at org.apache.lucene.store.MockRAMDirectory.openInput(MockRAMDirectory.java:234)
	at org.apache.lucene.index.SegmentInfos$FindSegmentsFile.run(SegmentInfos.java:591)
	at org.apache.lucene.index.SegmentInfos$FindSegmentsFile.run(SegmentInfos.java:524)
	at org.apache.lucene.index.SegmentInfos.read(SegmentInfos.java:307)
	at org.apache.lucene.index.IndexWriter.<init>(IndexWriter.java:1093)
	at org.apache.lucene.index.IndexWriter.<init>(IndexWriter.java:940)
	at org.apache.lucene.index.TestTransactionRollback.setUp(TestTransactionRollback.java:131)
	at org.apache.lucene.util.LuceneTestCase.runBare(LuceneTestCase.java:253)


REGRESSION:  org.apache.lucene.index.TestTransactions.testTransactions

Error Message:
fileMap

Stack Trace:
java.lang.NoSuchFieldError: fileMap
	at org.apache.lucene.store.MockRAMDirectory.openInput(MockRAMDirectory.java:234)
	at org.apache.lucene.index.SegmentInfos$FindSegmentsFile.run(SegmentInfos.java:591)
	at org.apache.lucene.index.SegmentInfos$FindSegmentsFile.run(SegmentInfos.java:524)
	at org.apache.lucene.index.SegmentInfos.read(SegmentInfos.java:307)
	at org.apache.lucene.index.IndexWriter.<init>(IndexWriter.java:1093)
	at org.apache.lucene.index.IndexWriter.<init>(IndexWriter.java:914)
	at org.apache.lucene.index.TestTransactions.initIndex(TestTransactions.java:181)
	at org.apache.lucene.index.TestTransactions.testTransactions(TestTransactions.java:200)
	at org.apache.lucene.util.LuceneTestCase.runBare(LuceneTestCase.java:253)


REGRESSION:  org.apache.lucene.queryParser.TestQueryParser.testPositionIncrements

Error Message:
fileMap

Stack Trace:
java.lang.NoSuchFieldError: fileMap
	at org.apache.lucene.store.MockRAMDirectory.openInput(MockRAMDirectory.java:234)
	at org.apache.lucene.index.SegmentInfos$FindSegmentsFile.run(SegmentInfos.java:591)
	at org.apache.lucene.index.SegmentInfos$FindSegmentsFile.run(SegmentInfos.java:524)
	at org.apache.lucene.index.SegmentInfos.read(SegmentInfos.java:307)
	at org.apache.lucene.index.IndexWriter.<init>(IndexWriter.java:1093)
	at org.apache.lucene.index.IndexWriter.<init>(IndexWriter.java:914)
	at org.apache.lucene.queryParser.TestQueryParser.testPositionIncrements(TestQueryParser.java:1030)
	at org.apache.lucene.util.LuceneTestCase.runBare(LuceneTestCase.java:253)
	at org.apache.lucene.util.LocalizedTestCase.runBare(LocalizedTestCase.java:85)


REGRESSION:  org.apache.lucene.search.TestBoolean2.testQueries01

Error Message:
fileMap

Stack Trace:
java.lang.NoSuchFieldError: fileMap
	at org.apache.lucene.store.MockRAMDirectory.createOutput(MockRAMDirectory.java:211)
	at org.apache.lucene.store.Directory.copy(Directory.java:224)
	at org.apache.lucene.store.RAMDirectory.<init>(RAMDirectory.java:77)
	at org.apache.lucene.store.RAMDirectory.<init>(RAMDirectory.java:68)
	at org.apache.lucene.store.MockRAMDirectory.<init>(MockRAMDirectory.java:71)
	at org.apache.lucene.search.TestBoolean2.setUp(TestBoolean2.java:64)
	at org.apache.lucene.util.LuceneTestCase.runBare(LuceneTestCase.java:253)


REGRESSION:  org.apache.lucene.search.TestBoolean2.testQueries02

Error Message:
fileMap

Stack Trace:
java.lang.NoSuchFieldError: fileMap
	at org.apache.lucene.store.MockRAMDirectory.createOutput(MockRAMDirectory.java:211)
	at org.apache.lucene.store.Directory.copy(Directory.java:224)
	at org.apache.lucene.store.RAMDirectory.<init>(RAMDirectory.java:77)
	at org.apache.lucene.store.RAMDirectory.<init>(RAMDirectory.java:68)
	at org.apache.lucene.store.MockRAMDirectory.<init>(MockRAMDirectory.java:71)
	at org.apache.lucene.search.TestBoolean2.setUp(TestBoolean2.java:64)
	at org.apache.lucene.util.LuceneTestCase.runBare(LuceneTestCase.java:253)


REGRESSION:  org.apache.lucene.search.TestBoolean2.testQueries03

Error Message:
fileMap

Stack Trace:
java.lang.NoSuchFieldError: fileMap
	at org.apache.lucene.store.MockRAMDirectory.createOutput(MockRAMDirectory.java:211)
	at org.apache.lucene.store.Directory.copy(Directory.java:224)
	at org.apache.lucene.store.RAMDirectory.<init>(RAMDirectory.java:77)
	at org.apache.lucene.store.RAMDirectory.<init>(RAMDirectory.java:68)
	at org.apache.lucene.store.MockRAMDirectory.<init>(MockRAMDirectory.java:71)
	at org.apache.lucene.search.TestBoolean2.setUp(TestBoolean2.java:64)
	at org.apache.lucene.util.LuceneTestCase.runBare(LuceneTestCase.java:253)


REGRESSION:  org.apache.lucene.search.TestBoolean2.testQueries04

Error Message:
fileMap

Stack Trace:
java.lang.NoSuchFieldError: fileMap
	at org.apache.lucene.store.MockRAMDirectory.createOutput(MockRAMDirectory.java:211)
	at org.apache.lucene.store.Directory.copy(Directory.java:224)
	at org.apache.lucene.store.RAMDirectory.<init>(RAMDirectory.java:77)
	at org.apache.lucene.store.RAMDirectory.<init>(RAMDirectory.java:68)
	at org.apache.lucene.store.MockRAMDirectory.<init>(MockRAMDirectory.java:71)
	at org.apache.lucene.search.TestBoolean2.setUp(TestBoolean2.java:64)
	at org.apache.lucene.util.LuceneTestCase.runBare(LuceneTestCase.java:253)


REGRESSION:  org.apache.lucene.search.TestBoolean2.testQueries05

Error Message:
fileMap

Stack Trace:
java.lang.NoSuchFieldError: fileMap
	at org.apache.lucene.store.MockRAMDirectory.createOutput(MockRAMDirectory.java:211)
	at org.apache.lucene.store.Directory.copy(Directory.java:224)
	at org.apache.lucene.store.RAMDirectory.<init>(RAMDirectory.java:77)
	at org.apache.lucene.store.RAMDirectory.<init>(RAMDirectory.java:68)
	at org.apache.lucene.store.MockRAMDirectory.<init>(MockRAMDirectory.java:71)
	at org.apache.lucene.search.TestBoolean2.setUp(TestBoolean2.java:64)
	at org.apache.lucene.util.LuceneTestCase.runBare(LuceneTestCase.java:253)


REGRESSION:  org.apache.lucene.search.TestBoolean2.testQueries06

Error Message:
fileMap

Stack Trace:
java.lang.NoSuchFieldError: fileMap
	at org.apache.lucene.store.MockRAMDirectory.createOutput(MockRAMDirectory.java:211)
	at org.apache.lucene.store.Directory.copy(Directory.java:224)
	at org.apache.lucene.store.RAMDirectory.<init>(RAMDirectory.java:77)
	at org.apache.lucene.store.RAMDirectory.<init>(RAMDirectory.java:68)
	at org.apache.lucene.store.MockRAMDirectory.<init>(MockRAMDirectory.java:71)
	at org.apache.lucene.search.TestBoolean2.setUp(TestBoolean2.java:64)
	at org.apache.lucene.util.LuceneTestCase.runBare(LuceneTestCase.java:253)


REGRESSION:  org.apache.lucene.search.TestBoolean2.testQueries07

Error Message:
fileMap

Stack Trace:
java.lang.NoSuchFieldError: fileMap
	at org.apache.lucene.store.MockRAMDirectory.createOutput(MockRAMDirectory.java:211)
	at org.apache.lucene.store.Directory.copy(Directory.java:224)
	at org.apache.lucene.store.RAMDirectory.<init>(RAMDirectory.java:77)
	at org.apache.lucene.store.RAMDirectory.<init>(RAMDirectory.java:68)
	at org.apache.lucene.store.MockRAMDirectory.<init>(MockRAMDirectory.java:71)
	at org.apache.lucene.search.TestBoolean2.setUp(TestBoolean2.java:64)
	at org.apache.lucene.util.LuceneTestCase.runBare(LuceneTestCase.java:253)


REGRESSION:  org.apache.lucene.search.TestBoolean2.testQueries08

Error Message:
fileMap

Stack Trace:
java.lang.NoSuchFieldError: fileMap
	at org.apache.lucene.store.MockRAMDirectory.createOutput(MockRAMDirectory.java:211)
	at org.apache.lucene.store.Directory.copy(Directory.java:224)
	at org.apache.lucene.store.RAMDirectory.<init>(RAMDirectory.java:77)
	at org.apache.lucene.store.RAMDirectory.<init>(RAMDirectory.java:68)
	at org.apache.lucene.store.MockRAMDirectory.<init>(MockRAMDirectory.java:71)
	at org.apache.lucene.search.TestBoolean2.setUp(TestBoolean2.java:64)
	at org.apache.lucene.util.LuceneTestCase.runBare(LuceneTestCase.java:253)


REGRESSION:  org.apache.lucene.search.TestBoolean2.testQueries09

Error Message:
fileMap

Stack Trace:
java.lang.NoSuchFieldError: fileMap
	at org.apache.lucene.store.MockRAMDirectory.createOutput(MockRAMDirectory.java:211)
	at org.apache.lucene.store.Directory.copy(Directory.java:224)
	at org.apache.lucene.store.RAMDirectory.<init>(RAMDirectory.java:77)
	at org.apache.lucene.store.RAMDirectory.<init>(RAMDirectory.java:68)
	at org.apache.lucene.store.MockRAMDirectory.<init>(MockRAMDirectory.java:71)
	at org.apache.lucene.search.TestBoolean2.setUp(TestBoolean2.java:64)
	at org.apache.lucene.util.LuceneTestCase.runBare(LuceneTestCase.java:253)


REGRESSION:  org.apache.lucene.search.TestBoolean2.testQueries10

Error Message:
fileMap

Stack Trace:
java.lang.NoSuchFieldError: fileMap
	at org.apache.lucene.store.MockRAMDirectory.createOutput(MockRAMDirectory.java:211)
	at org.apache.lucene.store.Directory.copy(Directory.java:224)
	at org.apache.lucene.store.RAMDirectory.<init>(RAMDirectory.java:77)
	at org.apache.lucene.store.RAMDirectory.<init>(RAMDirectory.java:68)
	at org.apache.lucene.store.MockRAMDirectory.<init>(MockRAMDirectory.java:71)
	at org.apache.lucene.search.TestBoolean2.setUp(TestBoolean2.java:64)
	at org.apache.lucene.util.LuceneTestCase.runBare(LuceneTestCase.java:253)


REGRESSION:  org.apache.lucene.search.TestBoolean2.testRandomQueries

Error Message:
fileMap

Stack Trace:
java.lang.NoSuchFieldError: fileMap
	at org.apache.lucene.store.MockRAMDirectory.createOutput(MockRAMDirectory.java:211)
	at org.apache.lucene.store.Directory.copy(Directory.java:224)
	at org.apache.lucene.store.RAMDirectory.<init>(RAMDirectory.java:77)
	at org.apache.lucene.store.RAMDirectory.<init>(RAMDirectory.java:68)
	at org.apache.lucene.store.MockRAMDirectory.<init>(MockRAMDirectory.java:71)
	at org.apache.lucene.search.TestBoolean2.setUp(TestBoolean2.java:64)
	at org.apache.lucene.util.LuceneTestCase.runBare(LuceneTestCase.java:253)


REGRESSION:  org.apache.lucene.search.TestBooleanQuery.testNullOrSubScorer

Error Message:
fileMap

Stack Trace:
java.lang.NoSuchFieldError: fileMap
	at org.apache.lucene.store.MockRAMDirectory.openInput(MockRAMDirectory.java:234)
	at org.apache.lucene.index.SegmentInfos$FindSegmentsFile.run(SegmentInfos.java:591)
	at org.apache.lucene.index.SegmentInfos$FindSegmentsFile.run(SegmentInfos.java:524)
	at org.apache.lucene.index.SegmentInfos.read(SegmentInfos.java:307)
	at org.apache.lucene.index.IndexWriter.<init>(IndexWriter.java:1093)
	at org.apache.lucene.index.IndexWriter.<init>(IndexWriter.java:914)
	at org.apache.lucene.search.TestBooleanQuery.testNullOrSubScorer(TestBooleanQuery.java:63)
	at org.apache.lucene.util.LuceneTestCase.runBare(LuceneTestCase.java:253)


REGRESSION:  org.apache.lucene.search.TestElevationComparator.testSorting

Error Message:
fileMap

Stack Trace:
java.lang.NoSuchFieldError: fileMap
	at org.apache.lucene.store.MockRAMDirectory.openInput(MockRAMDirectory.java:234)
	at org.apache.lucene.index.SegmentInfos$FindSegmentsFile.run(SegmentInfos.java:591)
	at org.apache.lucene.index.SegmentInfos$FindSegmentsFile.run(SegmentInfos.java:524)
	at org.apache.lucene.index.SegmentInfos.read(SegmentInfos.java:307)
	at org.apache.lucene.index.IndexWriter.<init>(IndexWriter.java:1093)
	at org.apache.lucene.index.IndexWriter.<init>(IndexWriter.java:887)
	at org.apache.lucene.search.TestElevationComparator.testSorting(TestElevationComparator.java:38)
	at org.apache.lucene.util.LuceneTestCase.runBare(LuceneTestCase.java:253)


REGRESSION:  org.apache.lucene.search.TestFieldCacheTermsFilter.testMissingTerms

Error Message:
fileMap

Stack Trace:
java.lang.NoSuchFieldError: fileMap
	at org.apache.lucene.store.MockRAMDirectory.openInput(MockRAMDirectory.java:234)
	at org.apache.lucene.index.SegmentInfos$FindSegmentsFile.run(SegmentInfos.java:591)
	at org.apache.lucene.index.SegmentInfos$FindSegmentsFile.run(SegmentInfos.java:524)
	at org.apache.lucene.index.SegmentInfos.read(SegmentInfos.java:307)
	at org.apache.lucene.index.IndexWriter.<init>(IndexWriter.java:1093)
	at org.apache.lucene.index.IndexWriter.<init>(IndexWriter.java:914)
	at org.apache.lucene.search.TestFieldCacheTermsFilter.testMissingTerms(TestFieldCacheTermsFilter.java:42)
	at org.apache.lucene.util.LuceneTestCase.runBare(LuceneTestCase.java:253)


REGRESSION:  org.apache.lucene.search.TestFuzzyQuery.testGiga

Error Message:
fileMap

Stack Trace:
java.lang.NoSuchFieldError: fileMap
	at org.apache.lucene.store.MockRAMDirectory.openInput(MockRAMDirectory.java:234)
	at org.apache.lucene.index.SegmentInfos$FindSegmentsFile.run(SegmentInfos.java:591)
	at org.apache.lucene.index.SegmentInfos$FindSegmentsFile.run(SegmentInfos.java:524)
	at org.apache.lucene.index.SegmentInfos.read(SegmentInfos.java:307)
	at org.apache.lucene.index.IndexWriter.<init>(IndexWriter.java:1093)
	at org.apache.lucene.index.IndexWriter.<init>(IndexWriter.java:887)
	at org.apache.lucene.search.TestFuzzyQuery.testGiga(TestFuzzyQuery.java:315)
	at org.apache.lucene.util.LuceneTestCase.runBare(LuceneTestCase.java:253)


REGRESSION:  org.apache.lucene.search.TestMultiSearcher.testEmptyIndex

Error Message:
fileMap

Stack Trace:
java.lang.NoSuchFieldError: fileMap
	at org.apache.lucene.store.MockRAMDirectory.openInput(MockRAMDirectory.java:234)
	at org.apache.lucene.index.SegmentInfos$FindSegmentsFile.run(SegmentInfos.java:591)
	at org.apache.lucene.index.SegmentInfos$FindSegmentsFile.run(SegmentInfos.java:524)
	at org.apache.lucene.index.SegmentInfos.read(SegmentInfos.java:307)
	at org.apache.lucene.index.IndexWriter.<init>(IndexWriter.java:1093)
	at org.apache.lucene.index.IndexWriter.<init>(IndexWriter.java:887)
	at org.apache.lucene.search.TestMultiSearcher.testEmptyIndex(TestMultiSearcher.java:86)
	at org.apache.lucene.util.LuceneTestCase.runBare(LuceneTestCase.java:253)


REGRESSION:  org.apache.lucene.search.TestMultiSearcher.testNormalization10

Error Message:
fileMap

Stack Trace:
java.lang.NoSuchFieldError: fileMap
	at org.apache.lucene.store.MockRAMDirectory.openInput(MockRAMDirectory.java:234)
	at org.apache.lucene.index.SegmentInfos$FindSegmentsFile.run(SegmentInfos.java:591)
	at org.apache.lucene.index.SegmentInfos$FindSegmentsFile.run(SegmentInfos.java:524)
	at org.apache.lucene.index.SegmentInfos.read(SegmentInfos.java:307)
	at org.apache.lucene.index.IndexWriter.<init>(IndexWriter.java:1093)
	at org.apache.lucene.index.IndexWriter.<init>(IndexWriter.java:887)
	at org.apache.lucene.search.TestMultiSearcher.initIndex(TestMultiSearcher.java:219)
	at org.apache.lucene.search.TestMultiSearcher.testNormalization(TestMultiSearcher.java:296)
	at org.apache.lucene.search.TestMultiSearcher.testNormalization10(TestMultiSearcher.java:283)
	at org.apache.lucene.util.LuceneTestCase.runBare(LuceneTestCase.java:253)


REGRESSION:  org.apache.lucene.search.TestParallelMultiSearcher.testEmptyIndex

Error Message:
fileMap

Stack Trace:
java.lang.NoSuchFieldError: fileMap
	at org.apache.lucene.store.MockRAMDirectory.openInput(MockRAMDirectory.java:234)
	at org.apache.lucene.index.SegmentInfos$FindSegmentsFile.run(SegmentInfos.java:591)
	at org.apache.lucene.index.SegmentInfos$FindSegmentsFile.run(SegmentInfos.java:524)
	at org.apache.lucene.index.SegmentInfos.read(SegmentInfos.java:307)
	at org.apache.lucene.index.IndexWriter.<init>(IndexWriter.java:1093)
	at org.apache.lucene.index.IndexWriter.<init>(IndexWriter.java:887)
	at org.apache.lucene.search.TestMultiSearcher.testEmptyIndex(TestMultiSearcher.java:86)
	at org.apache.lucene.util.LuceneTestCase.runBare(LuceneTestCase.java:253)


REGRESSION:  org.apache.lucene.search.TestParallelMultiSearcher.testNormalization10

Error Message:
fileMap

Stack Trace:
java.lang.NoSuchFieldError: fileMap
	at org.apache.lucene.store.MockRAMDirectory.openInput(MockRAMDirectory.java:234)
	at org.apache.lucene.index.SegmentInfos$FindSegmentsFile.run(SegmentInfos.java:591)
	at org.apache.lucene.index.SegmentInfos$FindSegmentsFile.run(SegmentInfos.java:524)
	at org.apache.lucene.index.SegmentInfos.read(SegmentInfos.java:307)
	at org.apache.lucene.index.IndexWriter.<init>(IndexWriter.java:1093)
	at org.apache.lucene.index.IndexWriter.<init>(IndexWriter.java:887)
	at org.apache.lucene.search.TestMultiSearcher.initIndex(TestMultiSearcher.java:219)
	at org.apache.lucene.search.TestMultiSearcher.testNormalization(TestMultiSearcher.java:296)
	at org.apache.lucene.search.TestMultiSearcher.testNormalization10(TestMultiSearcher.java:283)
	at org.apache.lucene.util.LuceneTestCase.runBare(LuceneTestCase.java:253)


REGRESSION:  org.apache.lucene.search.TestPositionIncrement.testSetPosition

Error Message:
fileMap

Stack Trace:
java.lang.NoSuchFieldError: fileMap
	at org.apache.lucene.store.MockRAMDirectory.openInput(MockRAMDirectory.java:234)
	at org.apache.lucene.index.SegmentInfos$FindSegmentsFile.run(SegmentInfos.java:591)
	at org.apache.lucene.index.SegmentInfos$FindSegmentsFile.run(SegmentInfos.java:524)
	at org.apache.lucene.index.SegmentInfos.read(SegmentInfos.java:307)
	at org.apache.lucene.index.IndexWriter.<init>(IndexWriter.java:1093)
	at org.apache.lucene.index.IndexWriter.<init>(IndexWriter.java:887)
	at org.apache.lucene.search.TestPositionIncrement.testSetPosition(TestPositionIncrement.java:91)
	at org.apache.lucene.util.LuceneTestCase.runBare(LuceneTestCase.java:253)


REGRESSION:  org.apache.lucene.search.TestPositionIncrement.testPayloadsPos0

Error Message:
fileMap

Stack Trace:
java.lang.NoSuchFieldError: fileMap
	at org.apache.lucene.store.MockRAMDirectory.openInput(MockRAMDirectory.java:234)
	at org.apache.lucene.index.SegmentInfos$FindSegmentsFile.run(SegmentInfos.java:591)
	at org.apache.lucene.index.SegmentInfos$FindSegmentsFile.run(SegmentInfos.java:524)
	at org.apache.lucene.index.SegmentInfos.read(SegmentInfos.java:307)
	at org.apache.lucene.index.IndexWriter.<init>(IndexWriter.java:1093)
	at org.apache.lucene.index.IndexWriter.<init>(IndexWriter.java:887)
	at org.apache.lucene.search.TestPositionIncrement.testPayloadsPos0(TestPositionIncrement.java:241)
	at org.apache.lucene.util.LuceneTestCase.runBare(LuceneTestCase.java:253)


REGRESSION:  org.apache.lucene.search.TestSimpleExplanations.testTermQueryMultiSearcherExplain

Error Message:
fileMap

Stack Trace:
java.lang.NoSuchFieldError: fileMap
	at org.apache.lucene.store.MockRAMDirectory.openInput(MockRAMDirectory.java:234)
	at org.apache.lucene.index.SegmentInfos$FindSegmentsFile.run(SegmentInfos.java:591)
	at org.apache.lucene.index.SegmentInfos$FindSegmentsFile.run(SegmentInfos.java:524)
	at org.apache.lucene.index.SegmentInfos.read(SegmentInfos.java:307)
	at org.apache.lucene.index.IndexWriter.<init>(IndexWriter.java:1093)
	at org.apache.lucene.index.IndexWriter.<init>(IndexWriter.java:887)
	at org.apache.lucene.search.TestSimpleExplanations.testTermQueryMultiSearcherExplain(TestSimpleExplanations.java:320)
	at org.apache.lucene.util.LuceneTestCase.runBare(LuceneTestCase.java:253)


REGRESSION:  org.apache.lucene.search.TestSimpleExplanationsOfNonMatches.testTermQueryMultiSearcherExplain

Error Message:
fileMap

Stack Trace:
java.lang.NoSuchFieldError: fileMap
	at org.apache.lucene.store.MockRAMDirectory.openInput(MockRAMDirectory.java:234)
	at org.apache.lucene.index.SegmentInfos$FindSegmentsFile.run(SegmentInfos.java:591)
	at org.apache.lucene.index.SegmentInfos$FindSegmentsFile.run(SegmentInfos.java:524)
	at org.apache.lucene.index.SegmentInfos.read(SegmentInfos.java:307)
	at org.apache.lucene.index.IndexWriter.<init>(IndexWriter.java:1093)
	at org.apache.lucene.index.IndexWriter.<init>(IndexWriter.java:887)
	at org.apache.lucene.search.TestSimpleExplanations.testTermQueryMultiSearcherExplain(TestSimpleExplanations.java:320)
	at org.apache.lucene.util.LuceneTestCase.runBare(LuceneTestCase.java:253)


REGRESSION:  org.apache.lucene.search.TestTermVectors.test

Error Message:
fileMap

Stack Trace:
java.lang.NoSuchFieldError: fileMap
	at org.apache.lucene.store.MockRAMDirectory.openInput(MockRAMDirectory.java:234)
	at org.apache.lucene.index.SegmentInfos$FindSegmentsFile.run(SegmentInfos.java:591)
	at org.apache.lucene.index.SegmentInfos$FindSegmentsFile.run(SegmentInfos.java:524)
	at org.apache.lucene.index.SegmentInfos.read(SegmentInfos.java:307)
	at org.apache.lucene.index.IndexWriter.<init>(IndexWriter.java:1093)
	at org.apache.lucene.index.IndexWriter.<init>(IndexWriter.java:887)
	at org.apache.lucene.search.TestTermVectors.setUp(TestTermVectors.java:45)
	at org.apache.lucene.util.LuceneTestCase.runBare(LuceneTestCase.java:253)


REGRESSION:  org.apache.lucene.search.TestTermVectors.testTermVectors

Error Message:
fileMap

Stack Trace:
java.lang.NoSuchFieldError: fileMap
	at org.apache.lucene.store.MockRAMDirectory.openInput(MockRAMDirectory.java:234)
	at org.apache.lucene.index.SegmentInfos$FindSegmentsFile.run(SegmentInfos.java:591)
	at org.apache.lucene.index.SegmentInfos$FindSegmentsFile.run(SegmentInfos.java:524)
	at org.apache.lucene.index.SegmentInfos.read(SegmentInfos.java:307)
	at org.apache.lucene.index.IndexWriter.<init>(IndexWriter.java:1093)
	at org.apache.lucene.index.IndexWriter.<init>(IndexWriter.java:887)
	at org.apache.lucene.search.TestTermVectors.setUp(TestTermVectors.java:45)
	at org.apache.lucene.util.LuceneTestCase.runBare(LuceneTestCase.java:253)


REGRESSION:  org.apache.lucene.search.TestTermVectors.testTermVectorsFieldOrder

Error Message:
fileMap

Stack Trace:
java.lang.NoSuchFieldError: fileMap
	at org.apache.lucene.store.MockRAMDirectory.openInput(MockRAMDirectory.java:234)
	at org.apache.lucene.index.SegmentInfos$FindSegmentsFile.run(SegmentInfos.java:591)
	at org.apache.lucene.index.SegmentInfos$FindSegmentsFile.run(SegmentInfos.java:524)
	at org.apache.lucene.index.SegmentInfos.read(SegmentInfos.java:307)
	at org.apache.lucene.index.IndexWriter.<init>(IndexWriter.java:1093)
	at org.apache.lucene.index.IndexWriter.<init>(IndexWriter.java:887)
	at org.apache.lucene.search.TestTermVectors.setUp(TestTermVectors.java:45)
	at org.apache.lucene.util.LuceneTestCase.runBare(LuceneTestCase.java:253)


REGRESSION:  org.apache.lucene.search.TestTermVectors.testTermPositionVectors

Error Message:
fileMap

Stack Trace:
java.lang.NoSuchFieldError: fileMap
	at org.apache.lucene.store.MockRAMDirectory.openInput(MockRAMDirectory.java:234)
	at org.apache.lucene.index.SegmentInfos$FindSegmentsFile.run(SegmentInfos.java:591)
	at org.apache.lucene.index.SegmentInfos$FindSegmentsFile.run(SegmentInfos.java:524)
	at org.apache.lucene.index.SegmentInfos.read(SegmentInfos.java:307)
	at org.apache.lucene.index.IndexWriter.<init>(IndexWriter.java:1093)
	at org.apache.lucene.index.IndexWriter.<init>(IndexWriter.java:887)
	at org.apache.lucene.search.TestTermVectors.setUp(TestTermVectors.java:45)
	at org.apache.lucene.util.LuceneTestCase.runBare(LuceneTestCase.java:253)


REGRESSION:  org.apache.lucene.search.TestTermVectors.testTermOffsetVectors

Error Message:
fileMap

Stack Trace:
java.lang.NoSuchFieldError: fileMap
	at org.apache.lucene.store.MockRAMDirectory.openInput(MockRAMDirectory.java:234)
	at org.apache.lucene.index.SegmentInfos$FindSegmentsFile.run(SegmentInfos.java:591)
	at org.apache.lucene.index.SegmentInfos$FindSegmentsFile.run(SegmentInfos.java:524)
	at org.apache.lucene.index.SegmentInfos.read(SegmentInfos.java:307)
	at org.apache.lucene.index.IndexWriter.<init>(IndexWriter.java:1093)
	at org.apache.lucene.index.IndexWriter.<init>(IndexWriter.java:887)
	at org.apache.lucene.search.TestTermVectors.setUp(TestTermVectors.java:45)
	at org.apache.lucene.util.LuceneTestCase.runBare(LuceneTestCase.java:253)


REGRESSION:  org.apache.lucene.search.TestTermVectors.testKnownSetOfDocuments

Error Message:
fileMap

Stack Trace:
java.lang.NoSuchFieldError: fileMap
	at org.apache.lucene.store.MockRAMDirectory.openInput(MockRAMDirectory.java:234)
	at org.apache.lucene.index.SegmentInfos$FindSegmentsFile.run(SegmentInfos.java:591)
	at org.apache.lucene.index.SegmentInfos$FindSegmentsFile.run(SegmentInfos.java:524)
	at org.apache.lucene.index.SegmentInfos.read(SegmentInfos.java:307)
	at org.apache.lucene.index.IndexWriter.<init>(IndexWriter.java:1093)
	at org.apache.lucene.index.IndexWriter.<init>(IndexWriter.java:887)
	at org.apache.lucene.search.TestTermVectors.setUp(TestTermVectors.java:45)
	at org.apache.lucene.util.LuceneTestCase.runBare(LuceneTestCase.java:253)


REGRESSION:  org.apache.lucene.search.TestTermVectors.testRareVectors

Error Message:
fileMap

Stack Trace:
java.lang.NoSuchFieldError: fileMap
	at org.apache.lucene.store.MockRAMDirectory.openInput(MockRAMDirectory.java:234)
	at org.apache.lucene.index.SegmentInfos$FindSegmentsFile.run(SegmentInfos.java:591)
	at org.apache.lucene.index.SegmentInfos$FindSegmentsFile.run(SegmentInfos.java:524)
	at org.apache.lucene.index.SegmentInfos.read(SegmentInfos.java:307)
	at org.apache.lucene.index.IndexWriter.<init>(IndexWriter.java:1093)
	at org.apache.lucene.index.IndexWriter.<init>(IndexWriter.java:887)
	at org.apache.lucene.search.TestTermVectors.setUp(TestTermVectors.java:45)
	at org.apache.lucene.util.LuceneTestCase.runBare(LuceneTestCase.java:253)


REGRESSION:  org.apache.lucene.search.TestTermVectors.testMixedVectrosVectors

Error Message:
fileMap

Stack Trace:
java.lang.NoSuchFieldError: fileMap
	at org.apache.lucene.store.MockRAMDirectory.openInput(MockRAMDirectory.java:234)
	at org.apache.lucene.index.SegmentInfos$FindSegmentsFile.run(SegmentInfos.java:591)
	at org.apache.lucene.index.SegmentInfos$FindSegmentsFile.run(SegmentInfos.java:524)
	at org.apache.lucene.index.SegmentInfos.read(SegmentInfos.java:307)
	at org.apache.lucene.index.IndexWriter.<init>(IndexWriter.java:1093)
	at org.apache.lucene.index.IndexWriter.<init>(IndexWriter.java:887)
	at org.apache.lucene.search.TestTermVectors.setUp(TestTermVectors.java:45)
	at org.apache.lucene.util.LuceneTestCase.runBare(LuceneTestCase.java:253)


REGRESSION:  org.apache.lucene.search.spans.TestSpans.testNPESpanQuery

Error Message:
fileMap

Stack Trace:
java.lang.NoSuchFieldError: fileMap
	at org.apache.lucene.store.MockRAMDirectory.openInput(MockRAMDirectory.java:234)
	at org.apache.lucene.index.SegmentInfos$FindSegmentsFile.run(SegmentInfos.java:591)
	at org.apache.lucene.index.SegmentInfos$FindSegmentsFile.run(SegmentInfos.java:524)
	at org.apache.lucene.index.SegmentInfos.read(SegmentInfos.java:307)
	at org.apache.lucene.index.IndexWriter.<init>(IndexWriter.java:1093)
	at org.apache.lucene.index.IndexWriter.<init>(IndexWriter.java:914)
	at org.apache.lucene.search.spans.TestSpans.testNPESpanQuery(TestSpans.java:455)
	at org.apache.lucene.util.LuceneTestCase.runBare(LuceneTestCase.java:253)


REGRESSION:  org.apache.lucene.store.TestFileSwitchDirectory.testBasic

Error Message:
fileMap

Stack Trace:
java.lang.NoSuchFieldError: fileMap
	at org.apache.lucene.store.MockRAMDirectory.openInput(MockRAMDirectory.java:234)
	at org.apache.lucene.store.FileSwitchDirectory.openInput(FileSwitchDirectory.java:161)
	at org.apache.lucene.index.SegmentInfos$FindSegmentsFile.run(SegmentInfos.java:591)
	at org.apache.lucene.index.SegmentInfos$FindSegmentsFile.run(SegmentInfos.java:524)
	at org.apache.lucene.index.SegmentInfos.read(SegmentInfos.java:307)
	at org.apache.lucene.index.IndexWriter.<init>(IndexWriter.java:1093)
	at org.apache.lucene.index.IndexWriter.<init>(IndexWriter.java:914)
	at org.apache.lucene.store.TestFileSwitchDirectory.testBasic(TestFileSwitchDirectory.java:44)
	at org.apache.lucene.util.LuceneTestCase.runBare(LuceneTestCase.java:253)


REGRESSION:  org.apache.lucene.store.TestRAMDirectory.testRAMDirectory

Error Message:
fileMap

Stack Trace:
java.lang.NoSuchFieldError: fileMap
	at org.apache.lucene.store.MockRAMDirectory.createOutput(MockRAMDirectory.java:211)
	at org.apache.lucene.store.Directory.copy(Directory.java:224)
	at org.apache.lucene.store.RAMDirectory.<init>(RAMDirectory.java:77)
	at org.apache.lucene.store.RAMDirectory.<init>(RAMDirectory.java:68)
	at org.apache.lucene.store.MockRAMDirectory.<init>(MockRAMDirectory.java:71)
	at org.apache.lucene.store.TestRAMDirectory.testRAMDirectory(TestRAMDirectory.java:74)
	at org.apache.lucene.util.LuceneTestCase.runBare(LuceneTestCase.java:253)


REGRESSION:  org.apache.lucene.store.TestRAMDirectory.testRAMDirectorySize

Error Message:
fileMap

Stack Trace:
java.lang.NoSuchFieldError: fileMap
	at org.apache.lucene.store.MockRAMDirectory.createOutput(MockRAMDirectory.java:211)
	at org.apache.lucene.store.Directory.copy(Directory.java:224)
	at org.apache.lucene.store.RAMDirectory.<init>(RAMDirectory.java:77)
	at org.apache.lucene.store.RAMDirectory.<init>(RAMDirectory.java:68)
	at org.apache.lucene.store.MockRAMDirectory.<init>(MockRAMDirectory.java:71)
	at org.apache.lucene.store.TestRAMDirectory.testRAMDirectorySize(TestRAMDirectory.java:106)
	at org.apache.lucene.util.LuceneTestCase.runBare(LuceneTestCase.java:253)




Build Log (for compile errors):
[...truncated 12174 lines...]



---------------------------------------------------------------------
To unsubscribe, e-mail: dev-unsubscribe@lucene.apache.org
For additional commands, e-mail: dev-help@lucene.apache.org


Mime
View raw message