lucene-dev mailing list archives

Site index · List index
Message view « Date » · « Thread »
Top « Date » · « Thread »
From Apache Hudson Server <hud...@hudson.apache.org>
Subject Lucene-Solr-tests-only-trunk - Build # 1775 - Failure
Date Tue, 23 Nov 2010 18:02:21 GMT
Build: https://hudson.apache.org/hudson/job/Lucene-Solr-tests-only-trunk/1775/

2 tests failed.
REGRESSION:  org.apache.solr.cloud.CloudStateUpdateTest.testCoreRegistration

Error Message:
null

Stack Trace:
org.apache.solr.common.cloud.ZooKeeperException: 
	at org.apache.solr.cloud.ZkController.init(ZkController.java:280)
	at org.apache.solr.cloud.ZkController.<init>(ZkController.java:133)
	at org.apache.solr.core.CoreContainer.initZooKeeper(CoreContainer.java:159)
	at org.apache.solr.core.CoreContainer.load(CoreContainer.java:338)
	at org.apache.solr.core.CoreContainer.load(CoreContainer.java:294)
	at org.apache.solr.core.CoreContainer$Initializer.initialize(CoreContainer.java:243)
	at org.apache.solr.cloud.CloudStateUpdateTest.setUp(CloudStateUpdateTest.java:131)
	at org.apache.lucene.util.LuceneTestCase$LuceneTestCaseRunner.runChild(LuceneTestCase.java:950)
	at org.apache.lucene.util.LuceneTestCase$LuceneTestCaseRunner.runChild(LuceneTestCase.java:888)
Caused by: org.apache.zookeeper.KeeperException$ConnectionLossException: KeeperErrorCode =
ConnectionLoss for /live_nodes
	at org.apache.zookeeper.KeeperException.create(KeeperException.java:90)
	at org.apache.zookeeper.KeeperException.create(KeeperException.java:42)
	at org.apache.zookeeper.ZooKeeper.setData(ZooKeeper.java:1038)
	at org.apache.solr.common.cloud.SolrZkClient.setData(SolrZkClient.java:225)
	at org.apache.solr.common.cloud.SolrZkClient.makePath(SolrZkClient.java:355)
	at org.apache.solr.common.cloud.SolrZkClient.makePath(SolrZkClient.java:309)
	at org.apache.solr.common.cloud.SolrZkClient.makePath(SolrZkClient.java:291)
	at org.apache.solr.common.cloud.SolrZkClient.makePath(SolrZkClient.java:256)
	at org.apache.solr.cloud.ZkController.init(ZkController.java:275)


REGRESSION:  org.apache.solr.schema.TestBinaryField.testSimple

Error Message:
ERROR:unknown field 'data'  ERROR:unknown field 'data'  request: http://localhost:27985/example/update?wt=javabin&version=2

Stack Trace:
org.apache.solr.common.SolrException: ERROR:unknown field 'data'

ERROR:unknown field 'data'

request: http://localhost:27985/example/update?wt=javabin&version=2
	at org.apache.solr.client.solrj.impl.CommonsHttpSolrServer.request(CommonsHttpSolrServer.java:435)
	at org.apache.solr.client.solrj.impl.CommonsHttpSolrServer.request(CommonsHttpSolrServer.java:244)
	at org.apache.solr.client.solrj.request.AbstractUpdateRequest.process(AbstractUpdateRequest.java:105)
	at org.apache.solr.client.solrj.SolrServer.add(SolrServer.java:65)
	at org.apache.solr.schema.TestBinaryField.testSimple(TestBinaryField.java:87)
	at org.apache.lucene.util.LuceneTestCase$LuceneTestCaseRunner.runChild(LuceneTestCase.java:950)
	at org.apache.lucene.util.LuceneTestCase$LuceneTestCaseRunner.runChild(LuceneTestCase.java:888)




Build Log (for compile errors):
[...truncated 8880 lines...]



---------------------------------------------------------------------
To unsubscribe, e-mail: dev-unsubscribe@lucene.apache.org
For additional commands, e-mail: dev-help@lucene.apache.org


Mime
View raw message