lucene-dev mailing list archives

Site index · List index
Message view « Date » · « Thread »
Top « Date » · « Thread »
From Apache Hudson Server <hud...@hudson.apache.org>
Subject Lucene-Solr-tests-only-trunk - Build # 1862 - Still Failing
Date Fri, 26 Nov 2010 02:03:11 GMT
Build: https://hudson.apache.org/hudson/job/Lucene-Solr-tests-only-trunk/1862/

3 tests failed.
REGRESSION:  org.apache.solr.cloud.CloudStateUpdateTest.testCoreRegistration

Error Message:
null

Stack Trace:
org.apache.solr.common.cloud.ZooKeeperException: 
	at org.apache.solr.core.CoreContainer.load(CoreContainer.java:441)
	at org.apache.solr.core.CoreContainer.load(CoreContainer.java:294)
	at org.apache.solr.core.CoreContainer$Initializer.initialize(CoreContainer.java:243)
	at org.apache.solr.cloud.CloudStateUpdateTest.setUp(CloudStateUpdateTest.java:112)
	at org.apache.lucene.util.LuceneTestCase$LuceneTestCaseRunner.runChild(LuceneTestCase.java:950)
	at org.apache.lucene.util.LuceneTestCase$LuceneTestCaseRunner.runChild(LuceneTestCase.java:888)
Caused by: org.apache.zookeeper.KeeperException$ConnectionLossException: KeeperErrorCode =
ConnectionLoss for /collections
	at org.apache.zookeeper.KeeperException.create(KeeperException.java:90)
	at org.apache.zookeeper.KeeperException.create(KeeperException.java:42)
	at org.apache.zookeeper.ZooKeeper.getChildren(ZooKeeper.java:1243)
	at org.apache.solr.common.cloud.SolrZkClient.getChildren(SolrZkClient.java:199)
	at org.apache.solr.common.cloud.ZkStateReader.makeShardZkNodeWatches(ZkStateReader.java:184)
	at org.apache.solr.core.CoreContainer.load(CoreContainer.java:430)


FAILED:  junit.framework.TestSuite.org.apache.solr.cloud.CloudStateUpdateTest

Error Message:
ERROR: SolrIndexSearcher opens=9 closes=8

Stack Trace:
junit.framework.AssertionFailedError: ERROR: SolrIndexSearcher opens=9 closes=8
	at org.apache.solr.SolrTestCaseJ4.endTrackingSearchers(SolrTestCaseJ4.java:128)
	at org.apache.solr.SolrTestCaseJ4.deleteCore(SolrTestCaseJ4.java:302)
	at org.apache.solr.SolrTestCaseJ4.afterClassSolrTestCase(SolrTestCaseJ4.java:79)


REGRESSION:  org.apache.solr.schema.TestBinaryField.testSimple

Error Message:
Severe errors in solr configuration.  Check your log files for more detailed information on
what may be wrong.  ------------------------------------------------------------- org.apache.solr.common.cloud.ZooKeeperException:
  at org.apache.solr.core.CoreContainer.register(CoreContainer.java:530)  at org.apache.solr.core.CoreContainer.load(CoreContainer.java:413)
 at org.apache.solr.core.CoreContainer.load(CoreContainer.java:294)  at org.apache.solr.core.CoreContainer$Initializer.initialize(CoreContainer.java:243)
 at org.apache.solr.cloud.CloudStateUpdateTest.setUp(CloudStateUpdateTest.java:112)  at sun.reflect.GeneratedMethodAccessor1.invoke(Unknown
Source)  at sun.reflect.DelegatingMethodAccessorImpl.invoke(DelegatingMethodAccessorImpl.java:43)
 at java.lang.reflect.Method.invoke(Method.java:616)  at org.junit.runners.model.FrameworkMethod$1.runReflectiveCall(FrameworkMethod.java:44)
 at org.junit.internal.runners.model.ReflectiveCallable.run(ReflectiveCallable.java:15)  at
org.junit.runners.model.FrameworkMethod.invokeExplosively(FrameworkMethod.java:41)  at org.junit.internal.runners.statements.RunBefores.evaluate(RunBefores.java:27)
 at org.junit.internal.runners.statements.RunAfters.evaluate(RunAfters.java:31)  at org.junit.runners.BlockJUnit4ClassRunner.runChild(BlockJUnit4ClassRunner.java:76)
 at org.apache.lucene.util.LuceneTestCase$LuceneTestCaseRunner.runChild(LuceneTestCase.java:950)
 at org.apache.lucene.util.LuceneTestCase$LuceneTestCaseRunner.runChild(LuceneTestCase.java:888)
 at org.junit.runners.ParentRunner$3.run(ParentRunner.java:193)  at org.junit.runners.ParentRunner$1.schedule(ParentRunner.java:52)
 at org.junit.runners.ParentRunner.runChildren(ParentRunner.java:191)  at org.junit.runners.ParentRunner.access$000(ParentRunner.java:42)
 at org.junit.runners.ParentRunner$2.evaluate(ParentRunner.java:184)  at org.junit.internal.runners.statements.RunBefores.evaluate(RunBefores.java:28)
 at org.junit.internal.runners.statements.RunAfters.evaluate(RunAfters.java:31)  at org.junit.runners.ParentRunn
 Severe errors in solr configuration.  Check your log files for more detailed information
on what may be wrong.  ------------------------------------------------------------- org.apache.solr.common.cloud.ZooKeeperException:
  at org.apache.solr.core.CoreContainer.register(CoreContainer.java:530)  at org.apache.solr.core.CoreContainer.load(CoreContainer.java:413)
 at org.apache.solr.core.CoreContainer.load(CoreContainer.java:294)  at org.apache.solr.core.CoreContainer$Initializer.initialize(CoreContainer.java:243)
 at org.apache.solr.cloud.CloudStateUpdateTest.setUp(CloudStateUpdateTest.java:112)  at sun.reflect.GeneratedMethodAccessor1.invoke(Unknown
Source)  at sun.reflect.DelegatingMethodAccessorImpl.invoke(DelegatingMethodAccessorImpl.java:43)
 at java.lang.reflect.Method.invoke(Method.java:616)  at org.junit.runners.model.FrameworkMethod$1.runReflectiveCall(FrameworkMethod.java:44)
 at org.junit.internal.runners.model.ReflectiveCallable.run(ReflectiveCallable.java:15)  at
org.junit.runners.model.FrameworkMethod.invokeExplosively(FrameworkMethod.java:41)  at org.junit.internal.runners.statements.RunBefores.evaluate(RunBefores.java:27)
 at org.junit.internal.runners.statements.RunAfters.evaluate(RunAfters.java:31)  at org.junit.runners.BlockJUnit4ClassRunner.runChild(BlockJUnit4ClassRunner.java:76)
 at org.apache.lucene.util.LuceneTestCase$LuceneTestCaseRunner.runChild(LuceneTestCase.java:950)
 at org.apache.lucene.util.LuceneTestCase$LuceneTestCaseRunner.runChild(LuceneTestCase.java:888)
 at org.junit.runners.ParentRunner$3.run(ParentRunner.java:193)  at org.junit.runners.ParentRunner$1.schedule(ParentRunner.java:52)
 at org.junit.runners.ParentRunner.runChildren(ParentRunner.java:191)  at org.junit.runners.ParentRunner.access$000(ParentRunner.java:42)
 at org.junit.runners.ParentRunner$2.evaluate(ParentRunner.java:184)  at org.junit.internal.runners.statements.RunBefores.evaluate(RunBefores.java:28)
 at org.junit.internal.runners.statements.RunAfters.evaluate(RunAfters.java:31)  at org.junit.runners.ParentRunn
 request: http://localhost:32817/example/update?wt=javabin&version=2

Stack Trace:


request: http://localhost:32817/example/update?wt=javabin&version=2
	at org.apache.solr.client.solrj.impl.CommonsHttpSolrServer.request(CommonsHttpSolrServer.java:435)
	at org.apache.solr.client.solrj.impl.CommonsHttpSolrServer.request(CommonsHttpSolrServer.java:244)
	at org.apache.solr.client.solrj.request.AbstractUpdateRequest.process(AbstractUpdateRequest.java:105)
	at org.apache.solr.client.solrj.SolrServer.add(SolrServer.java:65)
	at org.apache.solr.schema.TestBinaryField.testSimple(TestBinaryField.java:87)
	at org.apache.lucene.util.LuceneTestCase$LuceneTestCaseRunner.runChild(LuceneTestCase.java:950)
	at org.apache.lucene.util.LuceneTestCase$LuceneTestCaseRunner.runChild(LuceneTestCase.java:888)




Build Log (for compile errors):
[...truncated 8977 lines...]



---------------------------------------------------------------------
To unsubscribe, e-mail: dev-unsubscribe@lucene.apache.org
For additional commands, e-mail: dev-help@lucene.apache.org


Mime
View raw message