lucene-dev mailing list archives

Site index · List index
Message view « Date » · « Thread »
Top « Date » · « Thread »
From Apache Hudson Server <hud...@hudson.apache.org>
Subject Lucene-Solr-tests-only-trunk - Build # 1811 - Still Failing
Date Wed, 24 Nov 2010 20:04:24 GMT
Build: https://hudson.apache.org/hudson/job/Lucene-Solr-tests-only-trunk/1811/

6 tests failed.
REGRESSION:  org.apache.solr.TestGroupingSearch.testGroupAPI

Error Message:
null

Stack Trace:
junit.framework.AssertionFailedError
	at org.apache.lucene.util.LuceneTestCase$LuceneTestCaseRunner.runChild(LuceneTestCase.java:950)
	at org.apache.lucene.util.LuceneTestCase$LuceneTestCaseRunner.runChild(LuceneTestCase.java:888)
	at org.apache.solr.search.Grouping$CommandFunc.createMainResponse(Grouping.java:254)
	at org.apache.solr.search.Grouping$CommandFunc.finish(Grouping.java:198)
	at org.apache.solr.search.Grouping.execute(Grouping.java:392)
	at org.apache.solr.handler.component.QueryComponent.process(QueryComponent.java:393)
	at org.apache.solr.handler.component.SearchHandler.handleRequestBody(SearchHandler.java:231)
	at org.apache.solr.handler.RequestHandlerBase.handleRequest(RequestHandlerBase.java:131)
	at org.apache.solr.core.SolrCore.execute(SolrCore.java:1359)
	at org.apache.solr.util.TestHarness.queryAndResponse(TestHarness.java:348)
	at org.apache.solr.util.TestHarness.query(TestHarness.java:331)
	at org.apache.solr.util.TestHarness.query(TestHarness.java:316)
	at org.apache.solr.SolrTestCaseJ4.assertJQ(SolrTestCaseJ4.java:408)
	at org.apache.solr.TestGroupingSearch.testGroupAPI(TestGroupingSearch.java:332)


REGRESSION:  org.apache.solr.cloud.ZkControllerTest.testUploadToCloud

Error Message:
KeeperErrorCode = ConnectionLoss for /configs/config1/schema-binaryfield.xml

Stack Trace:
org.apache.zookeeper.KeeperException$ConnectionLossException: KeeperErrorCode = ConnectionLoss
for /configs/config1/schema-binaryfield.xml
	at org.apache.zookeeper.KeeperException.create(KeeperException.java:90)
	at org.apache.zookeeper.KeeperException.create(KeeperException.java:42)
	at org.apache.zookeeper.ZooKeeper.create(ZooKeeper.java:637)
	at org.apache.solr.common.cloud.SolrZkClient.makePath(SolrZkClient.java:348)
	at org.apache.solr.common.cloud.SolrZkClient.makePath(SolrZkClient.java:309)
	at org.apache.solr.common.cloud.SolrZkClient.makePath(SolrZkClient.java:291)
	at org.apache.solr.common.cloud.SolrZkClient.makePath(SolrZkClient.java:256)
	at org.apache.solr.common.cloud.SolrZkClient.setData(SolrZkClient.java:385)
	at org.apache.solr.common.cloud.SolrZkClient.setData(SolrZkClient.java:411)
	at org.apache.solr.cloud.ZkController.uploadToZK(ZkController.java:520)
	at org.apache.solr.cloud.ZkControllerTest.testUploadToCloud(ZkControllerTest.java:192)
	at org.apache.lucene.util.LuceneTestCase$LuceneTestCaseRunner.runChild(LuceneTestCase.java:950)
	at org.apache.lucene.util.LuceneTestCase$LuceneTestCaseRunner.runChild(LuceneTestCase.java:888)


REGRESSION:  org.apache.solr.core.TestXIncludeConfig.testXInclude

Error Message:
org.apache.solr.common.cloud.ZooKeeperException: 

Stack Trace:
java.lang.RuntimeException: org.apache.solr.common.cloud.ZooKeeperException: 
	at org.apache.solr.util.TestHarness.<init>(TestHarness.java:152)
	at org.apache.solr.util.TestHarness.<init>(TestHarness.java:134)
	at org.apache.solr.util.TestHarness.<init>(TestHarness.java:124)
	at org.apache.solr.util.AbstractSolrTestCase.setUp(AbstractSolrTestCase.java:121)
	at org.apache.solr.core.TestXIncludeConfig.setUp(TestXIncludeConfig.java:34)
	at org.apache.lucene.util.LuceneTestCase$LuceneTestCaseRunner.runChild(LuceneTestCase.java:950)
	at org.apache.lucene.util.LuceneTestCase$LuceneTestCaseRunner.runChild(LuceneTestCase.java:888)
Caused by: org.apache.solr.common.cloud.ZooKeeperException: 
	at org.apache.solr.core.CoreContainer.register(CoreContainer.java:530)
	at org.apache.solr.util.TestHarness$Initializer.initialize(TestHarness.java:191)
	at org.apache.solr.util.TestHarness.<init>(TestHarness.java:139)
Caused by: org.apache.zookeeper.KeeperException$ConnectionLossException: KeeperErrorCode =
ConnectionLoss for /collections/collection1/shards/lucene.zones.apache.org:null_solr_/lucene.zones.apache.org:null_solr_
	at org.apache.zookeeper.KeeperException.create(KeeperException.java:90)
	at org.apache.zookeeper.KeeperException.create(KeeperException.java:42)
	at org.apache.zookeeper.ZooKeeper.setData(ZooKeeper.java:1038)
	at org.apache.solr.common.cloud.SolrZkClient.setData(SolrZkClient.java:225)
	at org.apache.solr.common.cloud.SolrZkClient.setData(SolrZkClient.java:389)
	at org.apache.solr.cloud.ZkController.register(ZkController.java:477)
	at org.apache.solr.core.CoreContainer.register(CoreContainer.java:521)


FAILED:  org.apache.solr.cloud.BasicDistributedZkTest.testDistribSearch

Error Message:
Severe errors in solr configuration.  Check your log files for more detailed information on
what may be wrong.  ------------------------------------------------------------- org.apache.solr.common.cloud.ZooKeeperException:
  at org.apache.solr.core.CoreContainer.register(CoreContainer.java:530)  at org.apache.solr.core.CoreContainer.load(CoreContainer.java:413)
 at org.apache.solr.core.CoreContainer.load(CoreContainer.java:294)  at org.apache.solr.core.CoreContainer$Initializer.initialize(CoreContainer.java:243)
 at org.apache.solr.servlet.SolrDispatchFilter.init(SolrDispatchFilter.java:86)  at org.mortbay.jetty.servlet.FilterHolder.doStart(FilterHolder.java:97)
 at org.mortbay.component.AbstractLifeCycle.start(AbstractLifeCycle.java:50)  at org.mortbay.jetty.servlet.ServletHandler.initialize(ServletHandler.java:662)
 at org.mortbay.jetty.servlet.ServletHandler.updateMappings(ServletHandler.java:1053)  at
org.mortbay.jetty.servlet.ServletHandler.setFilterMappings(ServletHandler.java:1089)  at org.mortbay.jetty.servlet.ServletHandler.addFilterWithMapping(ServletHandler.java:889)
 at org.mortbay.jetty.servlet.ServletHandler.addFilterWithMapping(ServletHandler.java:844)
 at org.mortbay.jetty.servlet.Context.addFilter(Context.java:207)  at org.apache.solr.client.solrj.embedded.JettySolrRunner$1.lifeCycleStarted(JettySolrRunner.java:97)
 at org.mortbay.component.AbstractLifeCycle.setStarted(AbstractLifeCycle.java:140)  at org.mortbay.component.AbstractLifeCycle.start(AbstractLifeCycle.java:52)
 at org.apache.solr.client.solrj.embedded.JettySolrRunner.start(JettySolrRunner.java:122)
 at org.apache.solr.client.solrj.embedded.JettySolrRunner.start(JettySolrRunner.java:117)
 at org.apache.solr.BaseDistributedSearchTestCase.createJetty(BaseDistributedSearchTestCase.java:215)
 at org.apache.solr.BaseDistributedSearchTestCase.createJetty(BaseDistributedSearchTestCase.java:206)
 at org.apache.solr.cloud.AbstractDistributedZkTestCase.createServers(AbstractDistributedZkTestCase.java:63)
 at org.apache.solr.BaseDistributedSearch  Severe errors in solr configuration.  Check your
log files for more detailed information on what may be wrong.  -------------------------------------------------------------
org.apache.solr.common.cloud.ZooKeeperException:   at org.apache.solr.core.CoreContainer.register(CoreContainer.java:530)
 at org.apache.solr.core.CoreContainer.load(CoreContainer.java:413)  at org.apache.solr.core.CoreContainer.load(CoreContainer.java:294)
 at org.apache.solr.core.CoreContainer$Initializer.initialize(CoreContainer.java:243)  at
org.apache.solr.servlet.SolrDispatchFilter.init(SolrDispatchFilter.java:86)  at org.mortbay.jetty.servlet.FilterHolder.doStart(FilterHolder.java:97)
 at org.mortbay.component.AbstractLifeCycle.start(AbstractLifeCycle.java:50)  at org.mortbay.jetty.servlet.ServletHandler.initialize(ServletHandler.java:662)
 at org.mortbay.jetty.servlet.ServletHandler.updateMappings(ServletHandler.java:1053)  at
org.mortbay.jetty.servlet.ServletHandler.setFilterMappings(ServletHandler.java:1089)  at org.mortbay.jetty.servlet.ServletHandler.addFilterWithMapping(ServletHandler.java:889)
 at org.mortbay.jetty.servlet.ServletHandler.addFilterWithMapping(ServletHandler.java:844)
 at org.mortbay.jetty.servlet.Context.addFilter(Context.java:207)  at org.apache.solr.client.solrj.embedded.JettySolrRunner$1.lifeCycleStarted(JettySolrRunner.java:97)
 at org.mortbay.component.AbstractLifeCycle.setStarted(AbstractLifeCycle.java:140)  at org.mortbay.component.AbstractLifeCycle.start(AbstractLifeCycle.java:52)
 at org.apache.solr.client.solrj.embedded.JettySolrRunner.start(JettySolrRunner.java:122)
 at org.apache.solr.client.solrj.embedded.JettySolrRunner.start(JettySolrRunner.java:117)
 at org.apache.solr.BaseDistributedSearchTestCase.createJetty(BaseDistributedSearchTestCase.java:215)
 at org.apache.solr.BaseDistributedSearchTestCase.createJetty(BaseDistributedSearchTestCase.java:206)
 at org.apache.solr.cloud.AbstractDistributedZkTestCase.createServers(AbstractDistributedZkTestCase.java:63)
 at org.apache.solr.BaseDistributedSearch  request: http://localhost:55234/solr/update?wt=javabin&version=2

Stack Trace:


request: http://localhost:55234/solr/update?wt=javabin&version=2
	at org.apache.solr.client.solrj.impl.CommonsHttpSolrServer.request(CommonsHttpSolrServer.java:435)
	at org.apache.solr.client.solrj.impl.CommonsHttpSolrServer.request(CommonsHttpSolrServer.java:244)
	at org.apache.solr.client.solrj.request.AbstractUpdateRequest.process(AbstractUpdateRequest.java:105)
	at org.apache.solr.client.solrj.SolrServer.deleteByQuery(SolrServer.java:111)
	at org.apache.solr.BaseDistributedSearchTestCase.del(BaseDistributedSearchTestCase.java:277)
	at org.apache.solr.cloud.BasicDistributedZkTest.doTest(BasicDistributedZkTest.java:86)
	at org.apache.solr.BaseDistributedSearchTestCase.testDistribSearch(BaseDistributedSearchTestCase.java:562)
	at org.apache.lucene.util.LuceneTestCase$LuceneTestCaseRunner.runChild(LuceneTestCase.java:950)
	at org.apache.lucene.util.LuceneTestCase$LuceneTestCaseRunner.runChild(LuceneTestCase.java:888)


FAILED:  org.apache.solr.schema.TestBinaryField.testSimple

Error Message:
Severe errors in solr configuration.  Check your log files for more detailed information on
what may be wrong.  ------------------------------------------------------------- org.apache.solr.common.cloud.ZooKeeperException:
Specified config does not exist in ZooKeeper:conf1  at org.apache.solr.cloud.ZkController.readConfigName(ZkController.java:430)
 at org.apache.solr.core.CoreContainer.create(CoreContainer.java:591)  at org.apache.solr.core.CoreContainer.load(CoreContainer.java:412)
 at org.apache.solr.core.CoreContainer$Initializer.initialize(CoreContainer.java:246)  at
org.apache.solr.servlet.SolrDispatchFilter.init(SolrDispatchFilter.java:86)  at org.mortbay.jetty.servlet.FilterHolder.doStart(FilterHolder.java:97)
 at org.mortbay.component.AbstractLifeCycle.start(AbstractLifeCycle.java:50)  at org.mortbay.jetty.servlet.ServletHandler.initialize(ServletHandler.java:662)
 at org.mortbay.jetty.servlet.ServletHandler.updateMappings(ServletHandler.java:1053)  at
org.mortbay.jetty.servlet.ServletHandler.setFilterMappings(ServletHandler.java:1089)  at org.mortbay.jetty.servlet.ServletHandler.addFilterWithMapping(ServletHandler.java:889)
 at org.mortbay.jetty.servlet.ServletHandler.addFilterWithMapping(ServletHandler.java:844)
 at org.mortbay.jetty.servlet.Context.addFilter(Context.java:207)  at org.apache.solr.client.solrj.embedded.JettySolrRunner$1.lifeCycleStarted(JettySolrRunner.java:97)
 at org.mortbay.component.AbstractLifeCycle.setStarted(AbstractLifeCycle.java:140)  at org.mortbay.component.AbstractLifeCycle.start(AbstractLifeCycle.java:52)
 at org.apache.solr.client.solrj.embedded.JettySolrRunner.start(JettySolrRunner.java:122)
 at org.apache.solr.client.solrj.embedded.JettySolrRunner.start(JettySolrRunner.java:117)
 at org.apache.solr.schema.TestBinaryField.setUp(TestBinaryField.java:71)  at sun.reflect.GeneratedMethodAccessor1.invoke(Unknown
Source)  at sun.reflect.DelegatingMethodAccessorImpl.invoke(DelegatingMethodAccessorImpl.java:43)
 at java.lang.reflect.Method.invoke(Method.java:616)  at org.junit.ru  Severe errors in solr
configuration.  Check your log files for more detailed information on what may be wrong. 
------------------------------------------------------------- org.apache.solr.common.cloud.ZooKeeperException:
Specified config does not exist in ZooKeeper:conf1  at org.apache.solr.cloud.ZkController.readConfigName(ZkController.java:430)
 at org.apache.solr.core.CoreContainer.create(CoreContainer.java:591)  at org.apache.solr.core.CoreContainer.load(CoreContainer.java:412)
 at org.apache.solr.core.CoreContainer$Initializer.initialize(CoreContainer.java:246)  at
org.apache.solr.servlet.SolrDispatchFilter.init(SolrDispatchFilter.java:86)  at org.mortbay.jetty.servlet.FilterHolder.doStart(FilterHolder.java:97)
 at org.mortbay.component.AbstractLifeCycle.start(AbstractLifeCycle.java:50)  at org.mortbay.jetty.servlet.ServletHandler.initialize(ServletHandler.java:662)
 at org.mortbay.jetty.servlet.ServletHandler.updateMappings(ServletHandler.java:1053)  at
org.mortbay.jetty.servlet.ServletHandler.setFilterMappings(ServletHandler.java:1089)  at org.mortbay.jetty.servlet.ServletHandler.addFilterWithMapping(ServletHandler.java:889)
 at org.mortbay.jetty.servlet.ServletHandler.addFilterWithMapping(ServletHandler.java:844)
 at org.mortbay.jetty.servlet.Context.addFilter(Context.java:207)  at org.apache.solr.client.solrj.embedded.JettySolrRunner$1.lifeCycleStarted(JettySolrRunner.java:97)
 at org.mortbay.component.AbstractLifeCycle.setStarted(AbstractLifeCycle.java:140)  at org.mortbay.component.AbstractLifeCycle.start(AbstractLifeCycle.java:52)
 at org.apache.solr.client.solrj.embedded.JettySolrRunner.start(JettySolrRunner.java:122)
 at org.apache.solr.client.solrj.embedded.JettySolrRunner.start(JettySolrRunner.java:117)
 at org.apache.solr.schema.TestBinaryField.setUp(TestBinaryField.java:71)  at sun.reflect.GeneratedMethodAccessor1.invoke(Unknown
Source)  at sun.reflect.DelegatingMethodAccessorImpl.invoke(DelegatingMethodAccessorImpl.java:43)
 at java.lang.reflect.Method.invoke(Method.java:616)  at org.junit.ru  request: http://localhost:37939/example/update?wt=javabin&version=2

Stack Trace:


request: http://localhost:37939/example/update?wt=javabin&version=2
	at org.apache.solr.client.solrj.impl.CommonsHttpSolrServer.request(CommonsHttpSolrServer.java:435)
	at org.apache.solr.client.solrj.impl.CommonsHttpSolrServer.request(CommonsHttpSolrServer.java:244)
	at org.apache.solr.client.solrj.request.AbstractUpdateRequest.process(AbstractUpdateRequest.java:105)
	at org.apache.solr.client.solrj.SolrServer.add(SolrServer.java:65)
	at org.apache.solr.schema.TestBinaryField.testSimple(TestBinaryField.java:87)
	at org.apache.lucene.util.LuceneTestCase$LuceneTestCaseRunner.runChild(LuceneTestCase.java:950)
	at org.apache.lucene.util.LuceneTestCase$LuceneTestCaseRunner.runChild(LuceneTestCase.java:888)


FAILED:  org.apache.solr.cloud.CloudStateUpdateTest.testCoreRegistration

Error Message:
KeeperErrorCode = ConnectionLoss for /collections/control_collection/shards

Stack Trace:
org.apache.zookeeper.KeeperException$ConnectionLossException: KeeperErrorCode = ConnectionLoss
for /collections/control_collection/shards
	at org.apache.zookeeper.KeeperException.create(KeeperException.java:90)
	at org.apache.zookeeper.KeeperException.create(KeeperException.java:42)
	at org.apache.zookeeper.ZooKeeper.create(ZooKeeper.java:637)
	at org.apache.solr.common.cloud.SolrZkClient.makePath(SolrZkClient.java:348)
	at org.apache.solr.common.cloud.SolrZkClient.makePath(SolrZkClient.java:309)
	at org.apache.solr.common.cloud.SolrZkClient.makePath(SolrZkClient.java:291)
	at org.apache.solr.common.cloud.SolrZkClient.makePath(SolrZkClient.java:261)
	at org.apache.solr.cloud.AbstractZkTestCase.buildZooKeeper(AbstractZkTestCase.java:82)
	at org.apache.solr.cloud.CloudStateUpdateTest.setUp(CloudStateUpdateTest.java:85)
	at org.apache.lucene.util.LuceneTestCase$LuceneTestCaseRunner.runChild(LuceneTestCase.java:950)
	at org.apache.lucene.util.LuceneTestCase$LuceneTestCaseRunner.runChild(LuceneTestCase.java:888)




Build Log (for compile errors):
[...truncated 9473 lines...]



---------------------------------------------------------------------
To unsubscribe, e-mail: dev-unsubscribe@lucene.apache.org
For additional commands, e-mail: dev-help@lucene.apache.org


Mime
View raw message