lucene-dev mailing list archives

Site index · List index
Message view « Date » · « Thread »
Top « Date » · « Thread »
From Apache Hudson Server <hud...@hudson.apache.org>
Subject Lucene-Solr-tests-only-trunk - Build # 840 - Failure
Date Mon, 01 Nov 2010 05:18:34 GMT
Build: http://hudson.zones.apache.org/hudson/job/Lucene-Solr-tests-only-trunk/840/

11 tests failed.
REGRESSION:  org.apache.solr.cloud.BasicDistributedZkTest.testDistribSearch

Error Message:
Severe errors in solr configuration.  Check your log files for more detailed information on
what may be wrong.  ------------------------------------------------------------- org.apache.solr.common.cloud.ZooKeeperException:
  at org.apache.solr.core.CoreContainer.register(CoreContainer.java:530)  at org.apache.solr.core.CoreContainer.load(CoreContainer.java:413)
 at org.apache.solr.core.CoreContainer.load(CoreContainer.java:294)  at org.apache.solr.core.CoreContainer$Initializer.initialize(CoreContainer.java:243)
 at org.apache.solr.servlet.SolrDispatchFilter.init(SolrDispatchFilter.java:86)  at org.mortbay.jetty.servlet.FilterHolder.doStart(FilterHolder.java:97)
 at org.mortbay.component.AbstractLifeCycle.start(AbstractLifeCycle.java:50)  at org.mortbay.jetty.servlet.ServletHandler.initialize(ServletHandler.java:662)
 at org.mortbay.jetty.servlet.ServletHandler.updateMappings(ServletHandler.java:1053)  at
org.mortbay.jetty.servlet.ServletHandler.setFilterMappings(ServletHandler.java:1089)  at org.mortbay.jetty.servlet.ServletHandler.addFilterWithMapping(ServletHandler.java:889)
 at org.mortbay.jetty.servlet.ServletHandler.addFilterWithMapping(ServletHandler.java:844)
 at org.mortbay.jetty.servlet.Context.addFilter(Context.java:207)  at org.apache.solr.client.solrj.embedded.JettySolrRunner$1.lifeCycleStarted(JettySolrRunner.java:97)
 at org.mortbay.component.AbstractLifeCycle.setStarted(AbstractLifeCycle.java:140)  at org.mortbay.component.AbstractLifeCycle.start(AbstractLifeCycle.java:52)
 at org.apache.solr.client.solrj.embedded.JettySolrRunner.start(JettySolrRunner.java:122)
 at org.apache.solr.client.solrj.embedded.JettySolrRunner.start(JettySolrRunner.java:117)
 at org.apache.solr.BaseDistributedSearchTestCase.createJetty(BaseDistributedSearchTestCase.java:215)
 at org.apache.solr.BaseDistributedSearchTestCase.createJetty(BaseDistributedSearchTestCase.java:206)
 at org.apache.solr.cloud.AbstractDistributedZkTestCase.createServers(AbstractDistributedZkTestCase.java:63)
 at org.apache.solr.BaseDistributedSearch  Severe errors in solr configuration.  Check your
log files for more detailed information on what may be wrong.  -------------------------------------------------------------
org.apache.solr.common.cloud.ZooKeeperException:   at org.apache.solr.core.CoreContainer.register(CoreContainer.java:530)
 at org.apache.solr.core.CoreContainer.load(CoreContainer.java:413)  at org.apache.solr.core.CoreContainer.load(CoreContainer.java:294)
 at org.apache.solr.core.CoreContainer$Initializer.initialize(CoreContainer.java:243)  at
org.apache.solr.servlet.SolrDispatchFilter.init(SolrDispatchFilter.java:86)  at org.mortbay.jetty.servlet.FilterHolder.doStart(FilterHolder.java:97)
 at org.mortbay.component.AbstractLifeCycle.start(AbstractLifeCycle.java:50)  at org.mortbay.jetty.servlet.ServletHandler.initialize(ServletHandler.java:662)
 at org.mortbay.jetty.servlet.ServletHandler.updateMappings(ServletHandler.java:1053)  at
org.mortbay.jetty.servlet.ServletHandler.setFilterMappings(ServletHandler.java:1089)  at org.mortbay.jetty.servlet.ServletHandler.addFilterWithMapping(ServletHandler.java:889)
 at org.mortbay.jetty.servlet.ServletHandler.addFilterWithMapping(ServletHandler.java:844)
 at org.mortbay.jetty.servlet.Context.addFilter(Context.java:207)  at org.apache.solr.client.solrj.embedded.JettySolrRunner$1.lifeCycleStarted(JettySolrRunner.java:97)
 at org.mortbay.component.AbstractLifeCycle.setStarted(AbstractLifeCycle.java:140)  at org.mortbay.component.AbstractLifeCycle.start(AbstractLifeCycle.java:52)
 at org.apache.solr.client.solrj.embedded.JettySolrRunner.start(JettySolrRunner.java:122)
 at org.apache.solr.client.solrj.embedded.JettySolrRunner.start(JettySolrRunner.java:117)
 at org.apache.solr.BaseDistributedSearchTestCase.createJetty(BaseDistributedSearchTestCase.java:215)
 at org.apache.solr.BaseDistributedSearchTestCase.createJetty(BaseDistributedSearchTestCase.java:206)
 at org.apache.solr.cloud.AbstractDistributedZkTestCase.createServers(AbstractDistributedZkTestCase.java:63)
 at org.apache.solr.BaseDistributedSearch  request: http://localhost:29102/solr/update?wt=javabin&version=2

Stack Trace:


request: http://localhost:29102/solr/update?wt=javabin&version=2
	at org.apache.solr.client.solrj.impl.CommonsHttpSolrServer.request(CommonsHttpSolrServer.java:435)
	at org.apache.solr.client.solrj.impl.CommonsHttpSolrServer.request(CommonsHttpSolrServer.java:244)
	at org.apache.solr.client.solrj.request.AbstractUpdateRequest.process(AbstractUpdateRequest.java:105)
	at org.apache.solr.client.solrj.SolrServer.deleteByQuery(SolrServer.java:111)
	at org.apache.solr.BaseDistributedSearchTestCase.del(BaseDistributedSearchTestCase.java:277)
	at org.apache.solr.cloud.BasicDistributedZkTest.doTest(BasicDistributedZkTest.java:86)
	at org.apache.solr.BaseDistributedSearchTestCase.testDistribSearch(BaseDistributedSearchTestCase.java:562)
	at org.apache.lucene.util.LuceneTestCase$LuceneTestCaseRunner.runChild(LuceneTestCase.java:878)
	at org.apache.lucene.util.LuceneTestCase$LuceneTestCaseRunner.runChild(LuceneTestCase.java:844)


REGRESSION:  org.apache.solr.cloud.CloudStateUpdateTest.testCoreRegistration

Error Message:
null

Stack Trace:
org.apache.solr.common.cloud.ZooKeeperException: 
	at org.apache.solr.cloud.ZkController.init(ZkController.java:280)
	at org.apache.solr.cloud.ZkController.<init>(ZkController.java:133)
	at org.apache.solr.core.CoreContainer.initZooKeeper(CoreContainer.java:159)
	at org.apache.solr.core.CoreContainer.load(CoreContainer.java:338)
	at org.apache.solr.core.CoreContainer.load(CoreContainer.java:294)
	at org.apache.solr.core.CoreContainer$Initializer.initialize(CoreContainer.java:243)
	at org.apache.solr.cloud.CloudStateUpdateTest.setUp(CloudStateUpdateTest.java:122)
	at org.apache.lucene.util.LuceneTestCase$LuceneTestCaseRunner.runChild(LuceneTestCase.java:878)
	at org.apache.lucene.util.LuceneTestCase$LuceneTestCaseRunner.runChild(LuceneTestCase.java:844)
Caused by: org.apache.zookeeper.KeeperException$ConnectionLossException: KeeperErrorCode =
ConnectionLoss for /live_nodes
	at org.apache.zookeeper.KeeperException.create(KeeperException.java:90)
	at org.apache.zookeeper.KeeperException.create(KeeperException.java:42)
	at org.apache.zookeeper.ZooKeeper.setData(ZooKeeper.java:1038)
	at org.apache.solr.common.cloud.SolrZkClient.setData(SolrZkClient.java:225)
	at org.apache.solr.common.cloud.SolrZkClient.makePath(SolrZkClient.java:355)
	at org.apache.solr.common.cloud.SolrZkClient.makePath(SolrZkClient.java:309)
	at org.apache.solr.common.cloud.SolrZkClient.makePath(SolrZkClient.java:291)
	at org.apache.solr.common.cloud.SolrZkClient.makePath(SolrZkClient.java:256)
	at org.apache.solr.cloud.ZkController.init(ZkController.java:275)


REGRESSION:  org.apache.solr.handler.TestReplicationHandler.testReplicateAfterWrite2Slave

Error Message:
http://localhost:29207/solr/replication?command=disableReplication

Stack Trace:
java.io.FileNotFoundException: http://localhost:29207/solr/replication?command=disableReplication
	at sun.net.www.protocol.http.HttpURLConnection.getInputStream(HttpURLConnection.java:1267)
	at java.net.URL.openStream(URL.java:1029)
	at org.apache.solr.handler.TestReplicationHandler.testReplicateAfterWrite2Slave(TestReplicationHandler.java:173)
	at org.apache.lucene.util.LuceneTestCase$LuceneTestCaseRunner.runChild(LuceneTestCase.java:878)
	at org.apache.lucene.util.LuceneTestCase$LuceneTestCaseRunner.runChild(LuceneTestCase.java:844)


REGRESSION:  org.apache.solr.handler.TestReplicationHandler.testIndexAndConfigReplication

Error Message:
expected:<498> but was:<499>

Stack Trace:
junit.framework.AssertionFailedError: expected:<498> but was:<499>
	at org.apache.lucene.util.LuceneTestCase$LuceneTestCaseRunner.runChild(LuceneTestCase.java:878)
	at org.apache.lucene.util.LuceneTestCase$LuceneTestCaseRunner.runChild(LuceneTestCase.java:844)
	at org.apache.solr.handler.TestReplicationHandler.testIndexAndConfigReplication(TestReplicationHandler.java:240)


REGRESSION:  org.apache.solr.handler.TestReplicationHandler.testStopPoll

Error Message:
expected:<497> but was:<0>

Stack Trace:
junit.framework.AssertionFailedError: expected:<497> but was:<0>
	at org.apache.lucene.util.LuceneTestCase$LuceneTestCaseRunner.runChild(LuceneTestCase.java:878)
	at org.apache.lucene.util.LuceneTestCase$LuceneTestCaseRunner.runChild(LuceneTestCase.java:844)
	at org.apache.solr.handler.TestReplicationHandler.testStopPoll(TestReplicationHandler.java:303)


REGRESSION:  org.apache.solr.handler.TestReplicationHandler.testSnapPullWithMasterUrl

Error Message:
http://localhost:45650/solr/replication?command=fetchindex&masterUrl=http://localhost:29207/solr/replication

Stack Trace:
java.io.FileNotFoundException: http://localhost:45650/solr/replication?command=fetchindex&masterUrl=http://localhost:29207/solr/replication
	at sun.net.www.protocol.http.HttpURLConnection.getInputStream(HttpURLConnection.java:1267)
	at java.net.URL.openStream(URL.java:1029)
	at org.apache.solr.handler.TestReplicationHandler.testSnapPullWithMasterUrl(TestReplicationHandler.java:375)
	at org.apache.lucene.util.LuceneTestCase$LuceneTestCaseRunner.runChild(LuceneTestCase.java:878)
	at org.apache.lucene.util.LuceneTestCase$LuceneTestCaseRunner.runChild(LuceneTestCase.java:844)


REGRESSION:  org.apache.solr.handler.TestReplicationHandler.testReplicateAfterStartup

Error Message:
expected:<495> but was:<0>

Stack Trace:
junit.framework.AssertionFailedError: expected:<495> but was:<0>
	at org.apache.lucene.util.LuceneTestCase$LuceneTestCaseRunner.runChild(LuceneTestCase.java:878)
	at org.apache.lucene.util.LuceneTestCase$LuceneTestCaseRunner.runChild(LuceneTestCase.java:844)
	at org.apache.solr.handler.TestReplicationHandler.testReplicateAfterStartup(TestReplicationHandler.java:433)


REGRESSION:  org.apache.solr.handler.TestReplicationHandler.testIndexAndConfigAliasReplication

Error Message:
expected:<494> but was:<0>

Stack Trace:
junit.framework.AssertionFailedError: expected:<494> but was:<0>
	at org.apache.lucene.util.LuceneTestCase$LuceneTestCaseRunner.runChild(LuceneTestCase.java:878)
	at org.apache.lucene.util.LuceneTestCase$LuceneTestCaseRunner.runChild(LuceneTestCase.java:844)
	at org.apache.solr.handler.TestReplicationHandler.testIndexAndConfigAliasReplication(TestReplicationHandler.java:471)


REGRESSION:  org.apache.solr.handler.TestReplicationHandler.testBackup

Error Message:
http://localhost:59269/solr/replication?command=details

Stack Trace:
junit.framework.AssertionFailedError: http://localhost:59269/solr/replication?command=details
	at org.apache.lucene.util.LuceneTestCase$LuceneTestCaseRunner.runChild(LuceneTestCase.java:878)
	at org.apache.lucene.util.LuceneTestCase$LuceneTestCaseRunner.runChild(LuceneTestCase.java:844)
	at org.apache.solr.handler.TestReplicationHandler.testBackup(TestReplicationHandler.java:592)


FAILED:  junit.framework.TestSuite.org.apache.solr.handler.component.QueryElevationComponentTest

Error Message:
org.apache.solr.common.SolrException: Error initializing QueryElevationComponent.

Stack Trace:
java.lang.RuntimeException: org.apache.solr.common.SolrException: Error initializing QueryElevationComponent.
	at org.apache.solr.util.TestHarness.<init>(TestHarness.java:152)
	at org.apache.solr.util.TestHarness.<init>(TestHarness.java:134)
	at org.apache.solr.util.TestHarness.<init>(TestHarness.java:124)
	at org.apache.solr.SolrTestCaseJ4.initCore(SolrTestCaseJ4.java:233)
	at org.apache.solr.SolrTestCaseJ4.initCore(SolrTestCaseJ4.java:96)
	at org.apache.solr.SolrTestCaseJ4.initCore(SolrTestCaseJ4.java:84)
	at org.apache.solr.handler.component.QueryElevationComponentTest.beforeClass(QueryElevationComponentTest.java:50)
Caused by: org.apache.solr.common.SolrException: Error initializing QueryElevationComponent.
	at org.apache.solr.handler.component.QueryElevationComponent.inform(QueryElevationComponent.java:212)
	at org.apache.solr.core.SolrResourceLoader.inform(SolrResourceLoader.java:539)
	at org.apache.solr.core.SolrCore.<init>(SolrCore.java:592)
	at org.apache.solr.util.TestHarness$Initializer.initialize(TestHarness.java:190)
	at org.apache.solr.util.TestHarness.<init>(TestHarness.java:139)
Caused by: java.io.FileNotFoundException: /usr/home/hudson/hudson-slave/workspace/Lucene-Solr-tests-only-trunk/checkout/solr/build/test-results/temp/4/solrtest-QueryElevationComponentTest-1288588632746/elevate.xml
(No such file or directory)
	at java.io.FileInputStream.open(Native Method)
	at java.io.FileInputStream.<init>(FileInputStream.java:137)
	at org.apache.solr.util.VersionedFile.getLatestFile(VersionedFile.java:79)
	at org.apache.solr.handler.component.QueryElevationComponent.getElevationMap(QueryElevationComponent.java:232)
	at org.apache.solr.handler.component.QueryElevationComponent.inform(QueryElevationComponent.java:204)


FAILED:  junit.framework.TestSuite.org.apache.solr.handler.component.QueryElevationComponentTest

Error Message:
ERROR: SolrIndexSearcher opens=1 closes=0

Stack Trace:
junit.framework.AssertionFailedError: ERROR: SolrIndexSearcher opens=1 closes=0
	at org.apache.solr.SolrTestCaseJ4.endTrackingSearchers(SolrTestCaseJ4.java:114)
	at org.apache.solr.SolrTestCaseJ4.deleteCore(SolrTestCaseJ4.java:288)
	at org.apache.solr.SolrTestCaseJ4.afterClassSolrTestCase(SolrTestCaseJ4.java:65)




Build Log (for compile errors):
[...truncated 9016 lines...]



---------------------------------------------------------------------
To unsubscribe, e-mail: dev-unsubscribe@lucene.apache.org
For additional commands, e-mail: dev-help@lucene.apache.org


Mime
View raw message