lucene-dev mailing list archives

Site index · List index
Message view « Date » · « Thread »
Top « Date » · « Thread »
From Apache Hudson Server <hud...@hudson.apache.org>
Subject Lucene-Solr-tests-only-3.x - Build # 1034 - Failure
Date Sat, 06 Nov 2010 09:20:06 GMT
Build: https://hudson.apache.org/hudson/job/Lucene-Solr-tests-only-3.x/1034/

7 tests failed.
REGRESSION:  org.apache.solr.handler.TestReplicationHandler.testIndexAndConfigReplication

Error Message:
Jetty/Solr unresponsive

Stack Trace:
java.lang.RuntimeException: Jetty/Solr unresponsive
	at org.apache.solr.client.solrj.embedded.JettySolrRunner.waitForSolr(JettySolrRunner.java:149)
	at org.apache.solr.client.solrj.embedded.JettySolrRunner.start(JettySolrRunner.java:111)
	at org.apache.solr.client.solrj.embedded.JettySolrRunner.start(JettySolrRunner.java:103)
	at org.apache.solr.handler.TestReplicationHandler.createJetty(TestReplicationHandler.java:110)
	at org.apache.solr.handler.TestReplicationHandler.testIndexAndConfigReplication(TestReplicationHandler.java:260)
	at org.apache.lucene.util.LuceneTestCase$LuceneTestCaseRunner.runChild(LuceneTestCase.java:779)
	at org.apache.lucene.util.LuceneTestCase$LuceneTestCaseRunner.runChild(LuceneTestCase.java:745)
Caused by: java.io.IOException: Server returned HTTP response code: 500 for URL: http://localhost:31330/solr/select?q={!raw+f=junit_test_query}ping
	at sun.net.www.protocol.http.HttpURLConnection.getInputStream(HttpURLConnection.java:1269)
	at java.net.URL.openStream(URL.java:1029)
	at org.apache.solr.client.solrj.embedded.JettySolrRunner.waitForSolr(JettySolrRunner.java:137)


REGRESSION:  org.apache.solr.handler.TestReplicationHandler.testStopPoll

Error Message:
java.net.ConnectException: Operation timed out

Stack Trace:
org.apache.solr.client.solrj.SolrServerException: java.net.ConnectException: Operation timed
out
	at org.apache.solr.client.solrj.impl.CommonsHttpSolrServer.request(CommonsHttpSolrServer.java:483)
	at org.apache.solr.client.solrj.impl.CommonsHttpSolrServer.request(CommonsHttpSolrServer.java:244)
	at org.apache.solr.client.solrj.request.QueryRequest.process(QueryRequest.java:89)
	at org.apache.solr.client.solrj.SolrServer.query(SolrServer.java:118)
	at org.apache.solr.handler.TestReplicationHandler.query(TestReplicationHandler.java:142)
	at org.apache.solr.handler.TestReplicationHandler.clearIndexWithReplication(TestReplicationHandler.java:85)
	at org.apache.solr.handler.TestReplicationHandler.testStopPoll(TestReplicationHandler.java:285)
	at org.apache.lucene.util.LuceneTestCase$LuceneTestCaseRunner.runChild(LuceneTestCase.java:779)
	at org.apache.lucene.util.LuceneTestCase$LuceneTestCaseRunner.runChild(LuceneTestCase.java:745)
Caused by: java.net.ConnectException: Operation timed out
	at java.net.PlainSocketImpl.socketConnect(Native Method)
	at java.net.AbstractPlainSocketImpl.doConnect(AbstractPlainSocketImpl.java:310)
	at java.net.AbstractPlainSocketImpl.connectToAddress(AbstractPlainSocketImpl.java:176)
	at java.net.AbstractPlainSocketImpl.connect(AbstractPlainSocketImpl.java:163)
	at java.net.SocksSocketImpl.connect(SocksSocketImpl.java:384)
	at java.net.Socket.connect(Socket.java:546)
	at java.net.Socket.connect(Socket.java:495)
	at java.net.Socket.<init>(Socket.java:392)
	at java.net.Socket.<init>(Socket.java:266)
	at org.apache.commons.httpclient.protocol.DefaultProtocolSocketFactory.createSocket(DefaultProtocolSocketFactory.java:80)
	at org.apache.commons.httpclient.protocol.DefaultProtocolSocketFactory.createSocket(DefaultProtocolSocketFactory.java:122)
	at org.apache.commons.httpclient.HttpConnection.open(HttpConnection.java:707)
	at org.apache.commons.httpclient.MultiThreadedHttpConnectionManager$HttpConnectionAdapter.open(MultiThreadedHttpConnectionManager.java:1361)
	at org.apache.commons.httpclient.HttpMethodDirector.executeWithRetry(HttpMethodDirector.java:387)
	at org.apache.commons.httpclient.HttpMethodDirector.executeMethod(HttpMethodDirector.java:171)
	at org.apache.commons.httpclient.HttpClient.executeMethod(HttpClient.java:397)
	at org.apache.commons.httpclient.HttpClient.executeMethod(HttpClient.java:323)
	at org.apache.solr.client.solrj.impl.CommonsHttpSolrServer.request(CommonsHttpSolrServer.java:427)


REGRESSION:  org.apache.solr.handler.TestReplicationHandler.testSnapPullWithMasterUrl

Error Message:
Jetty/Solr unresponsive

Stack Trace:
java.lang.RuntimeException: Jetty/Solr unresponsive
	at org.apache.solr.client.solrj.embedded.JettySolrRunner.waitForSolr(JettySolrRunner.java:149)
	at org.apache.solr.client.solrj.embedded.JettySolrRunner.start(JettySolrRunner.java:111)
	at org.apache.solr.client.solrj.embedded.JettySolrRunner.start(JettySolrRunner.java:103)
	at org.apache.solr.handler.TestReplicationHandler.createJetty(TestReplicationHandler.java:110)
	at org.apache.solr.handler.TestReplicationHandler.testSnapPullWithMasterUrl(TestReplicationHandler.java:357)
	at org.apache.lucene.util.LuceneTestCase$LuceneTestCaseRunner.runChild(LuceneTestCase.java:779)
	at org.apache.lucene.util.LuceneTestCase$LuceneTestCaseRunner.runChild(LuceneTestCase.java:745)
Caused by: java.io.IOException: Server returned HTTP response code: 500 for URL: http://localhost:19426/solr/select?q={!raw+f=junit_test_query}ping
	at sun.net.www.protocol.http.HttpURLConnection.getInputStream(HttpURLConnection.java:1269)
	at java.net.URL.openStream(URL.java:1029)
	at org.apache.solr.client.solrj.embedded.JettySolrRunner.waitForSolr(JettySolrRunner.java:137)


REGRESSION:  org.apache.solr.handler.TestReplicationHandler.testReplicateAfterStartup

Error Message:
java.net.ConnectException: Operation timed out

Stack Trace:
org.apache.solr.client.solrj.SolrServerException: java.net.ConnectException: Operation timed
out
	at org.apache.solr.client.solrj.impl.CommonsHttpSolrServer.request(CommonsHttpSolrServer.java:483)
	at org.apache.solr.client.solrj.impl.CommonsHttpSolrServer.request(CommonsHttpSolrServer.java:244)
	at org.apache.solr.client.solrj.request.AbstractUpdateRequest.process(AbstractUpdateRequest.java:105)
	at org.apache.solr.client.solrj.SolrServer.deleteByQuery(SolrServer.java:110)
	at org.apache.solr.handler.TestReplicationHandler.testReplicateAfterStartup(TestReplicationHandler.java:405)
	at org.apache.lucene.util.LuceneTestCase$LuceneTestCaseRunner.runChild(LuceneTestCase.java:779)
	at org.apache.lucene.util.LuceneTestCase$LuceneTestCaseRunner.runChild(LuceneTestCase.java:745)
Caused by: java.net.ConnectException: Operation timed out
	at java.net.PlainSocketImpl.socketConnect(Native Method)
	at java.net.AbstractPlainSocketImpl.doConnect(AbstractPlainSocketImpl.java:310)
	at java.net.AbstractPlainSocketImpl.connectToAddress(AbstractPlainSocketImpl.java:176)
	at java.net.AbstractPlainSocketImpl.connect(AbstractPlainSocketImpl.java:163)
	at java.net.SocksSocketImpl.connect(SocksSocketImpl.java:384)
	at java.net.Socket.connect(Socket.java:546)
	at java.net.Socket.connect(Socket.java:495)
	at java.net.Socket.<init>(Socket.java:392)
	at java.net.Socket.<init>(Socket.java:266)
	at org.apache.commons.httpclient.protocol.DefaultProtocolSocketFactory.createSocket(DefaultProtocolSocketFactory.java:80)
	at org.apache.commons.httpclient.protocol.DefaultProtocolSocketFactory.createSocket(DefaultProtocolSocketFactory.java:122)
	at org.apache.commons.httpclient.HttpConnection.open(HttpConnection.java:707)
	at org.apache.commons.httpclient.MultiThreadedHttpConnectionManager$HttpConnectionAdapter.open(MultiThreadedHttpConnectionManager.java:1361)
	at org.apache.commons.httpclient.HttpMethodDirector.executeWithRetry(HttpMethodDirector.java:387)
	at org.apache.commons.httpclient.HttpMethodDirector.executeMethod(HttpMethodDirector.java:171)
	at org.apache.commons.httpclient.HttpClient.executeMethod(HttpClient.java:397)
	at org.apache.commons.httpclient.HttpClient.executeMethod(HttpClient.java:323)
	at org.apache.solr.client.solrj.impl.CommonsHttpSolrServer.request(CommonsHttpSolrServer.java:427)


REGRESSION:  org.apache.solr.handler.TestReplicationHandler.testIndexAndConfigAliasReplication

Error Message:
java.net.ConnectException: Operation timed out

Stack Trace:
org.apache.solr.client.solrj.SolrServerException: java.net.ConnectException: Operation timed
out
	at org.apache.solr.client.solrj.impl.CommonsHttpSolrServer.request(CommonsHttpSolrServer.java:483)
	at org.apache.solr.client.solrj.impl.CommonsHttpSolrServer.request(CommonsHttpSolrServer.java:244)
	at org.apache.solr.client.solrj.request.QueryRequest.process(QueryRequest.java:89)
	at org.apache.solr.client.solrj.SolrServer.query(SolrServer.java:118)
	at org.apache.solr.handler.TestReplicationHandler.query(TestReplicationHandler.java:142)
	at org.apache.solr.handler.TestReplicationHandler.clearIndexWithReplication(TestReplicationHandler.java:85)
	at org.apache.solr.handler.TestReplicationHandler.testIndexAndConfigAliasReplication(TestReplicationHandler.java:455)
	at org.apache.lucene.util.LuceneTestCase$LuceneTestCaseRunner.runChild(LuceneTestCase.java:779)
	at org.apache.lucene.util.LuceneTestCase$LuceneTestCaseRunner.runChild(LuceneTestCase.java:745)
Caused by: java.net.ConnectException: Operation timed out
	at java.net.PlainSocketImpl.socketConnect(Native Method)
	at java.net.AbstractPlainSocketImpl.doConnect(AbstractPlainSocketImpl.java:310)
	at java.net.AbstractPlainSocketImpl.connectToAddress(AbstractPlainSocketImpl.java:176)
	at java.net.AbstractPlainSocketImpl.connect(AbstractPlainSocketImpl.java:163)
	at java.net.SocksSocketImpl.connect(SocksSocketImpl.java:384)
	at java.net.Socket.connect(Socket.java:546)
	at java.net.Socket.connect(Socket.java:495)
	at java.net.Socket.<init>(Socket.java:392)
	at java.net.Socket.<init>(Socket.java:266)
	at org.apache.commons.httpclient.protocol.DefaultProtocolSocketFactory.createSocket(DefaultProtocolSocketFactory.java:80)
	at org.apache.commons.httpclient.protocol.DefaultProtocolSocketFactory.createSocket(DefaultProtocolSocketFactory.java:122)
	at org.apache.commons.httpclient.HttpConnection.open(HttpConnection.java:707)
	at org.apache.commons.httpclient.MultiThreadedHttpConnectionManager$HttpConnectionAdapter.open(MultiThreadedHttpConnectionManager.java:1361)
	at org.apache.commons.httpclient.HttpMethodDirector.executeWithRetry(HttpMethodDirector.java:387)
	at org.apache.commons.httpclient.HttpMethodDirector.executeMethod(HttpMethodDirector.java:171)
	at org.apache.commons.httpclient.HttpClient.executeMethod(HttpClient.java:397)
	at org.apache.commons.httpclient.HttpClient.executeMethod(HttpClient.java:323)
	at org.apache.solr.client.solrj.impl.CommonsHttpSolrServer.request(CommonsHttpSolrServer.java:427)


REGRESSION:  org.apache.solr.handler.TestReplicationHandler.testBackup

Error Message:
Jetty/Solr unresponsive

Stack Trace:
java.lang.RuntimeException: Jetty/Solr unresponsive
	at org.apache.solr.client.solrj.embedded.JettySolrRunner.waitForSolr(JettySolrRunner.java:149)
	at org.apache.solr.client.solrj.embedded.JettySolrRunner.start(JettySolrRunner.java:111)
	at org.apache.solr.client.solrj.embedded.JettySolrRunner.start(JettySolrRunner.java:103)
	at org.apache.solr.handler.TestReplicationHandler.createJetty(TestReplicationHandler.java:110)
	at org.apache.solr.handler.TestReplicationHandler.testBackup(TestReplicationHandler.java:530)
	at org.apache.lucene.util.LuceneTestCase$LuceneTestCaseRunner.runChild(LuceneTestCase.java:779)
	at org.apache.lucene.util.LuceneTestCase$LuceneTestCaseRunner.runChild(LuceneTestCase.java:745)
Caused by: java.io.IOException: Server returned HTTP response code: 500 for URL: http://localhost:21240/solr/select?q={!raw+f=junit_test_query}ping
	at sun.net.www.protocol.http.HttpURLConnection.getInputStream(HttpURLConnection.java:1269)
	at java.net.URL.openStream(URL.java:1029)
	at org.apache.solr.client.solrj.embedded.JettySolrRunner.waitForSolr(JettySolrRunner.java:137)


REGRESSION:  org.apache.solr.schema.BadIndexSchemaTest.testSevereErrorsForDuplicateNames

Error Message:
expected:<3> but was:<6>

Stack Trace:
junit.framework.AssertionFailedError: expected:<3> but was:<6>
	at org.apache.lucene.util.LuceneTestCase$LuceneTestCaseRunner.runChild(LuceneTestCase.java:779)
	at org.apache.lucene.util.LuceneTestCase$LuceneTestCaseRunner.runChild(LuceneTestCase.java:745)
	at org.apache.solr.schema.BadIndexSchemaTest.testSevereErrorsForDuplicateNames(BadIndexSchemaTest.java:71)




Build Log (for compile errors):
[...truncated 10411 lines...]



---------------------------------------------------------------------
To unsubscribe, e-mail: dev-unsubscribe@lucene.apache.org
For additional commands, e-mail: dev-help@lucene.apache.org


Mime
View raw message