Here we seem to have a configuration problem:

 

    [junit] Testsuite: org.apache.solr.MinimalSchemaTest

    [junit] Testcase: testAllConfiguredHandlers(org.apache.solr.MinimalSchemaTest):   Caused an ERROR

    [junit] exception w/handler: '/admin/system'

    [junit] java.lang.RuntimeException: exception w/handler: '/admin/system'

    [junit]               at org.apache.solr.MinimalSchemaTest.testAllConfiguredHandlers(MinimalSchemaTest.java:122)

    [junit]               at org.apache.lucene.util.LuceneTestCase$LuceneTestCaseRunner.runChild(LuceneTestCase.java:693)

    [junit]               at org.apache.lucene.util.LuceneTestCase$LuceneTestCaseRunner.runChild(LuceneTestCase.java:666)

    [junit] Caused by: java.lang.RuntimeException: Exception during query

    [junit]               at org.apache.solr.SolrTestCaseJ4.assertQ(SolrTestCaseJ4.java:339)

    [junit]               at org.apache.solr.MinimalSchemaTest.testAllConfiguredHandlers(MinimalSchemaTest.java:115)

    [junit] Caused by: java.net.UnknownHostException: lucene2.apache.org: lucene2.apache.org

    [junit]              at java.net.InetAddress.getLocalHost(InetAddress.java:1346)

    [junit]               at org.apache.solr.handler.admin.SystemInfoHandler.getCoreInfo(SystemInfoHandler.java:82)

    [junit]               at org.apache.solr.handler.admin.SystemInfoHandler.handleRequestBody(SystemInfoHandler.java:64)

    [junit]               at org.apache.solr.handler.RequestHandlerBase.handleRequest(RequestHandlerBase.java:131)

    [junit]               at org.apache.solr.core.SolrCore.execute(SolrCore.java:1322)

    [junit]               at org.apache.solr.util.TestHarness.queryAndResponse(TestHarness.java:334)

    [junit]               at org.apache.solr.util.TestHarness.query(TestHarness.java:321)

    [junit]               at org.apache.solr.util.TestHarness.query(TestHarness.java:307)

    [junit]               at org.apache.solr.SolrTestCaseJ4.assertQ(SolrTestCaseJ4.java:317)

    [junit]

    [junit]

    [junit] Tests run: 3, Failures: 0, Errors: 1, Time elapsed: 0.356 sec

 

The Hudson machine's network setting seem to be mixed up, I'll ask infra!

 

Uwe

 

-----

Uwe Schindler

H.-H.-Meier-Allee 63, D-28213 Bremen

http://www.thetaphi.de

eMail: uwe@thetaphi.de

 

 

> -----Original Message-----

> From: Apache Hudson Server [mailto:hudson@hudson.apache.org]

> Sent: Saturday, October 02, 2010 10:47 AM

> To: dev@lucene.apache.org

> Subject: Build failed in Hudson: Solr-3.x #120

>

> See <https://hudson.apache.org/hudson/job/Solr-3.x/120/changes>

>

> Changes:

>

> [koji] SOLR-1297: fix sort by function parsing (merge 1003107 and part of

> 997870,998707(JSONTestUtil.java) to pass TestFunctionQuery)

>

> [koji] SOLR-2133: check garbage after func(s), allow parsing comma delimited

> list of functions (merge 1001318)

>

> [koji] SOLR-2128: full param substitution for function queries (merge 1000000)

>

> [hossman] SOLR-2135: merge r1003703 from trunk

>

> [uschindler] Enable unchecked warnings: we have now only some violations in

> contrib and the recently introduced ones by Ryan. As we want to get rid of

> them (the contrib ones seem to be easy), I switch it globally on.

>

> [mikemccand] LUCENE-2678: prevent false failure due to fast GC

>

> [mikemccand] LUCENE-2676: disable reader pooling for this test case since that

> causes added disk usage

>

> [uschindler] for clover runs we can disable the test repetitions, its simply too

> slow. For clover the number of runs is simply useless, as the code coverage

> (should) not really change.

> Its better to have more loops in the main tests when clover runs fine.

>

> [uschindler] prepare hudson on new machine, maven support is included in ant

> installation, so dir not needed (TODO: remove)

>

> [koji] SOLR-2110: merge #995264, #995286, #995557 from trunk

>

> ------------------------------------------

> [...truncated 6284 lines...]

>     [junit] Tests run: 3, Failures: 0, Errors: 0, Time elapsed: 0.483 sec

>     [junit]

>     [junit] Testsuite: org.apache.solr.handler.JsonLoaderTest

>     [junit] Tests run: 1, Failures: 0, Errors: 0, Time elapsed: 0.021 sec

>     [junit]

>     [junit] Testsuite: org.apache.solr.handler.MoreLikeThisHandlerTest

>     [junit] Tests run: 1, Failures: 0, Errors: 0, Time elapsed: 0.496 sec

>     [junit]

>     [junit] Testsuite: org.apache.solr.handler.SpellCheckerRequestHandlerTest

>     [junit] Tests run: 5, Failures: 0, Errors: 0, Time elapsed: 0.847 sec

>     [junit]

>     [junit] Testsuite: org.apache.solr.handler.StandardRequestHandlerTest

>     [junit] Tests run: 1, Failures: 0, Errors: 0, Time elapsed: 0.506 sec

>     [junit]

>     [junit] Testsuite: org.apache.solr.handler.TestCSVLoader

>     [junit] Tests run: 4, Failures: 0, Errors: 0, Time elapsed: 1.143 sec

>     [junit]

>     [junit] Testsuite: org.apache.solr.handler.TestReplicationHandler

>     [junit] Tests run: 7, Failures: 0, Errors: 0, Time elapsed: 23.172 sec

>     [junit]

>     [junit] Testsuite: org.apache.solr.handler.XmlUpdateRequestHandlerTest

>     [junit] Tests run: 1, Failures: 0, Errors: 0, Time elapsed: 0.649 sec

>     [junit]

>     [junit] Testsuite: org.apache.solr.handler.admin.LukeRequestHandlerTest

>     [junit] Tests run: 1, Failures: 0, Errors: 0, Time elapsed: 0.677 sec

>     [junit]

>     [junit] Testsuite: org.apache.solr.handler.admin.SystemInfoHandlerTest

>     [junit] Tests run: 1, Failures: 0, Errors: 0, Time elapsed: 0.009 sec

>     [junit]

>     [junit] Testsuite:

> org.apache.solr.handler.component.DistributedSpellCheckComponentTest

>     [junit] Tests run: 1, Failures: 0, Errors: 0, Time elapsed: 7.673 sec

>     [junit]

>     [junit] Testsuite:

> org.apache.solr.handler.component.DistributedTermsComponentTest

>     [junit] Tests run: 1, Failures: 0, Errors: 0, Time elapsed: 7.254 sec

>     [junit]

>     [junit] Testsuite:

> org.apache.solr.handler.component.QueryElevationComponentTest

>     [junit] Tests run: 4, Failures: 0, Errors: 0, Time elapsed: 0.752 sec

>     [junit]

>     [junit] Testsuite: org.apache.solr.handler.component.SearchHandlerTest

>     [junit] Tests run: 1, Failures: 0, Errors: 0, Time elapsed: 0.613 sec

>     [junit]

>     [junit] Testsuite:

> org.apache.solr.handler.component.SpellCheckComponentTest

>     [junit] Tests run: 10, Failures: 0, Errors: 0, Time elapsed: 0.951 sec

>     [junit]

>     [junit] Testsuite: org.apache.solr.handler.component.StatsComponentTest

>     [junit] Tests run: 1, Failures: 0, Errors: 0, Time elapsed: 2.721 sec

>     [junit]

>     [junit] Testsuite:

> org.apache.solr.handler.component.TermVectorComponentTest

>     [junit] Tests run: 5, Failures: 0, Errors: 0, Time elapsed: 0.627 sec

>     [junit]

>     [junit] Testsuite: org.apache.solr.handler.component.TermsComponentTest

>     [junit] Tests run: 13, Failures: 0, Errors: 0, Time elapsed: 0.58 sec

>     [junit]

>     [junit] Testsuite: org.apache.solr.highlight.FastVectorHighlighterTest

>     [junit] Tests run: 2, Failures: 0, Errors: 0, Time elapsed: 0.496 sec

>     [junit]

>     [junit] Testsuite: org.apache.solr.highlight.HighlighterConfigTest

>     [junit] Tests run: 1, Failures: 0, Errors: 0, Time elapsed: 0.422 sec

>     [junit]

>     [junit] Testsuite: org.apache.solr.highlight.HighlighterTest

>     [junit] Tests run: 23, Failures: 0, Errors: 0, Time elapsed: 1.625 sec

>     [junit]

>     [junit] Testsuite: org.apache.solr.request.JSONWriterTest

>     [junit] Tests run: 3, Failures: 0, Errors: 0, Time elapsed: 0.662 sec

>     [junit]

>     [junit] Testsuite: org.apache.solr.request.SimpleFacetsTest

>     [junit] Tests run: 7, Failures: 0, Errors: 0, Time elapsed: 3.406 sec

>     [junit]

>     [junit] Testsuite: org.apache.solr.request.TestBinaryResponseWriter

>     [junit] Tests run: 1, Failures: 0, Errors: 0, Time elapsed: 0.454 sec

>     [junit]

>     [junit] Testsuite: org.apache.solr.request.TestFaceting

>     [junit] Tests run: 3, Failures: 0, Errors: 0, Time elapsed: 4.115 sec

>     [junit]

>     [junit] Testsuite: org.apache.solr.request.TestWriterPerf

>     [junit] Tests run: 1, Failures: 0, Errors: 0, Time elapsed: 0.771 sec

>     [junit]

>     [junit] ------------- Standard Output ---------------

>     [junit] writer xml, size=7211, encodeRate=76, decodeRate=285

>     [junit] writer json, size=4497, encodeRate=500, decodeRate=N/A

>     [junit] writer javabin, size=2006, encodeRate=N/A, decodeRate=N/A

>     [junit] ------------- ---------------- ---------------

>     [junit] Testsuite: org.apache.solr.response.TestCSVResponseWriter

>     [junit] Tests run: 1, Failures: 0, Errors: 0, Time elapsed: 0.72 sec

>     [junit]

>     [junit] Testsuite: org.apache.solr.schema.BadIndexSchemaTest

>     [junit] Tests run: 1, Failures: 0, Errors: 0, Time elapsed: 0.162 sec

>     [junit]

>     [junit] Testsuite: org.apache.solr.schema.CopyFieldTest

>     [junit] Tests run: 6, Failures: 0, Errors: 0, Time elapsed: 0.411 sec

>     [junit]

>     [junit] Testsuite: org.apache.solr.schema.DateFieldTest

>     [junit] Tests run: 6, Failures: 0, Errors: 0, Time elapsed: 0.016 sec

>     [junit]

>     [junit] Testsuite: org.apache.solr.schema.IndexSchemaTest

>     [junit] Tests run: 5, Failures: 0, Errors: 0, Time elapsed: 0.511 sec

>     [junit]

>     [junit] Testsuite: org.apache.solr.schema.LegacyDateFieldTest

>     [junit] Tests run: 4, Failures: 0, Errors: 0, Time elapsed: 0.012 sec

>     [junit]

>     [junit] Testsuite: org.apache.solr.schema.NotRequiredUniqueKeyTest

>     [junit] Tests run: 1, Failures: 0, Errors: 0, Time elapsed: 0.166 sec

>     [junit]

>     [junit] Testsuite: org.apache.solr.schema.PolyFieldTest

>     [junit] Tests run: 4, Failures: 0, Errors: 0, Time elapsed: 0.571 sec

>     [junit]

>     [junit] Testsuite: org.apache.solr.schema.RequiredFieldsTest

>     [junit] Tests run: 3, Failures: 0, Errors: 0, Time elapsed: 0.529 sec

>     [junit]

>     [junit] Testsuite: org.apache.solr.schema.TestBinaryField

>     [junit] Tests run: 1, Failures: 0, Errors: 0, Time elapsed: 0.267 sec

>     [junit]

>     [junit] Testsuite: org.apache.solr.schema.UUIDFieldTest

>     [junit] Tests run: 1, Failures: 0, Errors: 0, Time elapsed: 0.007 sec

>     [junit]

>     [junit] Testsuite: org.apache.solr.search.FunctionQParserTest

>     [junit] Tests run: 1, Failures: 0, Errors: 0, Time elapsed: 0.189 sec

>     [junit]

>     [junit] Testsuite: org.apache.solr.search.QueryParsingTest

>     [junit] Tests run: 2, Failures: 0, Errors: 0, Time elapsed: 1.299 sec

>     [junit]

>     [junit] Testsuite: org.apache.solr.search.SpatialFilterTest

>     [junit] Tests run: 3, Failures: 0, Errors: 0, Time elapsed: 0.964 sec

>     [junit]

>     [junit] Testsuite: org.apache.solr.search.TestDocSet

>     [junit] Tests run: 2, Failures: 0, Errors: 0, Time elapsed: 0.729 sec

>     [junit]

>     [junit] Testsuite: org.apache.solr.search.TestExtendedDismaxParser

>     [junit] Tests run: 1, Failures: 0, Errors: 0, Time elapsed: 0.697 sec

>     [junit]

>     [junit] Testsuite: org.apache.solr.search.TestFastLRUCache

>     [junit] Tests run: 2, Failures: 0, Errors: 0, Time elapsed: 0.011 sec

>     [junit]

>     [junit] Testsuite: org.apache.solr.search.TestIndexSearcher

>     [junit] Tests run: 1, Failures: 0, Errors: 0, Time elapsed: 0.454 sec

>     [junit]

>     [junit] Testsuite: org.apache.solr.search.TestQueryTypes

>     [junit] Tests run: 1, Failures: 0, Errors: 0, Time elapsed: 0.695 sec

>     [junit]

>     [junit] Testsuite: org.apache.solr.search.TestQueryUtils

>     [junit] Tests run: 1, Failures: 0, Errors: 0, Time elapsed: 0.873 sec

>     [junit]

>     [junit] Testsuite: org.apache.solr.search.TestRangeQuery

>     [junit] Tests run: 2, Failures: 0, Errors: 0, Time elapsed: 17.984 sec

>     [junit]

>     [junit] Testsuite: org.apache.solr.search.TestSearchPerf

>     [junit] Tests run: 1, Failures: 0, Errors: 0, Time elapsed: 0.562 sec

>     [junit]

>     [junit] Testsuite: org.apache.solr.search.TestSolrQueryParser

>     [junit] Tests run: 1, Failures: 0, Errors: 0, Time elapsed: 0.596 sec

>     [junit]

>     [junit] Testsuite: org.apache.solr.search.TestSort

>     [junit] Tests run: 1, Failures: 0, Errors: 0, Time elapsed: 1.736 sec

>     [junit]

>     [junit] Testsuite: org.apache.solr.search.function.SortByFunctionTest

>     [junit] Tests run: 1, Failures: 0, Errors: 0, Time elapsed: 0.503 sec

>     [junit]

>     [junit] Testsuite: org.apache.solr.search.function.TestFunctionQuery

>     [junit] Tests run: 7, Failures: 0, Errors: 0, Time elapsed: 1.474 sec

>     [junit]

>     [junit] Testsuite:

> org.apache.solr.search.function.distance.DistanceFunctionTest

>     [junit] Tests run: 2, Failures: 0, Errors: 0, Time elapsed: 0.478 sec

>     [junit]

>     [junit] Testsuite: org.apache.solr.servlet.CacheHeaderTest

>     [junit] Tests run: 5, Failures: 0, Errors: 0, Time elapsed: 0.816 sec

>     [junit]

>     [junit] Testsuite: org.apache.solr.servlet.DirectSolrConnectionTest

>     [junit] Tests run: 2, Failures: 0, Errors: 0, Time elapsed: 0.311 sec

>     [junit]

>     [junit] Testsuite: org.apache.solr.servlet.NoCacheHeaderTest

>     [junit] Tests run: 3, Failures: 0, Errors: 0, Time elapsed: 0.714 sec

>     [junit]

>     [junit] Testsuite: org.apache.solr.servlet.SolrRequestParserTest

>     [junit] Tests run: 4, Failures: 0, Errors: 0, Time elapsed: 0.76 sec

>     [junit]

>     [junit] Testsuite: org.apache.solr.spelling.FileBasedSpellCheckerTest

>     [junit] Tests run: 3, Failures: 0, Errors: 0, Time elapsed: 0.678 sec

>     [junit]

>     [junit] Testsuite: org.apache.solr.spelling.IndexBasedSpellCheckerTest

>     [junit] Tests run: 5, Failures: 0, Errors: 0, Time elapsed: 0.756 sec

>     [junit]

>     [junit] Testsuite: org.apache.solr.spelling.SpellingQueryConverterTest

>     [junit] Tests run: 4, Failures: 0, Errors: 0, Time elapsed: 0.02 sec

>     [junit]

>     [junit] Testsuite: org.apache.solr.spelling.suggest.SuggesterTest

>     [junit] Tests run: 2, Failures: 0, Errors: 0, Time elapsed: 0.164 sec

>     [junit]

>     [junit] Testsuite: org.apache.solr.update.AutoCommitTest

>     [junit] Tests run: 1, Failures: 0, Errors: 0, Time elapsed: 4.38 sec

>     [junit]

>     [junit] Testsuite: org.apache.solr.update.DirectUpdateHandlerOptimizeTest

>     [junit] Tests run: 1, Failures: 0, Errors: 0, Time elapsed: 0.683 sec

>     [junit]

>     [junit] Testsuite: org.apache.solr.update.DirectUpdateHandlerTest

>     [junit] Tests run: 7, Failures: 0, Errors: 0, Time elapsed: 2.153 sec

>     [junit]

>     [junit] Testsuite: org.apache.solr.update.DocumentBuilderTest

>     [junit] Tests run: 3, Failures: 0, Errors: 0, Time elapsed: 0.54 sec

>     [junit]

>     [junit] Testsuite: org.apache.solr.update.TestIndexingPerformance

>     [junit] Tests run: 1, Failures: 0, Errors: 0, Time elapsed: 0.632 sec

>     [junit]

>     [junit] ------------- Standard Output ---------------

>     [junit] includeDoc=true doc=[text, simple, text, test, text, how now brown

> cow, text, what's that?, text, radical!, text, what's all this about, anyway?, text,

> just how fast is this text indexing?]

>     [junit] iter=1000 time=143 throughput=6993

>     [junit] ------------- ---------------- ---------------

>     [junit] Testsuite:

> org.apache.solr.update.processor.SignatureUpdateProcessorFactoryTest

>     [junit] Tests run: 2, Failures: 0, Errors: 0, Time elapsed: 1.27 sec

>     [junit]

>     [junit] Testsuite:

> org.apache.solr.update.processor.UpdateRequestProcessorFactoryTest

>     [junit] Tests run: 1, Failures: 0, Errors: 0, Time elapsed: 0.814 sec

>     [junit]

>     [junit] Testsuite: org.apache.solr.util.ArraysUtilsTest

>     [junit] Tests run: 1, Failures: 0, Errors: 0, Time elapsed: 0.01 sec

>     [junit]

>     [junit] Testsuite: org.apache.solr.util.DateMathParserTest

>     [junit] Tests run: 7, Failures: 0, Errors: 0, Time elapsed: 0.062 sec

>     [junit]

>     [junit] Testsuite: org.apache.solr.util.PrimUtilsTest

>     [junit] Tests run: 1, Failures: 0, Errors: 0, Time elapsed: 0.017 sec

>     [junit]

>     [junit] Testsuite: org.apache.solr.util.SolrPluginUtilsTest

>     [junit] Tests run: 7, Failures: 0, Errors: 0, Time elapsed: 0.684 sec

>     [junit]

>     [junit] Testsuite: org.apache.solr.util.TestNumberUtils

>     [junit] Tests run: 1, Failures: 0, Errors: 0, Time elapsed: 0.272 sec

>     [junit]

>     [junit] Testsuite: org.apache.solr.util.TestOpenBitSet

>     [junit] Tests run: 3, Failures: 0, Errors: 0, Time elapsed: 0.728 sec

>     [junit]

>     [junit] Testsuite: org.apache.solr.util.TestUtils

>     [junit] Tests run: 3, Failures: 0, Errors: 0, Time elapsed: 0.025 sec

>     [junit]

>     [junit] Testsuite: org.apache.solr.velocity.VelocityResponseWriterTest

>     [junit] Tests run: 1, Failures: 0, Errors: 0, Time elapsed: 0.598 sec

>     [junit]

>     [junit] Tests FAILED

>

> BUILD FAILED

> /usr<https://hudson.apache.org/hudson/job/Solr-

> 3.x/ws/branch_3x/solr/build.xml>:381: The following error occurred while

> executing this line:

> /usr<https://hudson.apache.org/hudson/job/Solr-

> 3.x/ws/branch_3x/solr/build.xml>:481: Tests failed!

>

> Total time: 19 minutes 57 seconds

> [TASKS] Skipping publisher since build result is FAILURE Publishing Javadoc

> Archiving artifacts Recording test results Publishing Clover coverage report...

> No Clover report will be published due to a Build Failure

>

>

> ---------------------------------------------------------------------

> To unsubscribe, e-mail: dev-unsubscribe@lucene.apache.org For additional

> commands, e-mail: dev-help@lucene.apache.org