lucene-dev mailing list archives

Site index · List index
Message view « Date » · « Thread »
Top « Date » · « Thread »
From Robert Muir <rcm...@gmail.com>
Subject Re: Build failed in Hudson: Lucene-Solr-tests-only-trunk #147
Date Sat, 16 Oct 2010 12:39:10 GMT
I caused this, the tests were set to @Ignore since they require java
6, but since trunk is java 6, and they passed on my computer, i
enabled them (trunk only)... don't know why its not working on hudson.

On Sat, Oct 16, 2010 at 8:34 AM, Apache Hudson Server
<hudson@hudson.apache.org> wrote:
> See <https://hudson.apache.org/hudson/job/Lucene-Solr-tests-only-trunk/147/changes>
>
> Changes:
>
> [rmuir] remove @Ignores for these tests because trunk is on java 6
>
> [rmuir] add reason why this test is @Ignore
>
> [rmuir] add reasons why the tests are @Ignored so you see them from the console
>
> ------------------------------------------
> [...truncated 9016 lines...]
>    [junit]     at sun.reflect.NativeMethodAccessorImpl.invoke0(Native Method)
>    [junit]     at sun.reflect.NativeMethodAccessorImpl.invoke(NativeMethodAccessorImpl.java:57)
>    [junit]     at sun.reflect.DelegatingMethodAccessorImpl.invoke(DelegatingMethodAccessorImpl.java:43)
>    [junit]     at java.lang.reflect.Method.invoke(Method.java:616)
>    [junit]     at org.junit.runners.model.FrameworkMethod$1.runReflectiveCall(FrameworkMethod.java:44)
>    [junit]     at org.junit.internal.runners.model.ReflectiveCallable.run(ReflectiveCallable.java:15)
>    [junit]     at org.junit.runners.model.FrameworkMethod.invokeExplosively(FrameworkMethod.java:41)
>    [junit]     at org.junit.internal.runners.statements.InvokeMethod.evaluate(InvokeMethod.java:20)
>    [junit]     at org.junit.rules.TestWatchman$1.evaluate(TestWatchman.java:48)
>    [junit]     at org.junit.internal.runners.statements.RunBefores.evaluate(RunBefores.java:28)
>    [junit]     at org.junit.internal.runners.statements.RunAfters.evaluate(RunAfters.java:31)
>    [junit]     at org.junit.runners.BlockJUnit4ClassRunner.runChild(BlockJUnit4ClassRunner.java:76)
>    [junit]     at org.apache.lucene.util.LuceneTestCase$LuceneTestCaseRunner.runChild(LuceneTestCase.java:823)
>    [junit]     at org.apache.lucene.util.LuceneTestCase$LuceneTestCaseRunner.runChild(LuceneTestCase.java:788)
>    [junit]     at org.junit.runners.ParentRunner$3.run(ParentRunner.java:193)
>    [junit]     at org.junit.runners.ParentRunner$1.schedule(ParentRunner.java:52)
>    [junit]     at org.junit.runners.ParentRunner.runChildren(ParentRunner.java:191)
>    [junit]     at org.junit.runners.ParentRunner.access$000(ParentRunner.java:42)
>    [junit]     at org.junit.runners.ParentRunner$2.evaluate(ParentRunner.java:184)
>    [junit]     at org.junit.internal.runners.statements.RunBefores.evaluate(RunBefores.java:28)
>    [junit]     at org.junit.internal.runners.statements.RunAfters.evaluate(RunAfters.java:31)
>    [junit]     at org.junit.runners.ParentRunner.run(ParentRunner.java:236)
>    [junit]     at junit.framework.JUnit4TestAdapter.run(JUnit4TestAdapter.java:39)
>    [junit]     at org.apache.tools.ant.taskdefs.optional.junit.JUnitTestRunner.run(JUnitTestRunner.java:421)
>    [junit]     at org.apache.tools.ant.taskdefs.optional.junit.JUnitTestRunner.launch(JUnitTestRunner.java:912)
>    [junit]     at org.apache.tools.ant.taskdefs.optional.junit.JUnitTestRunner.main(JUnitTestRunner.java:743)
>    [junit] Caused by: java.lang.RuntimeException: com.ctc.wstx.exc.WstxParsingException:
Unexpected close tag </id>; expected </node>.
>    [junit]  at [row,col {unknown-source}]: [11,18]
>    [junit]     at org.apache.solr.handler.dataimport.XPathRecordReader.streamRecords(XPathRecordReader.java:181)
>    [junit]     at org.apache.solr.handler.dataimport.XPathEntityProcessor.initQuery(XPathEntityProcessor.java:295)
>    [junit]     ... 41 more
>    [junit] Caused by: com.ctc.wstx.exc.WstxParsingException: Unexpected close tag </id>;
expected </node>.
>    [junit]  at [row,col {unknown-source}]: [11,18]
>    [junit]     at com.ctc.wstx.sr.StreamScanner.constructWfcException(StreamScanner.java:630)
>    [junit]     at com.ctc.wstx.sr.StreamScanner.throwParseError(StreamScanner.java:461)
>    [junit]     at com.ctc.wstx.sr.BasicStreamReader.reportWrongEndElem(BasicStreamReader.java:3258)
>    [junit]     at com.ctc.wstx.sr.BasicStreamReader.readEndElem(BasicStreamReader.java:3200)
>    [junit]     at com.ctc.wstx.sr.BasicStreamReader.nextFromTree(BasicStreamReader.java:2832)
>    [junit]     at com.ctc.wstx.sr.BasicStreamReader.next(BasicStreamReader.java:1019)
>    [junit]     at org.apache.solr.handler.dataimport.XPathRecordReader$Node.parse(XPathRecordReader.java:275)
>    [junit]     at org.apache.solr.handler.dataimport.XPathRecordReader$Node.handleStartElement(XPathRecordReader.java:340)
>    [junit]     at org.apache.solr.handler.dataimport.XPathRecordReader$Node.parse(XPathRecordReader.java:304)
>    [junit]     at org.apache.solr.handler.dataimport.XPathRecordReader$Node.handleStartElement(XPathRecordReader.java:340)
>    [junit]     at org.apache.solr.handler.dataimport.XPathRecordReader$Node.parse(XPathRecordReader.java:304)
>    [junit]     at org.apache.solr.handler.dataimport.XPathRecordReader$Node.access$200(XPathRecordReader.java:196)
>    [junit]     at org.apache.solr.handler.dataimport.XPathRecordReader.streamRecords(XPathRecordReader.java:178)
>    [junit]     ... 42 more
>    [junit] 16/10/2010 15:33:56 org.apache.solr.handler.dataimport.DataImporter doFullImport
>    [junit] SEVERE: Full Import failed
>    [junit] org.apache.solr.handler.dataimport.DataImportHandlerException: Parsing failed
for xml, url:test rows processed:2 last row: {id=2, desc=[test2], $forEach=/root/node} Processing
Document # 1
>    [junit]     at org.apache.solr.handler.dataimport.DataImportHandlerException.wrapAndThrow(DataImportHandlerException.java:72)
>    [junit]     at org.apache.solr.handler.dataimport.XPathEntityProcessor.initQuery(XPathEntityProcessor.java:305)
>    [junit]     at org.apache.solr.handler.dataimport.XPathEntityProcessor.fetchNextRow(XPathEntityProcessor.java:201)
>    [junit]     at org.apache.solr.handler.dataimport.XPathEntityProcessor.nextRow(XPathEntityProcessor.java:181)
>    [junit]     at org.apache.solr.handler.dataimport.EntityProcessorWrapper.nextRow(EntityProcessorWrapper.java:233)
>    [junit]     at org.apache.solr.handler.dataimport.DocBuilder.buildDocument(DocBuilder.java:579)
>    [junit]     at org.apache.solr.handler.dataimport.DocBuilder.doFullDump(DocBuilder.java:260)
>    [junit]     at org.apache.solr.handler.dataimport.DocBuilder.execute(DocBuilder.java:184)
>    [junit]     at org.apache.solr.handler.dataimport.DataImporter.doFullImport(DataImporter.java:334)
>    [junit]     at org.apache.solr.handler.dataimport.DataImporter.runCmd(DataImporter.java:392)
>    [junit]     at org.apache.solr.handler.dataimport.DataImportHandler.handleRequestBody(DataImportHandler.java:203)
>    [junit]     at org.apache.solr.handler.RequestHandlerBase.handleRequest(RequestHandlerBase.java:131)
>    [junit]     at org.apache.solr.core.SolrCore.execute(SolrCore.java:1325)
>    [junit]     at org.apache.solr.util.TestHarness.queryAndResponse(TestHarness.java:339)
>    [junit]     at org.apache.solr.util.TestHarness.query(TestHarness.java:322)
>    [junit]     at org.apache.solr.handler.dataimport.AbstractDataImportHandlerTestCase.runFullImport(AbstractDataImportHandlerTestCase.java:81)
>    [junit]     at org.apache.solr.handler.dataimport.TestErrorHandling.testAbortOnError(TestErrorHandling.java:65)
>    [junit]     at sun.reflect.NativeMethodAccessorImpl.invoke0(Native Method)
>    [junit]     at sun.reflect.NativeMethodAccessorImpl.invoke(NativeMethodAccessorImpl.java:57)
>    [junit]     at sun.reflect.DelegatingMethodAccessorImpl.invoke(DelegatingMethodAccessorImpl.java:43)
>    [junit]     at java.lang.reflect.Method.invoke(Method.java:616)
>    [junit]     at org.junit.runners.model.FrameworkMethod$1.runReflectiveCall(FrameworkMethod.java:44)
>    [junit]     at org.junit.internal.runners.model.ReflectiveCallable.run(ReflectiveCallable.java:15)
>    [junit]     at org.junit.runners.model.FrameworkMethod.invokeExplosively(FrameworkMethod.java:41)
>    [junit]     at org.junit.internal.runners.statements.InvokeMethod.evaluate(InvokeMethod.java:20)
>    [junit]     at org.junit.rules.TestWatchman$1.evaluate(TestWatchman.java:48)
>    [junit]     at org.junit.internal.runners.statements.RunBefores.evaluate(RunBefores.java:28)
>    [junit]     at org.junit.internal.runners.statements.RunAfters.evaluate(RunAfters.java:31)
>    [junit]     at org.junit.runners.BlockJUnit4ClassRunner.runChild(BlockJUnit4ClassRunner.java:76)
>    [junit]     at org.apache.lucene.util.LuceneTestCase$LuceneTestCaseRunner.runChild(LuceneTestCase.java:823)
>    [junit]     at org.apache.lucene.util.LuceneTestCase$LuceneTestCaseRunner.runChild(LuceneTestCase.java:788)
>    [junit]     at org.junit.runners.ParentRunner$3.run(ParentRunner.java:193)
>    [junit]     at org.junit.runners.ParentRunner$1.schedule(ParentRunner.java:52)
>    [junit]     at org.junit.runners.ParentRunner.runChildren(ParentRunner.java:191)
>    [junit]     at org.junit.runners.ParentRunner.access$000(ParentRunner.java:42)
>    [junit]     at org.junit.runners.ParentRunner$2.evaluate(ParentRunner.java:184)
>    [junit]     at org.junit.internal.runners.statements.RunBefores.evaluate(RunBefores.java:28)
>    [junit]     at org.junit.internal.runners.statements.RunAfters.evaluate(RunAfters.java:31)
>    [junit]     at org.junit.runners.ParentRunner.run(ParentRunner.java:236)
>    [junit]     at junit.framework.JUnit4TestAdapter.run(JUnit4TestAdapter.java:39)
>    [junit]     at org.apache.tools.ant.taskdefs.optional.junit.JUnitTestRunner.run(JUnitTestRunner.java:421)
>    [junit]     at org.apache.tools.ant.taskdefs.optional.junit.JUnitTestRunner.launch(JUnitTestRunner.java:912)
>    [junit]     at org.apache.tools.ant.taskdefs.optional.junit.JUnitTestRunner.main(JUnitTestRunner.java:743)
>    [junit] Caused by: java.lang.RuntimeException: com.ctc.wstx.exc.WstxParsingException:
Unexpected close tag </id>; expected </node>.
>    [junit]  at [row,col {unknown-source}]: [11,18]
>    [junit]     at org.apache.solr.handler.dataimport.XPathRecordReader.streamRecords(XPathRecordReader.java:181)
>    [junit]     at org.apache.solr.handler.dataimport.XPathEntityProcessor.initQuery(XPathEntityProcessor.java:295)
>    [junit]     ... 41 more
>    [junit] Caused by: com.ctc.wstx.exc.WstxParsingException: Unexpected close tag </id>;
expected </node>.
>    [junit]  at [row,col {unknown-source}]: [11,18]
>    [junit]     at com.ctc.wstx.sr.StreamScanner.constructWfcException(StreamScanner.java:630)
>    [junit]     at com.ctc.wstx.sr.StreamScanner.throwParseError(StreamScanner.java:461)
>    [junit]     at com.ctc.wstx.sr.BasicStreamReader.reportWrongEndElem(BasicStreamReader.java:3258)
>    [junit]     at com.ctc.wstx.sr.BasicStreamReader.readEndElem(BasicStreamReader.java:3200)
>    [junit]     at com.ctc.wstx.sr.BasicStreamReader.nextFromTree(BasicStreamReader.java:2832)
>    [junit]     at com.ctc.wstx.sr.BasicStreamReader.next(BasicStreamReader.java:1019)
>    [junit]     at org.apache.solr.handler.dataimport.XPathRecordReader$Node.parse(XPathRecordReader.java:275)
>    [junit]     at org.apache.solr.handler.dataimport.XPathRecordReader$Node.handleStartElement(XPathRecordReader.java:340)
>    [junit]     at org.apache.solr.handler.dataimport.XPathRecordReader$Node.parse(XPathRecordReader.java:304)
>    [junit]     at org.apache.solr.handler.dataimport.XPathRecordReader$Node.handleStartElement(XPathRecordReader.java:340)
>    [junit]     at org.apache.solr.handler.dataimport.XPathRecordReader$Node.parse(XPathRecordReader.java:304)
>    [junit]     at org.apache.solr.handler.dataimport.XPathRecordReader$Node.access$200(XPathRecordReader.java:196)
>    [junit]     at org.apache.solr.handler.dataimport.XPathRecordReader.streamRecords(XPathRecordReader.java:178)
>    [junit]     ... 42 more
>    [junit] ------------- ---------------- ---------------
>    [junit] Testsuite: org.apache.solr.handler.dataimport.TestEvaluatorBag
>    [junit] Tests run: 5, Failures: 0, Errors: 0, Time elapsed: 0.026 sec
>    [junit]
>    [junit] Testsuite: org.apache.solr.handler.dataimport.TestFieldReader
>    [junit] Tests run: 1, Failures: 0, Errors: 0, Time elapsed: 0.028 sec
>    [junit]
>    [junit] Testsuite: org.apache.solr.handler.dataimport.TestFileListEntityProcessor
>    [junit] Tests run: 3, Failures: 0, Errors: 0, Time elapsed: 0.027 sec
>    [junit]
>    [junit] ------------- Standard Error -----------------
>    [junit] NOTE: Ignoring test method 'testNTOT' Known Locale/TZ problems: see https://issues.apache.org/jira/browse/SOLR-1916
>    [junit] ------------- ---------------- ---------------
>    [junit] Testsuite: org.apache.solr.handler.dataimport.TestJdbcDataSource
>    [junit] Tests run: 3, Failures: 0, Errors: 0, Time elapsed: 0.055 sec
>    [junit]
>    [junit] ------------- Standard Error -----------------
>    [junit] NOTE: Ignoring test method 'testBasic' Needs a Mock database server to work
>    [junit] ------------- ---------------- ---------------
>    [junit] Testsuite: org.apache.solr.handler.dataimport.TestLineEntityProcessor
>    [junit] Tests run: 4, Failures: 0, Errors: 0, Time elapsed: 0.013 sec
>    [junit]
>    [junit] Testsuite: org.apache.solr.handler.dataimport.TestNumberFormatTransformer
>    [junit] Tests run: 9, Failures: 0, Errors: 0, Time elapsed: 0.021 sec
>    [junit]
>    [junit] Testsuite: org.apache.solr.handler.dataimport.TestPlainTextEntityProcessor
>    [junit] Tests run: 1, Failures: 0, Errors: 0, Time elapsed: 0.021 sec
>    [junit]
>    [junit] Testsuite: org.apache.solr.handler.dataimport.TestRegexTransformer
>    [junit] Tests run: 5, Failures: 0, Errors: 0, Time elapsed: 0.016 sec
>    [junit]
>    [junit] Testsuite: org.apache.solr.handler.dataimport.TestScriptTransformer
>    [junit] Testcase: testBasic(org.apache.solr.handler.dataimport.TestScriptTransformer):
     Caused an ERROR
>    [junit] <script> can be used only in java 6 or above
>    [junit] org.apache.solr.handler.dataimport.DataImportHandlerException: <script>
can be used only in java 6 or above
>    [junit]     at org.apache.solr.handler.dataimport.DataImportHandlerException.wrapAndThrow(DataImportHandlerException.java:72)
>    [junit]     at org.apache.solr.handler.dataimport.ScriptTransformer.initEngine(ScriptTransformer.java:93)
>    [junit]     at org.apache.solr.handler.dataimport.ScriptTransformer.transformRow(ScriptTransformer.java:53)
>    [junit]     at org.apache.solr.handler.dataimport.EntityProcessorWrapper.applyTransformer(EntityProcessorWrapper.java:189)
>    [junit]     at org.apache.solr.handler.dataimport.TestScriptTransformer.testBasic(TestScriptTransformer.java:53)
>    [junit]     at org.apache.lucene.util.LuceneTestCase$LuceneTestCaseRunner.runChild(LuceneTestCase.java:823)
>    [junit]     at org.apache.lucene.util.LuceneTestCase$LuceneTestCaseRunner.runChild(LuceneTestCase.java:788)
>    [junit] Caused by: java.lang.NullPointerException
>    [junit]     at org.apache.solr.handler.dataimport.ScriptTransformer.initEngine(ScriptTransformer.java:88)
>    [junit]
>    [junit]
>    [junit] Testcase: testOneparam(org.apache.solr.handler.dataimport.TestScriptTransformer):
  Caused an ERROR
>    [junit] <script> can be used only in java 6 or above
>    [junit] org.apache.solr.handler.dataimport.DataImportHandlerException: <script>
can be used only in java 6 or above
>    [junit]     at org.apache.solr.handler.dataimport.DataImportHandlerException.wrapAndThrow(DataImportHandlerException.java:72)
>    [junit]     at org.apache.solr.handler.dataimport.ScriptTransformer.initEngine(ScriptTransformer.java:93)
>    [junit]     at org.apache.solr.handler.dataimport.ScriptTransformer.transformRow(ScriptTransformer.java:53)
>    [junit]     at org.apache.solr.handler.dataimport.EntityProcessorWrapper.applyTransformer(EntityProcessorWrapper.java:189)
>    [junit]     at org.apache.solr.handler.dataimport.TestScriptTransformer.testOneparam(TestScriptTransformer.java:81)
>    [junit]     at org.apache.lucene.util.LuceneTestCase$LuceneTestCaseRunner.runChild(LuceneTestCase.java:823)
>    [junit]     at org.apache.lucene.util.LuceneTestCase$LuceneTestCaseRunner.runChild(LuceneTestCase.java:788)
>    [junit] Caused by: java.lang.NullPointerException
>    [junit]     at org.apache.solr.handler.dataimport.ScriptTransformer.initEngine(ScriptTransformer.java:88)
>    [junit]
>    [junit]
>    [junit] Testcase: testCheckScript(org.apache.solr.handler.dataimport.TestScriptTransformer):
       Caused an ERROR
>    [junit] <script> can be used only in java 6 or above
>    [junit] org.apache.solr.handler.dataimport.DataImportHandlerException: <script>
can be used only in java 6 or above
>    [junit]     at org.apache.solr.handler.dataimport.DataImportHandlerException.wrapAndThrow(DataImportHandlerException.java:72)
>    [junit]     at org.apache.solr.handler.dataimport.ScriptTransformer.initEngine(ScriptTransformer.java:93)
>    [junit]     at org.apache.solr.handler.dataimport.ScriptTransformer.transformRow(ScriptTransformer.java:53)
>    [junit]     at org.apache.solr.handler.dataimport.EntityProcessorWrapper.applyTransformer(EntityProcessorWrapper.java:189)
>    [junit]     at org.apache.solr.handler.dataimport.TestScriptTransformer.testCheckScript(TestScriptTransformer.java:111)
>    [junit]     at org.apache.lucene.util.LuceneTestCase$LuceneTestCaseRunner.runChild(LuceneTestCase.java:823)
>    [junit]     at org.apache.lucene.util.LuceneTestCase$LuceneTestCaseRunner.runChild(LuceneTestCase.java:788)
>    [junit] Caused by: java.lang.NullPointerException
>    [junit]     at org.apache.solr.handler.dataimport.ScriptTransformer.initEngine(ScriptTransformer.java:88)
>    [junit]
>    [junit]
>    [junit] Tests run: 4, Failures: 0, Errors: 3, Time elapsed: 0.032 sec
>    [junit]
>    [junit] ------------- Standard Output ---------------
>    [junit] NOTE: reproduce with: ant test -Dtestcase=TestScriptTransformer -Dtestmethod=testBasic
-Dtests.seed=-9208882720431068175:7575598549629696847 -Dtests.multiplier=3
>    [junit] NOTE: reproduce with: ant test -Dtestcase=TestScriptTransformer -Dtestmethod=testOneparam
-Dtests.seed=-9208882720431068175:-3466371865929016051 -Dtests.multiplier=3
>    [junit] NOTE: reproduce with: ant test -Dtestcase=TestScriptTransformer -Dtestmethod=testCheckScript
-Dtests.seed=-9208882720431068175:2514886155553164670 -Dtests.multiplier=3
>    [junit] NOTE: test params are: codec=MockSep, locale=no_NO_NY, timezone=Africa/Ndjamena
>    [junit] ------------- ---------------- ---------------
>    [junit] TEST org.apache.solr.handler.dataimport.TestScriptTransformer FAILED
>    [junit] Testsuite: org.apache.solr.handler.dataimport.TestSqlEntityProcessor
>    [junit] Tests run: 4, Failures: 0, Errors: 0, Time elapsed: 0.015 sec
>    [junit]
>    [junit] Testsuite: org.apache.solr.handler.dataimport.TestSqlEntityProcessor2
>    [junit] Tests run: 6, Failures: 0, Errors: 0, Time elapsed: 0.661 sec
>    [junit]
>    [junit] ------------- Standard Error -----------------
>    [junit] NOTE: Ignoring test method 'testLastIndexTime' Known Locale/TZ problems:
see https://issues.apache.org/jira/browse/SOLR-1916
>    [junit] 16.10.2010. 12.33.56 org.apache.solr.handler.dataimport.JdbcDataSource finalize
>    [junit] SEVERE: JdbcDataSource was not closed prior to finalize(), indicates a bug
-- POSSIBLE RESOURCE LEAK!!!
>    [junit] 16.10.2010. 12.33.56 org.apache.solr.handler.dataimport.JdbcDataSource finalize
>    [junit] SEVERE: JdbcDataSource was not closed prior to finalize(), indicates a bug
-- POSSIBLE RESOURCE LEAK!!!
>    [junit] 16.10.2010. 12.33.56 org.apache.solr.handler.dataimport.JdbcDataSource finalize
>    [junit] SEVERE: JdbcDataSource was not closed prior to finalize(), indicates a bug
-- POSSIBLE RESOURCE LEAK!!!
>    [junit] ------------- ---------------- ---------------
>    [junit] Testsuite: org.apache.solr.handler.dataimport.TestSqlEntityProcessorDelta
>    [junit] Tests run: 8, Failures: 0, Errors: 0, Time elapsed: 1.036 sec
>    [junit]
>    [junit] Testsuite: org.apache.solr.handler.dataimport.TestSqlEntityProcessorDelta2
>    [junit] Tests run: 8, Failures: 0, Errors: 0, Time elapsed: 1.074 sec
>    [junit]
>    [junit] Testsuite: org.apache.solr.handler.dataimport.TestTemplateString
>    [junit] Tests run: 1, Failures: 0, Errors: 0, Time elapsed: 0.015 sec
>    [junit]
>    [junit] Testsuite: org.apache.solr.handler.dataimport.TestTemplateTransformer
>    [junit] Tests run: 1, Failures: 0, Errors: 0, Time elapsed: 0.012 sec
>    [junit]
>    [junit] Testsuite: org.apache.solr.handler.dataimport.TestThreaded
>    [junit] Tests run: 1, Failures: 0, Errors: 0, Time elapsed: 0.355 sec
>    [junit]
>    [junit] Testsuite: org.apache.solr.handler.dataimport.TestURLDataSource
>    [junit] Tests run: 1, Failures: 0, Errors: 0, Time elapsed: 0.011 sec
>    [junit]
>    [junit] Testsuite: org.apache.solr.handler.dataimport.TestVariableResolver
>    [junit] Tests run: 9, Failures: 0, Errors: 0, Time elapsed: 0.02 sec
>    [junit]
>    [junit] Testsuite: org.apache.solr.handler.dataimport.TestXPathEntityProcessor
>    [junit] Tests run: 8, Failures: 0, Errors: 0, Time elapsed: 0.474 sec
>    [junit]
>    [junit] Testsuite: org.apache.solr.handler.dataimport.TestXPathRecordReader
>    [junit] Tests run: 21, Failures: 0, Errors: 0, Time elapsed: 0.03 sec
>    [junit]
>    [junit] Tests FAILED
>
> BUILD FAILED
> /usr<https://hudson.apache.org/hudson/job/Lucene-Solr-tests-only-trunk/ws/checkout/build.xml>:23:
The following error occurred while executing this line:
> /usr<https://hudson.apache.org/hudson/job/Lucene-Solr-tests-only-trunk/ws/checkout/solr/common-build.xml>:462:
The following error occurred while executing this line:
> /usr<https://hudson.apache.org/hudson/job/Lucene-Solr-tests-only-trunk/ws/checkout/solr/common-build.xml>:319:
The following error occurred while executing this line:
> /usr<https://hudson.apache.org/hudson/job/Lucene-Solr-tests-only-trunk/ws/checkout/solr/contrib/dataimporthandler/build.xml>:192:
Tests failed!
>
> Total time: 7 minutes 54 seconds
> Recording test results
>
>
> ---------------------------------------------------------------------
> To unsubscribe, e-mail: dev-unsubscribe@lucene.apache.org
> For additional commands, e-mail: dev-help@lucene.apache.org
>
>

---------------------------------------------------------------------
To unsubscribe, e-mail: dev-unsubscribe@lucene.apache.org
For additional commands, e-mail: dev-help@lucene.apache.org


Mime
View raw message