lucene-dev mailing list archives

Site index · List index
Message view « Date » · « Thread »
Top « Date » · « Thread »
From Robert Muir <rcm...@gmail.com>
Subject Re: Build failed in Hudson: Lucene-Solr-tests-only-trunk #11
Date Wed, 13 Oct 2010 08:55:23 GMT
this has been failing often... will take a look later today

On Wed, Oct 13, 2010 at 1:34 AM, Apache Hudson Server
<hudson@hudson.apache.org> wrote:
> See <https://hudson.apache.org/hudson/job/Lucene-Solr-tests-only-trunk/11/>
>
> ------------------------------------------
> [...truncated 8912 lines...]
>    [junit]     at org.apache.solr.handler.dataimport.DataImporter.runCmd(DataImporter.java:392)
>    [junit]     at org.apache.solr.handler.dataimport.DataImportHandler.handleRequestBody(DataImportHandler.java:203)
>    [junit]     at org.apache.solr.handler.RequestHandlerBase.handleRequest(RequestHandlerBase.java:131)
>    [junit]     at org.apache.solr.core.SolrCore.execute(SolrCore.java:1324)
>    [junit]     at org.apache.solr.util.TestHarness.queryAndResponse(TestHarness.java:334)
>    [junit]     at org.apache.solr.util.TestHarness.query(TestHarness.java:321)
>    [junit]     at org.apache.solr.handler.dataimport.AbstractDataImportHandlerTestCase.runFullImport(AbstractDataImportHandlerTestCase.java:108)
>    [junit]     at org.apache.solr.handler.dataimport.TestDocBuilder2.testFileListEntityProcessor_lastIndexTime(TestDocBuilder2.java:245)
>    [junit]     at sun.reflect.NativeMethodAccessorImpl.invoke0(Native Method)
>    [junit]     at sun.reflect.NativeMethodAccessorImpl.invoke(NativeMethodAccessorImpl.java:57)
>    [junit]     at sun.reflect.DelegatingMethodAccessorImpl.invoke(DelegatingMethodAccessorImpl.java:43)
>    [junit]     at java.lang.reflect.Method.invoke(Method.java:616)
>    [junit]     at org.junit.runners.model.FrameworkMethod$1.runReflectiveCall(FrameworkMethod.java:44)
>    [junit]     at org.junit.internal.runners.model.ReflectiveCallable.run(ReflectiveCallable.java:15)
>    [junit]     at org.junit.runners.model.FrameworkMethod.invokeExplosively(FrameworkMethod.java:41)
>    [junit]     at org.junit.internal.runners.statements.InvokeMethod.evaluate(InvokeMethod.java:20)
>    [junit]     at org.junit.rules.TestWatchman$1.evaluate(TestWatchman.java:48)
>    [junit]     at org.junit.internal.runners.statements.RunBefores.evaluate(RunBefores.java:28)
>    [junit]     at org.junit.internal.runners.statements.RunAfters.evaluate(RunAfters.java:31)
>    [junit]     at org.junit.runners.BlockJUnit4ClassRunner.runChild(BlockJUnit4ClassRunner.java:76)
>    [junit]     at org.apache.lucene.util.LuceneTestCase$LuceneTestCaseRunner.runChild(LuceneTestCase.java:795)
>    [junit]     at org.apache.lucene.util.LuceneTestCase$LuceneTestCaseRunner.runChild(LuceneTestCase.java:768)
>    [junit]     at org.junit.runners.ParentRunner$3.run(ParentRunner.java:193)
>    [junit]     at org.junit.runners.ParentRunner$1.schedule(ParentRunner.java:52)
>    [junit]     at org.junit.runners.ParentRunner.runChildren(ParentRunner.java:191)
>    [junit]     at org.junit.runners.ParentRunner.access$000(ParentRunner.java:42)
>    [junit]     at org.junit.runners.ParentRunner$2.evaluate(ParentRunner.java:184)
>    [junit]     at org.junit.internal.runners.statements.RunBefores.evaluate(RunBefores.java:28)
>    [junit]     at org.junit.internal.runners.statements.RunAfters.evaluate(RunAfters.java:31)
>    [junit]     at org.junit.runners.ParentRunner.run(ParentRunner.java:236)
>    [junit]     at junit.framework.JUnit4TestAdapter.run(JUnit4TestAdapter.java:39)
>    [junit]     at org.apache.tools.ant.taskdefs.optional.junit.JUnitTestRunner.run(JUnitTestRunner.java:421)
>    [junit]     at org.apache.tools.ant.taskdefs.optional.junit.JUnitTestRunner.launch(JUnitTestRunner.java:912)
>    [junit]     at org.apache.tools.ant.taskdefs.optional.junit.JUnitTestRunner.main(JUnitTestRunner.java:743)
>    [junit] Caused by: java.text.ParseException: Unparseable date: "1970-01-01 01:00:00"
>    [junit]     at java.text.DateFormat.parse(DateFormat.java:354)
>    [junit]     at org.apache.solr.handler.dataimport.FileListEntityProcessor.getDate(FileListEntityProcessor.java:165)
>    [junit]     ... 40 more
>    [junit] 13/10/2010 01:33:36 ? org.apache.solr.handler.dataimport.DataImporter doFullImport
>    [junit] SEVERE: Full Import failed
>    [junit] org.apache.solr.handler.dataimport.DataImportHandlerException: Invalid expression
for date Processing Document # 1
>    [junit]     at org.apache.solr.handler.dataimport.FileListEntityProcessor.getDate(FileListEntityProcessor.java:167)
>    [junit]     at org.apache.solr.handler.dataimport.FileListEntityProcessor.nextRow(FileListEntityProcessor.java:204)
>    [junit]     at org.apache.solr.handler.dataimport.EntityProcessorWrapper.nextRow(EntityProcessorWrapper.java:233)
>    [junit]     at org.apache.solr.handler.dataimport.DocBuilder.buildDocument(DocBuilder.java:579)
>    [junit]     at org.apache.solr.handler.dataimport.DocBuilder.doFullDump(DocBuilder.java:260)
>    [junit]     at org.apache.solr.handler.dataimport.DocBuilder.execute(DocBuilder.java:184)
>    [junit]     at org.apache.solr.handler.dataimport.DataImporter.doFullImport(DataImporter.java:334)
>    [junit]     at org.apache.solr.handler.dataimport.DataImporter.runCmd(DataImporter.java:392)
>    [junit]     at org.apache.solr.handler.dataimport.DataImportHandler.handleRequestBody(DataImportHandler.java:203)
>    [junit]     at org.apache.solr.handler.RequestHandlerBase.handleRequest(RequestHandlerBase.java:131)
>    [junit]     at org.apache.solr.core.SolrCore.execute(SolrCore.java:1324)
>    [junit]     at org.apache.solr.util.TestHarness.queryAndResponse(TestHarness.java:334)
>    [junit]     at org.apache.solr.util.TestHarness.query(TestHarness.java:321)
>    [junit]     at org.apache.solr.handler.dataimport.AbstractDataImportHandlerTestCase.runFullImport(AbstractDataImportHandlerTestCase.java:108)
>    [junit]     at org.apache.solr.handler.dataimport.TestDocBuilder2.testFileListEntityProcessor_lastIndexTime(TestDocBuilder2.java:245)
>    [junit]     at sun.reflect.NativeMethodAccessorImpl.invoke0(Native Method)
>    [junit]     at sun.reflect.NativeMethodAccessorImpl.invoke(NativeMethodAccessorImpl.java:57)
>    [junit]     at sun.reflect.DelegatingMethodAccessorImpl.invoke(DelegatingMethodAccessorImpl.java:43)
>    [junit]     at java.lang.reflect.Method.invoke(Method.java:616)
>    [junit]     at org.junit.runners.model.FrameworkMethod$1.runReflectiveCall(FrameworkMethod.java:44)
>    [junit]     at org.junit.internal.runners.model.ReflectiveCallable.run(ReflectiveCallable.java:15)
>    [junit]     at org.junit.runners.model.FrameworkMethod.invokeExplosively(FrameworkMethod.java:41)
>    [junit]     at org.junit.internal.runners.statements.InvokeMethod.evaluate(InvokeMethod.java:20)
>    [junit]     at org.junit.rules.TestWatchman$1.evaluate(TestWatchman.java:48)
>    [junit]     at org.junit.internal.runners.statements.RunBefores.evaluate(RunBefores.java:28)
>    [junit]     at org.junit.internal.runners.statements.RunAfters.evaluate(RunAfters.java:31)
>    [junit]     at org.junit.runners.BlockJUnit4ClassRunner.runChild(BlockJUnit4ClassRunner.java:76)
>    [junit]     at org.apache.lucene.util.LuceneTestCase$LuceneTestCaseRunner.runChild(LuceneTestCase.java:795)
>    [junit]     at org.apache.lucene.util.LuceneTestCase$LuceneTestCaseRunner.runChild(LuceneTestCase.java:768)
>    [junit]     at org.junit.runners.ParentRunner$3.run(ParentRunner.java:193)
>    [junit]     at org.junit.runners.ParentRunner$1.schedule(ParentRunner.java:52)
>    [junit]     at org.junit.runners.ParentRunner.runChildren(ParentRunner.java:191)
>    [junit]     at org.junit.runners.ParentRunner.access$000(ParentRunner.java:42)
>    [junit]     at org.junit.runners.ParentRunner$2.evaluate(ParentRunner.java:184)
>    [junit]     at org.junit.internal.runners.statements.RunBefores.evaluate(RunBefores.java:28)
>    [junit]     at org.junit.internal.runners.statements.RunAfters.evaluate(RunAfters.java:31)
>    [junit]     at org.junit.runners.ParentRunner.run(ParentRunner.java:236)
>    [junit]     at junit.framework.JUnit4TestAdapter.run(JUnit4TestAdapter.java:39)
>    [junit]     at org.apache.tools.ant.taskdefs.optional.junit.JUnitTestRunner.run(JUnitTestRunner.java:421)
>    [junit]     at org.apache.tools.ant.taskdefs.optional.junit.JUnitTestRunner.launch(JUnitTestRunner.java:912)
>    [junit]     at org.apache.tools.ant.taskdefs.optional.junit.JUnitTestRunner.main(JUnitTestRunner.java:743)
>    [junit] Caused by: java.text.ParseException: Unparseable date: "1970-01-01 01:00:00"
>    [junit]     at java.text.DateFormat.parse(DateFormat.java:354)
>    [junit]     at org.apache.solr.handler.dataimport.FileListEntityProcessor.getDate(FileListEntityProcessor.java:165)
>    [junit]     ... 40 more
>    [junit] ------------- ---------------- ---------------
>    [junit] TEST org.apache.solr.handler.dataimport.TestDocBuilder2 FAILED
>    [junit] Testsuite: org.apache.solr.handler.dataimport.TestEntityProcessorBase
>    [junit] Tests run: 1, Failures: 0, Errors: 0, Time elapsed: 0.024 sec
>    [junit]
>    [junit] Testsuite: org.apache.solr.handler.dataimport.TestErrorHandling
>    [junit] Tests run: 4, Failures: 0, Errors: 0, Time elapsed: 1.171 sec
>    [junit]
>    [junit] Testsuite: org.apache.solr.handler.dataimport.TestEvaluatorBag
>    [junit] Tests run: 5, Failures: 0, Errors: 0, Time elapsed: 0.023 sec
>    [junit]
>    [junit] Testsuite: org.apache.solr.handler.dataimport.TestFieldReader
>    [junit] Tests run: 1, Failures: 0, Errors: 0, Time elapsed: 0.013 sec
>    [junit]
>    [junit] Testsuite: org.apache.solr.handler.dataimport.TestFileListEntityProcessor
>    [junit] Testcase: testNTOT(org.apache.solr.handler.dataimport.TestFileListEntityProcessor):
Caused an ERROR
>    [junit] Invalid expression for date
>    [junit] org.apache.solr.handler.dataimport.DataImportHandlerException: Invalid expression
for date
>    [junit]     at org.apache.solr.handler.dataimport.FileListEntityProcessor.getDate(FileListEntityProcessor.java:167)
>    [junit]     at org.apache.solr.handler.dataimport.FileListEntityProcessor.nextRow(FileListEntityProcessor.java:204)
>    [junit]     at org.apache.solr.handler.dataimport.TestFileListEntityProcessor.getFiles(TestFileListEntityProcessor.java:127)
>    [junit]     at org.apache.solr.handler.dataimport.TestFileListEntityProcessor.testNTOT(TestFileListEntityProcessor.java:166)
>    [junit]     at org.apache.lucene.util.LuceneTestCase$LuceneTestCaseRunner.runChild(LuceneTestCase.java:795)
>    [junit]     at org.apache.lucene.util.LuceneTestCase$LuceneTestCaseRunner.runChild(LuceneTestCase.java:768)
>    [junit] Caused by: java.text.ParseException: Unparseable date: "2010-10-13 07:32:48"
>    [junit]     at java.text.DateFormat.parse(DateFormat.java:354)
>    [junit]     at org.apache.solr.handler.dataimport.FileListEntityProcessor.getDate(FileListEntityProcessor.java:165)
>    [junit]
>    [junit]
>    [junit] Tests run: 4, Failures: 0, Errors: 1, Time elapsed: 0.021 sec
>    [junit]
>    [junit] ------------- Standard Output ---------------
>    [junit] NOTE: reproduce with: ant test -Dtestcase=TestFileListEntityProcessor -Dtestmethod=testNTOT
-Dtests.seed=-1801190394707590626:2908753652894943128
>    [junit] NOTE: test params are: codec=PreFlex, locale=pt, timezone=Greenwich
>    [junit] ------------- ---------------- ---------------
>    [junit] TEST org.apache.solr.handler.dataimport.TestFileListEntityProcessor FAILED
>    [junit] Testsuite: org.apache.solr.handler.dataimport.TestJdbcDataSource
>    [junit] Tests run: 3, Failures: 0, Errors: 0, Time elapsed: 0.059 sec
>    [junit]
>    [junit] Testsuite: org.apache.solr.handler.dataimport.TestLineEntityProcessor
>    [junit] Tests run: 4, Failures: 0, Errors: 0, Time elapsed: 0.044 sec
>    [junit]
>    [junit] ------------- Standard Output ---------------
>    [junit]
>    [junit]      rawLine=''
>    [junit]      rawLine='# this is what the output from 'find . -ls; looks like,
athough the format'
>    [junit]      rawLine='# of the time stamp varies depending on the age of the
file and your LANG '
>    [junit]      rawLine='# env setting'
>    [junit]      rawLine='412577   0 drwxr-xr-x  6 user group    204 1 Apr 10:53
/Volumes/spare/ts'
>    [junit]      rawLine='412582   0 drwxr-xr-x 13 user group    442 1 Apr 10:18
/Volumes/spare/ts/config'
>    [junit]      rawLine='412583  24 -rwxr-xr-x  1 user group   8318 1 Apr 11:10
/Volumes/spare/ts/config/dc.xsd'
>    [junit]      rawLine='412584  32 -rwxr-xr-x  1 user group  12847 1 Apr 11:10
/Volumes/spare/ts/config/dcterms.xsd'
>    [junit]      rawLine='412585   8 -rwxr-xr-x  1 user group   3156 1 Apr 11:10
/Volumes/spare/ts/config/s-deliver.css'
>    [junit]      rawLine='412586 192 -rwxr-xr-x  1 user group  97764 1 Apr 11:10
/Volumes/spare/ts/config/s-deliver.xsl'
>    [junit]      rawLine='412587 224 -rwxr-xr-x  1 user group 112700 1 Apr 11:10
/Volumes/spare/ts/config/sml-delivery-2.1.xsd'
>    [junit]      rawLine='412588 208 -rwxr-xr-x  1 user group 103419 1 Apr 11:10
/Volumes/spare/ts/config/sml-delivery-norm-2.0.dtd'
>    [junit]      rawLine='412589 248 -rwxr-xr-x  1 user group 125296 1 Apr 11:10
/Volumes/spare/ts/config/sml-delivery-norm-2.1.dtd'
>    [junit]      rawLine='412590  72 -rwxr-xr-x  1 user group  36256 1 Apr 11:10
/Volumes/spare/ts/config/jm.xsd'
>    [junit]      rawLine='412591   8 -rwxr-xr-x  1 user group    990 1 Apr 11:10
/Volumes/spare/ts/config/video.gif'
>    [junit]      rawLine='412592   8 -rwxr-xr-x  1 user group   1498 1 Apr 11:10
/Volumes/spare/ts/config/xlink.xsd'
>    [junit]      rawLine='412593   8 -rwxr-xr-x  1 user group   1155 1 Apr 11:10
/Volumes/spare/ts/config/xml.xsd'
>    [junit]      rawLine='412594   0 drwxr-xr-x  4 user group    136 1 Apr 10:18
/Volumes/spare/ts/acm19'
>    [junit]      rawLine='412621   0 drwxr-xr-x 57 user group   1938 1 Apr 10:18
/Volumes/spare/ts/acm19/data'
>    [junit]      rawLine='412622  24 -rwxr-xr-x  1 user group   8894 1 Apr 11:09
/Volumes/spare/ts/acm19/data/00000510.xml'
>    [junit]      rawLine='412623  32 -rwxr-xr-x  1 user group  14124 1 Apr 11:09
/Volumes/spare/ts/acm19/data/00000603.xml'
>    [junit]      rawLine='412624  24 -rwxr-xr-x  1 user group  11976 1 Apr 11:09
/Volumes/spare/ts/acm19/data/00001292.xml'
>    [junit]      rawLine='# tacked on an extra line to cause a file to be deleted.'
>    [junit]      rawLine='DELETE /Volumes/spare/ts/acm19/data/00001292old.xml'
>    [junit] ------------- ---------------- ---------------
>    [junit] Testsuite: org.apache.solr.handler.dataimport.TestNumberFormatTransformer
>    [junit] Tests run: 9, Failures: 0, Errors: 0, Time elapsed: 0.035 sec
>    [junit]
>    [junit] Testsuite: org.apache.solr.handler.dataimport.TestPlainTextEntityProcessor
>    [junit] Tests run: 1, Failures: 0, Errors: 0, Time elapsed: 0.013 sec
>    [junit]
>    [junit] Testsuite: org.apache.solr.handler.dataimport.TestRegexTransformer
>    [junit] Tests run: 5, Failures: 0, Errors: 0, Time elapsed: 0.012 sec
>    [junit]
>    [junit] Testsuite: org.apache.solr.handler.dataimport.TestScriptTransformer
>    [junit] Tests run: 0, Failures: 0, Errors: 0, Time elapsed: 0.015 sec
>    [junit]
>    [junit] Testsuite: org.apache.solr.handler.dataimport.TestSqlEntityProcessor
>    [junit] Tests run: 4, Failures: 0, Errors: 0, Time elapsed: 0.021 sec
>    [junit]
>    [junit]  xml response was: <?xml version="1.0" encoding="UTF-8"?>
>    [junit] <response>
>    [junit] <lst name="responseHeader"><int name="status">0</int><int
name="QTime">2</int><lst name="params"><str name="start">0</str><str
name="q">id:5</str><str name="qt">standard</str><str name="rows">20</str><str
name="version">2.2</str></lst></lst><result name="response" numFound="0"
start="0"/>
>    [junit] </response>
>    [junit]
>    [junit]  request was: start=0&q=id:5&qt=standard&rows=20&version=2.2)
>    [junit] Testsuite: org.apache.solr.handler.dataimport.TestSqlEntityProcessor2
>    [junit] Testcase: testLastIndexTime(org.apache.solr.handler.dataimport.TestSqlEntityProcessor2):
   FAILED
>    [junit] query failed XPath: //*[@numFound='1']
>    [junit]  xml response was: <?xml version="1.0" encoding="UTF-8"?>
>    [junit] <response>
>    [junit] <lst name="responseHeader"><int name="status">0</int><int
name="QTime">2</int><lst name="params"><str name="start">0</str><str
name="q">id:5</str><str name="qt">standard</str><str name="rows">20</str><str
name="version">2.2</str></lst></lst><result name="response" numFound="0"
start="0"/>
>    [junit] </response>
>    [junit]
>    [junit]  request was: start=0&q=id:5&qt=standard&rows=20&version=2.2
>    [junit] junit.framework.AssertionFailedError: query failed XPath: //*[@numFound='1']
>    [junit]  xml response was: <?xml version="1.0" encoding="UTF-8"?>
>    [junit] <response>
>    [junit] <lst name="responseHeader"><int name="status">0</int><int
name="QTime">2</int><lst name="params"><str name="start">0</str><str
name="q">id:5</str><str name="qt">standard</str><str name="rows">20</str><str
name="version">2.2</str></lst></lst><result name="response" numFound="0"
start="0"/>
>    [junit] </response>
>    [junit]
>    [junit]  request was: start=0&q=id:5&qt=standard&rows=20&version=2.2
>    [junit]     at org.apache.lucene.util.LuceneTestCase$LuceneTestCaseRunner.runChild(LuceneTestCase.java:795)
>    [junit]     at org.apache.lucene.util.LuceneTestCase$LuceneTestCaseRunner.runChild(LuceneTestCase.java:768)
>    [junit]  xml response was: <?xml version="1.0" encoding="UTF-8"?>
>    [junit] <response>
>    [junit] <lst name="responseHeader"><int name="status">0</int><int
name="QTime">2</int><lst name="params"><str name="start">0</str><str
name="q">id:5</str><str name="qt">standard</str><str name="rows">20</str><str
name="version">2.2</str></lst></lst><result name="response" numFound="0"
start="0"/>
>    [junit] </response>
>    [junit]
>    [junit]  request was: start=0&q=id:5&qt=standard&rows=20&version=2.2
>    [junit]     at org.apache.solr.util.AbstractSolrTestCase.assertQ(AbstractSolrTestCase.java:237)
>    [junit]     at org.apache.solr.util.AbstractSolrTestCase.assertQ(AbstractSolrTestCase.java:227)
>    [junit]     at org.apache.solr.handler.dataimport.TestSqlEntityProcessor2.testLastIndexTime(TestSqlEntityProcessor2.java:218)
>    [junit]
>    [junit]
>    [junit] Tests run: 7, Failures: 1, Errors: 0, Time elapsed: 1.852 sec
>    [junit]
>    [junit] ------------- Standard Output ---------------
>    [junit] NOTE: reproduce with: ant test -Dtestcase=TestSqlEntityProcessor2 -Dtestmethod=testLastIndexTime
-Dtests.seed=-4743420588160411070:-7182073264640052759
>    [junit] NOTE: test params are: codec=MockVariableIntBlock(baseBlockSize=78), locale=es,
timezone=UCT
>    [junit] ------------- ---------------- ---------------
>    [junit] TEST org.apache.solr.handler.dataimport.TestSqlEntityProcessor2 FAILED
>    [junit] Testsuite: org.apache.solr.handler.dataimport.TestSqlEntityProcessorDelta
>    [junit] Tests run: 8, Failures: 0, Errors: 0, Time elapsed: 2.484 sec
>    [junit]
>    [junit] Testsuite: org.apache.solr.handler.dataimport.TestSqlEntityProcessorDelta2
>    [junit] Tests run: 8, Failures: 0, Errors: 0, Time elapsed: 2.082 sec
>    [junit]
>    [junit] Testsuite: org.apache.solr.handler.dataimport.TestTemplateString
>    [junit] Tests run: 1, Failures: 0, Errors: 0, Time elapsed: 0.005 sec
>    [junit]
>    [junit] Testsuite: org.apache.solr.handler.dataimport.TestTemplateTransformer
>    [junit] Tests run: 1, Failures: 0, Errors: 0, Time elapsed: 0.004 sec
>    [junit]
>    [junit] Testsuite: org.apache.solr.handler.dataimport.TestThreaded
>    [junit] Tests run: 1, Failures: 0, Errors: 0, Time elapsed: 0.211 sec
>    [junit]
>    [junit] Testsuite: org.apache.solr.handler.dataimport.TestURLDataSource
>    [junit] Tests run: 1, Failures: 0, Errors: 0, Time elapsed: 0.005 sec
>    [junit]
>    [junit] Testsuite: org.apache.solr.handler.dataimport.TestVariableResolver
>    [junit] Tests run: 9, Failures: 0, Errors: 0, Time elapsed: 0.024 sec
>    [junit]
>    [junit] Testsuite: org.apache.solr.handler.dataimport.TestXPathEntityProcessor
>    [junit] Tests run: 8, Failures: 0, Errors: 0, Time elapsed: 0.468 sec
>    [junit]
>    [junit] Testsuite: org.apache.solr.handler.dataimport.TestXPathRecordReader
>    [junit] Tests run: 21, Failures: 0, Errors: 0, Time elapsed: 0.042 sec
>    [junit]
>    [junit] Tests FAILED
>
> BUILD FAILED
> /usr<https://hudson.apache.org/hudson/job/Lucene-Solr-tests-only-trunk/ws/trunk/build.xml>:23:
The following error occurred while executing this line:
> /usr<https://hudson.apache.org/hudson/job/Lucene-Solr-tests-only-trunk/ws/trunk/solr/common-build.xml>:462:
The following error occurred while executing this line:
> /usr<https://hudson.apache.org/hudson/job/Lucene-Solr-tests-only-trunk/ws/trunk/solr/common-build.xml>:319:
The following error occurred while executing this line:
> /usr<https://hudson.apache.org/hudson/job/Lucene-Solr-tests-only-trunk/ws/trunk/solr/contrib/dataimporthandler/build.xml>:192:
Tests failed!
>
> Total time: 18 minutes 56 seconds
> Recording test results
>
>
> ---------------------------------------------------------------------
> To unsubscribe, e-mail: dev-unsubscribe@lucene.apache.org
> For additional commands, e-mail: dev-help@lucene.apache.org
>
>

---------------------------------------------------------------------
To unsubscribe, e-mail: dev-unsubscribe@lucene.apache.org
For additional commands, e-mail: dev-help@lucene.apache.org


Mime
View raw message