lucene-dev mailing list archives

Site index · List index
Message view « Date » · « Thread »
Top « Date » · « Thread »
From Michael McCandless <luc...@mikemccandless.com>
Subject Re: Build failed in Hudson: Lucene-Solr-tests-only-trunk #278
Date Tue, 19 Oct 2010 09:39:32 GMT
Is there some way to have Hudson send us briefer emails, instead of a
large extract from the console log?

EG the page it shows if you click through the URL is great:

Test Result (6 failures / +6)
    org.apache.solr.TestGroupingSearch.testGroupingGroupSortingScore_basic
    org.apache.solr.TestGroupingSearch.testGroupingGroupSortingScore_basicWithGroupSortEqualToSort
    org.apache.solr.TestGroupingSearch.testGroupingGroupSortingName
    org.apache.solr.TestGroupingSearch.testGroupingGroupSortingWeight
    org.apache.solr.TestGroupingSearch.testGroupAPI
    org.apache.solr.cloud.BasicDistributedZkTest.testDistribSearch

vs this large extract which shows only 1 failure.

Mike

On Tue, Oct 19, 2010 at 5:31 AM, Apache Hudson Server
<hudson@hudson.apache.org> wrote:
> See <https://hudson.apache.org/hudson/job/Lucene-Solr-tests-only-trunk/278/>
>
> ------------------------------------------
> [...truncated 8992 lines...]
>    [junit]
>    [junit] Testsuite: org.apache.solr.client.solrj.response.QueryResponseTest
>    [junit] Tests run: 1, Failures: 0, Errors: 0, Time elapsed: 0.035 sec
>    [junit]
>    [junit] Testsuite: org.apache.solr.schema.NumericFieldsTest
>    [junit] Tests run: 1, Failures: 0, Errors: 0, Time elapsed: 0.63 sec
>    [junit]
>    [junit] Testsuite: org.apache.solr.request.TestFaceting
>    [junit] Tests run: 3, Failures: 0, Errors: 0, Time elapsed: 6.652 sec
>    [junit]
>    [junit] Testsuite: org.apache.solr.search.TestQueryUtils
>    [junit] Tests run: 1, Failures: 0, Errors: 0, Time elapsed: 0.824 sec
>    [junit]
>    [junit] Testsuite: org.apache.solr.search.function.distance.DistanceFunctionTest
>    [junit] Tests run: 3, Failures: 0, Errors: 0, Time elapsed: 1.364 sec
>    [junit]
>    [junit] Testsuite: org.apache.solr.schema.TestBinaryField
>    [junit] Tests run: 1, Failures: 0, Errors: 0, Time elapsed: 2.327 sec
>    [junit]
>    [junit] Testsuite: org.apache.solr.servlet.DirectSolrConnectionTest
>    [junit] Tests run: 2, Failures: 0, Errors: 0, Time elapsed: 1.035 sec
>    [junit]
>    [junit] Testsuite: org.apache.solr.spelling.SpellPossibilityIteratorTest
>    [junit] Tests run: 1, Failures: 0, Errors: 0, Time elapsed: 0.012 sec
>    [junit]
>    [junit] Testsuite: org.apache.solr.search.TestDocSet
>    [junit] Tests run: 2, Failures: 0, Errors: 0, Time elapsed: 0.547 sec
>    [junit]
>    [junit] Testsuite: org.apache.solr.cloud.ZkControllerTest
>    [junit] Tests run: 3, Failures: 0, Errors: 0, Time elapsed: 4.478 sec
>    [junit]
>    [junit] Testsuite: org.apache.solr.common.params.ModifiableSolrParamsTest
>    [junit] Tests run: 5, Failures: 0, Errors: 0, Time elapsed: 0.04 sec
>    [junit]
>    [junit] Testsuite: org.apache.solr.search.TestSolrQueryParser
>    [junit] Tests run: 1, Failures: 0, Errors: 0, Time elapsed: 0.811 sec
>    [junit]
>    [junit] Testsuite: org.apache.solr.common.util.TestNamedListCodec
>    [junit] Tests run: 4, Failures: 0, Errors: 0, Time elapsed: 0.449 sec
>    [junit]
>    [junit] Testsuite: org.apache.solr.core.TestQuerySenderListener
>    [junit] Tests run: 2, Failures: 0, Errors: 0, Time elapsed: 0.648 sec
>    [junit]
>    [junit] Testsuite: org.apache.solr.spelling.FileBasedSpellCheckerTest
>    [junit] Tests run: 3, Failures: 0, Errors: 0, Time elapsed: 0.818 sec
>    [junit]
>    [junit] Testsuite: org.apache.solr.core.TestSolrDeletionPolicy2
>    [junit] Tests run: 1, Failures: 0, Errors: 0, Time elapsed: 0.715 sec
>    [junit]
>    [junit] Testsuite: org.apache.solr.update.DirectUpdateHandlerTest
>    [junit] Tests run: 7, Failures: 0, Errors: 0, Time elapsed: 2.575 sec
>    [junit]
>    [junit] Testsuite: org.apache.solr.update.TestIndexingPerformance
>    [junit] Tests run: 1, Failures: 0, Errors: 0, Time elapsed: 1.083 sec
>    [junit]
>    [junit] Testsuite: org.apache.solr.util.DateMathParserTest
>    [junit] Tests run: 7, Failures: 0, Errors: 0, Time elapsed: 0.052 sec
>    [junit]
>    [junit] Testsuite: org.apache.solr.velocity.VelocityResponseWriterTest
>    [junit] Tests run: 1, Failures: 0, Errors: 0, Time elapsed: 0.901 sec
>    [junit]
>    [junit] Testsuite: org.apache.solr.handler.TestCSVLoader
>    [junit] Tests run: 4, Failures: 0, Errors: 0, Time elapsed: 1.145 sec
>    [junit]
>    [junit] Testsuite: org.apache.solr.handler.XmlUpdateRequestHandlerTest
>    [junit] Tests run: 1, Failures: 0, Errors: 0, Time elapsed: 0.466 sec
>    [junit]
>    [junit] Testsuite: org.apache.solr.handler.component.DebugComponentTest
>    [junit] Tests run: 2, Failures: 0, Errors: 0, Time elapsed: 0.577 sec
>    [junit]
>    [junit] Testsuite: org.apache.solr.schema.IndexSchemaTest
>    [junit] Tests run: 5, Failures: 0, Errors: 0, Time elapsed: 0.761 sec
>    [junit]
>    [junit] Testsuite: org.apache.solr.schema.PolyFieldTest
>    [junit] Tests run: 4, Failures: 0, Errors: 0, Time elapsed: 0.731 sec
>    [junit]
>    [junit] Testsuite: org.apache.solr.search.TestFastLRUCache
>    [junit] Tests run: 6, Failures: 0, Errors: 0, Time elapsed: 0.018 sec
>    [junit]
>    [junit] Testsuite: org.apache.solr.search.function.TestFunctionQuery
>    [junit] Tests run: 7, Failures: 0, Errors: 0, Time elapsed: 1.396 sec
>    [junit]
>    [junit] Testsuite: org.apache.solr.servlet.SolrRequestParserTest
>    [junit] Tests run: 4, Failures: 0, Errors: 0, Time elapsed: 0.504 sec
>    [junit]
>    [junit] Testsuite: org.apache.solr.spelling.suggest.SuggesterTest
>    [junit] Tests run: 2, Failures: 0, Errors: 0, Time elapsed: 0.547 sec
>    [junit]
>    [junit] Testsuite: org.apache.solr.update.DocumentBuilderTest
>    [junit] Tests run: 3, Failures: 0, Errors: 0, Time elapsed: 0.604 sec
>    [junit]
>    [junit] Testsuite: org.apache.solr.cloud.BasicDistributedZkTest
>    [junit] Testcase: testDistribSearch(org.apache.solr.cloud.BasicDistributedZkTest):
 Caused an ERROR
>    [junit] Error executing query
>    [junit] org.apache.solr.client.solrj.SolrServerException: Error executing query
>    [junit]     at org.apache.solr.client.solrj.request.QueryRequest.process(QueryRequest.java:95)
>    [junit]     at org.apache.solr.client.solrj.SolrServer.query(SolrServer.java:119)
>    [junit]     at org.apache.solr.BaseDistributedSearchTestCase.query(BaseDistributedSearchTestCase.java:301)
>    [junit]     at org.apache.solr.cloud.BasicDistributedZkTest.doTest(BasicDistributedZkTest.java:138)
>    [junit]     at org.apache.solr.BaseDistributedSearchTestCase.testDistribSearch(BaseDistributedSearchTestCase.java:562)
>    [junit]     at org.apache.lucene.util.LuceneTestCase$LuceneTestCaseRunner.runChild(LuceneTestCase.java:881)
>    [junit]     at org.apache.lucene.util.LuceneTestCase$LuceneTestCaseRunner.runChild(LuceneTestCase.java:847)
>    [junit] Caused by: org.apache.solr.common.SolrException: Unknown query type 'func'
>    [junit]
>    [junit] Unknown query type 'func'
>    [junit]
>    [junit] request: http://localhost:23896/solr/select?q={!func}a_si&wt=javabin&version=2
>    [junit]     at org.apache.solr.client.solrj.impl.CommonsHttpSolrServer.request(CommonsHttpSolrServer.java:435)
>    [junit]     at org.apache.solr.client.solrj.impl.CommonsHttpSolrServer.request(CommonsHttpSolrServer.java:244)
>    [junit]     at org.apache.solr.client.solrj.request.QueryRequest.process(QueryRequest.java:89)
>    [junit]
>    [junit]
>    [junit] Tests run: 1, Failures: 0, Errors: 1, Time elapsed: 43.603 sec
>    [junit]
>    [junit] ------------- Standard Output ---------------
>    [junit] NOTE: reproduce with: ant test -Dtestcase=BasicDistributedZkTest -Dtestmethod=testDistribSearch
-Dtests.seed=448927499623032573:8494301585926327994 -Dtests.multiplier=3
>    [junit] NOTE: test params are: codec=Standard, locale=es_GT, timezone=Pacific/Kiritimati
>    [junit] ------------- ---------------- ---------------
>    [junit] ------------- Standard Error -----------------
>    [junit] 19/10/2010 11:30:02 PM org.apache.solr.common.SolrException log
>    [junit] GRAVE: org.apache.solr.common.SolrException: Unknown query type 'func'
>    [junit]     at org.apache.solr.core.SolrCore.getQueryPlugin(SolrCore.java:1474)
>    [junit]     at org.apache.solr.search.QParser.getParser(QParser.java:286)
>    [junit]     at org.apache.solr.handler.component.QueryComponent.prepare(QueryComponent.java:92)
>    [junit]     at org.apache.solr.handler.component.SearchHandler.handleRequestBody(SearchHandler.java:210)
>    [junit]     at org.apache.solr.handler.RequestHandlerBase.handleRequest(RequestHandlerBase.java:131)
>    [junit]     at org.apache.solr.core.SolrCore.execute(SolrCore.java:1325)
>    [junit]     at org.apache.solr.servlet.SolrDispatchFilter.execute(SolrDispatchFilter.java:337)
>    [junit]     at org.apache.solr.servlet.SolrDispatchFilter.doFilter(SolrDispatchFilter.java:240)
>    [junit]     at org.mortbay.jetty.servlet.ServletHandler$CachedChain.doFilter(ServletHandler.java:1157)
>    [junit]     at org.mortbay.jetty.servlet.ServletHandler.handle(ServletHandler.java:388)
>    [junit]     at org.mortbay.jetty.servlet.SessionHandler.handle(SessionHandler.java:182)
>    [junit]     at org.mortbay.jetty.handler.ContextHandler.handle(ContextHandler.java:765)
>    [junit]     at org.mortbay.jetty.handler.HandlerWrapper.handle(HandlerWrapper.java:152)
>    [junit]     at org.mortbay.jetty.Server.handle(Server.java:326)
>    [junit]     at org.mortbay.jetty.HttpConnection.handleRequest(HttpConnection.java:542)
>    [junit]     at org.mortbay.jetty.HttpConnection$RequestHandler.headerComplete(HttpConnection.java:923)
>    [junit]     at org.mortbay.jetty.HttpParser.parseNext(HttpParser.java:547)
>    [junit]     at org.mortbay.jetty.HttpParser.parseAvailable(HttpParser.java:212)
>    [junit]     at org.mortbay.jetty.HttpConnection.handle(HttpConnection.java:404)
>    [junit]     at org.mortbay.io.nio.SelectChannelEndPoint.run(SelectChannelEndPoint.java:409)
>    [junit]     at org.mortbay.thread.QueuedThreadPool$PoolThread.run(QueuedThreadPool.java:582)
>    [junit]
>    [junit] NOTE: all tests run in this JVM:
>    [junit] [SolrInfoMBeanTest, TestGroupingSearch, TestChineseFilterFactory, TestDictionaryCompoundWordTokenFilterFactory,
TestGreekLowerCaseFilterFactory, TestGreekStemFilterFactory, TestHyphenationCompoundWordTokenFilterFactory,
TestMappingCharFilterFactory, TestPatternReplaceCharFilterFactory, TestWordDelimiterFilterFactory,
LargeVolumeJettyTest, MergeIndexesEmbeddedTest, DocumentAnalysisResponseTest, BasicDistributedZkTest]
>    [junit] ------------- ---------------- ---------------
>    [junit] TEST org.apache.solr.cloud.BasicDistributedZkTest FAILED
>    [junit] Testsuite: org.apache.solr.common.util.NamedListTest
>    [junit] Tests run: 1, Failures: 0, Errors: 0, Time elapsed: 0.011 sec
>    [junit]
>    [junit] Testsuite: org.apache.solr.core.RequestHandlersTest
>    [junit] Tests run: 2, Failures: 0, Errors: 0, Time elapsed: 0.711 sec
>    [junit]
>    [junit] Testsuite: org.apache.solr.core.SolrCoreTest
>    [junit] Tests run: 5, Failures: 0, Errors: 0, Time elapsed: 3.692 sec
>    [junit]
>    [junit] Testsuite: org.apache.solr.core.TestPropInjectDefaults
>    [junit] Tests run: 2, Failures: 0, Errors: 0, Time elapsed: 0.92 sec
>    [junit]
>    [junit] Testsuite: org.apache.solr.handler.FieldAnalysisRequestHandlerTest
>    [junit] Tests run: 3, Failures: 0, Errors: 0, Time elapsed: 0.459 sec
>    [junit]
>    [junit] Testsuite: org.apache.solr.handler.component.SpellCheckComponentTest
>    [junit] Tests run: 8, Failures: 0, Errors: 0, Time elapsed: 0.913 sec
>    [junit]
>    [junit] Testsuite: org.apache.solr.handler.component.StatsComponentTest
>    [junit] Tests run: 1, Failures: 0, Errors: 0, Time elapsed: 1.522 sec
>    [junit]
>    [junit] Testsuite: org.apache.solr.schema.DateFieldTest
>    [junit] Tests run: 6, Failures: 0, Errors: 0, Time elapsed: 0.013 sec
>    [junit]
>    [junit] Testsuite: org.apache.solr.search.TestLRUCache
>    [junit] Tests run: 3, Failures: 0, Errors: 0, Time elapsed: 0.007 sec
>    [junit]
>    [junit] Testsuite: org.apache.solr.handler.TestReplicationHandler
>    [junit] Tests run: 7, Failures: 0, Errors: 0, Time elapsed: 25.1 sec
>    [junit]
>    [junit] ------------- Standard Error -----------------
>    [junit] 10-19-2010 01:30:44 PM org.apache.solr.handler.SnapPuller fetchLatestIndex
>    [junit] GRAVE: Master at: http://localhost:24157/solr/replication is not available.
Index fetch failed. Exception: The host did not accept the connection within timeout of 5000
ms
>    [junit] 10-19-2010 01:30:44 PM org.apache.solr.SolrTestCaseJ4 endTrackingSearchers
>    [junit] GRAVE: ERROR: SolrIndexSearcher opens=49 closes=48
>    [junit] ------------- ---------------- ---------------
>    [junit] Testsuite: org.apache.solr.handler.component.QueryElevationComponentTest
>    [junit] Tests run: 3, Failures: 0, Errors: 0, Time elapsed: 0.848 sec
>    [junit]
>    [junit] Testsuite: org.apache.solr.request.TestWriterPerf
>    [junit] Tests run: 1, Failures: 0, Errors: 0, Time elapsed: 0.555 sec
>    [junit]
>    [junit] Testsuite: org.apache.solr.search.TestSort
>    [junit] Tests run: 1, Failures: 0, Errors: 0, Time elapsed: 1.562 sec
>    [junit]
>    [junit] Testsuite: org.apache.solr.schema.BadIndexSchemaTest
>    [junit] Tests run: 3, Failures: 0, Errors: 0, Time elapsed: 0.332 sec
>    [junit]
>    [junit] Testsuite: org.apache.solr.schema.LegacyDateFieldTest
>    [junit] Tests run: 4, Failures: 0, Errors: 0, Time elapsed: 0.009 sec
>    [junit]
>    [junit] Testsuite: org.apache.solr.spelling.IndexBasedSpellCheckerTest
>    [junit] Tests run: 5, Failures: 0, Errors: 0, Time elapsed: 0.544 sec
>    [junit]
>    [junit] Testsuite: org.apache.solr.update.AutoCommitTest
>    [junit] Tests run: 1, Failures: 0, Errors: 0, Time elapsed: 4.008 sec
>    [junit]
>    [junit] Testsuite: org.apache.solr.util.SolrPluginUtilsTest
>    [junit] Tests run: 7, Failures: 0, Errors: 0, Time elapsed: 0.476 sec
>    [junit]
>    [junit] Testsuite: org.apache.solr.search.TestRangeQuery
>    [junit] Tests run: 2, Failures: 0, Errors: 0, Time elapsed: 12.215 sec
>    [junit]
>    [junit] ------------- Standard Error -----------------
>    [junit] 19.Eki.2010 09:30:48 org.apache.solr.handler.SnapPuller fetchLatestIndex
>    [junit] SEVERE: Master at: http://localhost:24167/solr/replication is not available.
Index fetch failed. Exception: The host did not accept the connection within timeout of 5000
ms
>    [junit] 19.Eki.2010 09:30:49 org.apache.solr.handler.SnapPuller fetchLatestIndex
>    [junit] SEVERE: Master at: http://localhost:24157/solr/replication is not available.
Index fetch failed. Exception: The host did not accept the connection within timeout of 5000
ms
>    [junit] 19.Eki.2010 09:30:54 org.apache.solr.handler.SnapPuller fetchLatestIndex
>    [junit] SEVERE: Master at: http://localhost:24157/solr/replication is not available.
Index fetch failed. Exception: The host did not accept the connection within timeout of 5000
ms
>    [junit] ------------- ---------------- ---------------
>    [junit] Testsuite: org.apache.solr.search.function.SortByFunctionTest
>    [junit] Tests run: 2, Failures: 0, Errors: 0, Time elapsed: 0.939 sec
>    [junit]
>    [junit] ------------- Standard Error -----------------
>    [junit] 19-10-2010 04:30:59 org.apache.solr.handler.SnapPuller fetchLatestIndex
>    [junit] SEVERE: Master at: http://localhost:24157/solr/replication is not available.
Index fetch failed. Exception: The host did not accept the connection within timeout of 5000
ms
>    [junit] ------------- ---------------- ---------------
>    [junit] Testsuite: org.apache.solr.servlet.CacheHeaderTest
>    [junit] Tests run: 5, Failures: 0, Errors: 0, Time elapsed: 0.73 sec
>    [junit]
>    [junit] Testsuite: org.apache.solr.spelling.SpellingQueryConverterTest
>    [junit] Tests run: 4, Failures: 0, Errors: 0, Time elapsed: 0.016 sec
>    [junit]
>    [junit] Testsuite: org.apache.solr.update.processor.UpdateRequestProcessorFactoryTest
>    [junit] Tests run: 1, Failures: 0, Errors: 0, Time elapsed: 0.393 sec
>    [junit]
>    [junit] Testsuite: org.apache.solr.util.PrimUtilsTest
>    [junit] Tests run: 2, Failures: 0, Errors: 0, Time elapsed: 0.027 sec
>    [junit]
>    [junit] Tests FAILED
>
> BUILD FAILED
> /usr<https://hudson.apache.org/hudson/job/Lucene-Solr-tests-only-trunk/ws/checkout/build.xml>:23:
The following error occurred while executing this line:
> /usr<https://hudson.apache.org/hudson/job/Lucene-Solr-tests-only-trunk/ws/checkout/solr/build.xml>:389:
> The following error occurred while executing this line:
> /usr<https://hudson.apache.org/hudson/job/Lucene-Solr-tests-only-trunk/ws/checkout/solr/build.xml>:482:
Tests failed!
> The following error occurred while executing this line:
> /usr<https://hudson.apache.org/hudson/job/Lucene-Solr-tests-only-trunk/ws/checkout/solr/build.xml>:482:
Tests failed!
>
> Total time: 6 minutes 36 seconds
> Recording test results
>
>
> ---------------------------------------------------------------------
> To unsubscribe, e-mail: dev-unsubscribe@lucene.apache.org
> For additional commands, e-mail: dev-help@lucene.apache.org
>
>

---------------------------------------------------------------------
To unsubscribe, e-mail: dev-unsubscribe@lucene.apache.org
For additional commands, e-mail: dev-help@lucene.apache.org


Mime
View raw message