lucene-dev mailing list archives

Site index · List index
Message view « Date » · « Thread »
Top « Date » · « Thread »
From Apache Hudson Server <hud...@hudson.apache.org>
Subject Build failed in Hudson: Lucene-Solr-tests-only-3.x #68
Date Thu, 14 Oct 2010 19:15:58 GMT
See <https://hudson.apache.org/hudson/job/Lucene-Solr-tests-only-3.x/68/>

------------------------------------------
[...truncated 10126 lines...]
    [junit] ------------- ---------------- ---------------
    [junit] Testsuite: org.apache.solr.handler.dataimport.TestEvaluatorBag
    [junit] Tests run: 5, Failures: 0, Errors: 0, Time elapsed: 0.023 sec
    [junit] 
    [junit] Testsuite: org.apache.solr.handler.dataimport.TestFieldReader
    [junit] Tests run: 1, Failures: 0, Errors: 0, Time elapsed: 0.016 sec
    [junit] 
    [junit] Testsuite: org.apache.solr.handler.dataimport.TestFileListEntityProcessor
    [junit] Testcase: testNTOT(org.apache.solr.handler.dataimport.TestFileListEntityProcessor):
Caused an ERROR
    [junit] Invalid expression for date
    [junit] org.apache.solr.handler.dataimport.DataImportHandlerException: Invalid expression
for date
    [junit] 	at org.apache.solr.handler.dataimport.FileListEntityProcessor.getDate(FileListEntityProcessor.java:167)
    [junit] 	at org.apache.solr.handler.dataimport.FileListEntityProcessor.nextRow(FileListEntityProcessor.java:204)
    [junit] 	at org.apache.solr.handler.dataimport.TestFileListEntityProcessor.getFiles(TestFileListEntityProcessor.java:124)
    [junit] 	at org.apache.solr.handler.dataimport.TestFileListEntityProcessor.testNTOT(TestFileListEntityProcessor.java:163)
    [junit] 	at org.apache.lucene.util.LuceneTestCase$LuceneTestCaseRunner.runChild(LuceneTestCase.java:693)
    [junit] 	at org.apache.lucene.util.LuceneTestCase$LuceneTestCaseRunner.runChild(LuceneTestCase.java:666)
    [junit] Caused by: java.text.ParseException: Unparseable date: "2010-10-14 19:14:54"
    [junit] 	at java.text.DateFormat.parse(DateFormat.java:354)
    [junit] 	at org.apache.solr.handler.dataimport.FileListEntityProcessor.getDate(FileListEntityProcessor.java:165)
    [junit] 
    [junit] 
    [junit] Tests run: 4, Failures: 0, Errors: 1, Time elapsed: 0.024 sec
    [junit] 
    [junit] ------------- Standard Output ---------------
    [junit] NOTE: reproduce with: ant test -Dtestcase=TestFileListEntityProcessor -Dtestmethod=testNTOT
-Dtests.seed=-7821926200369143321:-1506257420218351396
    [junit] NOTE: test params are: locale=vi_VN, timezone=Indian/Cocos
    [junit] ------------- ---------------- ---------------
    [junit] TEST org.apache.solr.handler.dataimport.TestFileListEntityProcessor FAILED
    [junit] Testsuite: org.apache.solr.handler.dataimport.TestJdbcDataSource
    [junit] Tests run: 3, Failures: 0, Errors: 0, Time elapsed: 0.068 sec
    [junit] 
    [junit] Testsuite: org.apache.solr.handler.dataimport.TestLineEntityProcessor
    [junit] Tests run: 4, Failures: 0, Errors: 0, Time elapsed: 0.015 sec
    [junit] 
    [junit] Testsuite: org.apache.solr.handler.dataimport.TestNumberFormatTransformer
    [junit] Tests run: 9, Failures: 0, Errors: 0, Time elapsed: 0.027 sec
    [junit] 
    [junit] Testsuite: org.apache.solr.handler.dataimport.TestPlainTextEntityProcessor
    [junit] Tests run: 1, Failures: 0, Errors: 0, Time elapsed: 0.028 sec
    [junit] 
    [junit] Testsuite: org.apache.solr.handler.dataimport.TestRegexTransformer
    [junit] Tests run: 5, Failures: 0, Errors: 0, Time elapsed: 0.015 sec
    [junit] 
    [junit] Testsuite: org.apache.solr.handler.dataimport.TestScriptTransformer
    [junit] Tests run: 0, Failures: 0, Errors: 0, Time elapsed: 0.009 sec
    [junit] 
    [junit] Testsuite: org.apache.solr.handler.dataimport.TestSqlEntityProcessor
    [junit] Tests run: 4, Failures: 0, Errors: 0, Time elapsed: 0.016 sec
    [junit] 
    [junit]  xml response was: <?xml version="1.0" encoding="UTF-8"?>
    [junit] <response>
    [junit] <lst name="responseHeader"><int name="status">0</int><int
name="QTime">4</int><lst name="params"><str name="start">0</str><str
name="q">id:5</str><str name="qt">standard</str><str name="rows">20</str><str
name="version">2.2</str></lst></lst><result name="response" numFound="0"
start="0"/>
    [junit] </response>
    [junit] 
    [junit]  request was: start=0&q=id:5&qt=standard&rows=20&version=2.2)
    [junit] Testsuite: org.apache.solr.handler.dataimport.TestSqlEntityProcessor2
    [junit] Testcase: testLastIndexTime(org.apache.solr.handler.dataimport.TestSqlEntityProcessor2):
FAILED
    [junit] query failed XPath: //*[@numFound='1']
    [junit]  xml response was: <?xml version="1.0" encoding="UTF-8"?>
    [junit] <response>
    [junit] <lst name="responseHeader"><int name="status">0</int><int
name="QTime">4</int><lst name="params"><str name="start">0</str><str
name="q">id:5</str><str name="qt">standard</str><str name="rows">20</str><str
name="version">2.2</str></lst></lst><result name="response" numFound="0"
start="0"/>
    [junit] </response>
    [junit] 
    [junit]  request was: start=0&q=id:5&qt=standard&rows=20&version=2.2
    [junit] junit.framework.AssertionFailedError: query failed XPath: //*[@numFound='1']
    [junit]  xml response was: <?xml version="1.0" encoding="UTF-8"?>
    [junit] <response>
    [junit] <lst name="responseHeader"><int name="status">0</int><int
name="QTime">4</int><lst name="params"><str name="start">0</str><str
name="q">id:5</str><str name="qt">standard</str><str name="rows">20</str><str
name="version">2.2</str></lst></lst><result name="response" numFound="0"
start="0"/>
    [junit] </response>
    [junit] 
    [junit]  request was: start=0&q=id:5&qt=standard&rows=20&version=2.2
    [junit] 	at org.apache.lucene.util.LuceneTestCase$LuceneTestCaseRunner.runChild(LuceneTestCase.java:693)
    [junit] 	at org.apache.lucene.util.LuceneTestCase$LuceneTestCaseRunner.runChild(LuceneTestCase.java:666)
    [junit]  xml response was: <?xml version="1.0" encoding="UTF-8"?>
    [junit] <response>
    [junit] <lst name="responseHeader"><int name="status">0</int><int
name="QTime">4</int><lst name="params"><str name="start">0</str><str
name="q">id:5</str><str name="qt">standard</str><str name="rows">20</str><str
name="version">2.2</str></lst></lst><result name="response" numFound="0"
start="0"/>
    [junit] </response>
    [junit] 
    [junit]  request was: start=0&q=id:5&qt=standard&rows=20&version=2.2
    [junit] 	at org.apache.solr.SolrTestCaseJ4.assertQ(SolrTestCaseJ4.java:331)
    [junit] 	at org.apache.solr.SolrTestCaseJ4.assertQ(SolrTestCaseJ4.java:310)
    [junit] 	at org.apache.solr.handler.dataimport.TestSqlEntityProcessor2.testLastIndexTime(TestSqlEntityProcessor2.java:211)
    [junit] 
    [junit] 
    [junit] Tests run: 7, Failures: 1, Errors: 0, Time elapsed: 0.77 sec
    [junit] 
    [junit] ------------- Standard Output ---------------
    [junit] NOTE: reproduce with: ant test -Dtestcase=TestSqlEntityProcessor2 -Dtestmethod=testLastIndexTime
-Dtests.seed=-9127871264796608048:-4381044958400184075
    [junit] NOTE: test params are: locale=ar_AE, timezone=AST
    [junit] ------------- ---------------- ---------------
    [junit] ------------- Standard Error -----------------
    [junit] 14/10/2010 11:15:45 ? org.apache.solr.handler.dataimport.JdbcDataSource finalize
    [junit] SEVERE: JdbcDataSource was not closed prior to finalize(), indicates a bug --
POSSIBLE RESOURCE LEAK!!!
    [junit] 14/10/2010 11:15:45 ? org.apache.solr.handler.dataimport.JdbcDataSource finalize
    [junit] SEVERE: JdbcDataSource was not closed prior to finalize(), indicates a bug --
POSSIBLE RESOURCE LEAK!!!
    [junit] 14/10/2010 11:15:45 ? org.apache.solr.handler.dataimport.JdbcDataSource finalize
    [junit] SEVERE: JdbcDataSource was not closed prior to finalize(), indicates a bug --
POSSIBLE RESOURCE LEAK!!!
    [junit] 14/10/2010 11:15:45 ? org.apache.solr.handler.dataimport.DocBuilder buildDocument
    [junit] SEVERE: Exception while processing: x document : SolrInputDocument[{}]
    [junit] org.apache.solr.handler.dataimport.DataImportHandlerException: java.text.ParseException:
Unparseable date: "1970-01-01 00:00:00"
    [junit] 	at org.apache.solr.handler.dataimport.DataImportHandlerException.wrapAndThrow(DataImportHandlerException.java:64)
    [junit] 	at org.apache.solr.handler.dataimport.TestSqlEntityProcessor2$DateFormatValidatingEvaluator.evaluate(TestSqlEntityProcessor2.java:228)
    [junit] 	at org.apache.solr.handler.dataimport.EvaluatorBag$5.get(EvaluatorBag.java:218)
    [junit] 	at org.apache.solr.handler.dataimport.EvaluatorBag$5.get(EvaluatorBag.java:207)
    [junit] 	at org.apache.solr.handler.dataimport.VariableResolverImpl.resolve(VariableResolverImpl.java:116)
    [junit] 	at org.apache.solr.handler.dataimport.TemplateString.fillTokens(TemplateString.java:81)
    [junit] 	at org.apache.solr.handler.dataimport.TemplateString.replaceTokens(TemplateString.java:75)
    [junit] 	at org.apache.solr.handler.dataimport.VariableResolverImpl.replaceTokens(VariableResolverImpl.java:95)
    [junit] 	at org.apache.solr.handler.dataimport.ContextImpl.replaceTokens(ContextImpl.java:235)
    [junit] 	at org.apache.solr.handler.dataimport.SqlEntityProcessor.nextRow(SqlEntityProcessor.java:71)
    [junit] 	at org.apache.solr.handler.dataimport.EntityProcessorWrapper.nextRow(EntityProcessorWrapper.java:233)
    [junit] 	at org.apache.solr.handler.dataimport.DocBuilder.buildDocument(DocBuilder.java:579)
    [junit] 	at org.apache.solr.handler.dataimport.DocBuilder.doFullDump(DocBuilder.java:260)
    [junit] 	at org.apache.solr.handler.dataimport.DocBuilder.execute(DocBuilder.java:184)
    [junit] 	at org.apache.solr.handler.dataimport.DataImporter.doFullImport(DataImporter.java:334)
    [junit] 	at org.apache.solr.handler.dataimport.DataImporter.runCmd(DataImporter.java:392)
    [junit] 	at org.apache.solr.handler.dataimport.DataImportHandler.handleRequestBody(DataImportHandler.java:203)
    [junit] 	at org.apache.solr.handler.RequestHandlerBase.handleRequest(RequestHandlerBase.java:131)
    [junit] 	at org.apache.solr.core.SolrCore.execute(SolrCore.java:1322)
    [junit] 	at org.apache.solr.util.TestHarness.queryAndResponse(TestHarness.java:334)
    [junit] 	at org.apache.solr.util.TestHarness.query(TestHarness.java:321)
    [junit] 	at org.apache.solr.handler.dataimport.AbstractDataImportHandlerTestCase.runFullImport(AbstractDataImportHandlerTestCase.java:81)
    [junit] 	at org.apache.solr.handler.dataimport.TestSqlEntityProcessor2.testLastIndexTime(TestSqlEntityProcessor2.java:210)
    [junit] 	at sun.reflect.NativeMethodAccessorImpl.invoke0(Native Method)
    [junit] 	at sun.reflect.NativeMethodAccessorImpl.invoke(NativeMethodAccessorImpl.java:57)
    [junit] 	at sun.reflect.DelegatingMethodAccessorImpl.invoke(DelegatingMethodAccessorImpl.java:43)
    [junit] 	at java.lang.reflect.Method.invoke(Method.java:616)
    [junit] 	at org.junit.runners.model.FrameworkMethod$1.runReflectiveCall(FrameworkMethod.java:44)
    [junit] 	at org.junit.internal.runners.model.ReflectiveCallable.run(ReflectiveCallable.java:15)
    [junit] 	at org.junit.runners.model.FrameworkMethod.invokeExplosively(FrameworkMethod.java:41)
    [junit] 	at org.junit.internal.runners.statements.InvokeMethod.evaluate(InvokeMethod.java:20)
    [junit] 	at org.junit.rules.TestWatchman$1.evaluate(TestWatchman.java:48)
    [junit] 	at org.junit.internal.runners.statements.RunBefores.evaluate(RunBefores.java:28)
    [junit] 	at org.junit.internal.runners.statements.RunAfters.evaluate(RunAfters.java:31)
    [junit] 	at org.junit.runners.BlockJUnit4ClassRunner.runChild(BlockJUnit4ClassRunner.java:76)
    [junit] 	at org.apache.lucene.util.LuceneTestCase$LuceneTestCaseRunner.runChild(LuceneTestCase.java:693)
    [junit] 	at org.apache.lucene.util.LuceneTestCase$LuceneTestCaseRunner.runChild(LuceneTestCase.java:666)
    [junit] 	at org.junit.runners.ParentRunner$3.run(ParentRunner.java:193)
    [junit] 	at org.junit.runners.ParentRunner$1.schedule(ParentRunner.java:52)
    [junit] 	at org.junit.runners.ParentRunner.runChildren(ParentRunner.java:191)
    [junit] 	at org.junit.runners.ParentRunner.access$000(ParentRunner.java:42)
    [junit] 	at org.junit.runners.ParentRunner$2.evaluate(ParentRunner.java:184)
    [junit] 	at org.junit.internal.runners.statements.RunBefores.evaluate(RunBefores.java:28)
    [junit] 	at org.junit.internal.runners.statements.RunAfters.evaluate(RunAfters.java:31)
    [junit] 	at org.junit.runners.ParentRunner.run(ParentRunner.java:236)
    [junit] 	at junit.framework.JUnit4TestAdapter.run(JUnit4TestAdapter.java:39)
    [junit] 	at org.apache.tools.ant.taskdefs.optional.junit.JUnitTestRunner.run(JUnitTestRunner.java:421)
    [junit] 	at org.apache.tools.ant.taskdefs.optional.junit.JUnitTestRunner.launch(JUnitTestRunner.java:912)
    [junit] 	at org.apache.tools.ant.taskdefs.optional.junit.JUnitTestRunner.main(JUnitTestRunner.java:743)
    [junit] Caused by: java.text.ParseException: Unparseable date: "1970-01-01 00:00:00"
    [junit] 	at java.text.DateFormat.parse(DateFormat.java:354)
    [junit] 	at org.apache.solr.handler.dataimport.TestSqlEntityProcessor2$DateFormatValidatingEvaluator.evaluate(TestSqlEntityProcessor2.java:226)
    [junit] 	... 47 more
    [junit] 14/10/2010 11:15:45 ? org.apache.solr.handler.dataimport.DataImporter doFullImport
    [junit] SEVERE: Full Import failed
    [junit] org.apache.solr.handler.dataimport.DataImportHandlerException: java.text.ParseException:
Unparseable date: "1970-01-01 00:00:00"
    [junit] 	at org.apache.solr.handler.dataimport.DataImportHandlerException.wrapAndThrow(DataImportHandlerException.java:64)
    [junit] 	at org.apache.solr.handler.dataimport.TestSqlEntityProcessor2$DateFormatValidatingEvaluator.evaluate(TestSqlEntityProcessor2.java:228)
    [junit] 	at org.apache.solr.handler.dataimport.EvaluatorBag$5.get(EvaluatorBag.java:218)
    [junit] 	at org.apache.solr.handler.dataimport.EvaluatorBag$5.get(EvaluatorBag.java:207)
    [junit] 	at org.apache.solr.handler.dataimport.VariableResolverImpl.resolve(VariableResolverImpl.java:116)
    [junit] 	at org.apache.solr.handler.dataimport.TemplateString.fillTokens(TemplateString.java:81)
    [junit] 	at org.apache.solr.handler.dataimport.TemplateString.replaceTokens(TemplateString.java:75)
    [junit] 	at org.apache.solr.handler.dataimport.VariableResolverImpl.replaceTokens(VariableResolverImpl.java:95)
    [junit] 	at org.apache.solr.handler.dataimport.ContextImpl.replaceTokens(ContextImpl.java:235)
    [junit] 	at org.apache.solr.handler.dataimport.SqlEntityProcessor.nextRow(SqlEntityProcessor.java:71)
    [junit] 	at org.apache.solr.handler.dataimport.EntityProcessorWrapper.nextRow(EntityProcessorWrapper.java:233)
    [junit] 	at org.apache.solr.handler.dataimport.DocBuilder.buildDocument(DocBuilder.java:579)
    [junit] 	at org.apache.solr.handler.dataimport.DocBuilder.doFullDump(DocBuilder.java:260)
    [junit] 	at org.apache.solr.handler.dataimport.DocBuilder.execute(DocBuilder.java:184)
    [junit] 	at org.apache.solr.handler.dataimport.DataImporter.doFullImport(DataImporter.java:334)
    [junit] 	at org.apache.solr.handler.dataimport.DataImporter.runCmd(DataImporter.java:392)
    [junit] 	at org.apache.solr.handler.dataimport.DataImportHandler.handleRequestBody(DataImportHandler.java:203)
    [junit] 	at org.apache.solr.handler.RequestHandlerBase.handleRequest(RequestHandlerBase.java:131)
    [junit] 	at org.apache.solr.core.SolrCore.execute(SolrCore.java:1322)
    [junit] 	at org.apache.solr.util.TestHarness.queryAndResponse(TestHarness.java:334)
    [junit] 	at org.apache.solr.util.TestHarness.query(TestHarness.java:321)
    [junit] 	at org.apache.solr.handler.dataimport.AbstractDataImportHandlerTestCase.runFullImport(AbstractDataImportHandlerTestCase.java:81)
    [junit] 	at org.apache.solr.handler.dataimport.TestSqlEntityProcessor2.testLastIndexTime(TestSqlEntityProcessor2.java:210)
    [junit] 	at sun.reflect.NativeMethodAccessorImpl.invoke0(Native Method)
    [junit] 	at sun.reflect.NativeMethodAccessorImpl.invoke(NativeMethodAccessorImpl.java:57)
    [junit] 	at sun.reflect.DelegatingMethodAccessorImpl.invoke(DelegatingMethodAccessorImpl.java:43)
    [junit] 	at java.lang.reflect.Method.invoke(Method.java:616)
    [junit] 	at org.junit.runners.model.FrameworkMethod$1.runReflectiveCall(FrameworkMethod.java:44)
    [junit] 	at org.junit.internal.runners.model.ReflectiveCallable.run(ReflectiveCallable.java:15)
    [junit] 	at org.junit.runners.model.FrameworkMethod.invokeExplosively(FrameworkMethod.java:41)
    [junit] 	at org.junit.internal.runners.statements.InvokeMethod.evaluate(InvokeMethod.java:20)
    [junit] 	at org.junit.rules.TestWatchman$1.evaluate(TestWatchman.java:48)
    [junit] 	at org.junit.internal.runners.statements.RunBefores.evaluate(RunBefores.java:28)
    [junit] 	at org.junit.internal.runners.statements.RunAfters.evaluate(RunAfters.java:31)
    [junit] 	at org.junit.runners.BlockJUnit4ClassRunner.runChild(BlockJUnit4ClassRunner.java:76)
    [junit] 	at org.apache.lucene.util.LuceneTestCase$LuceneTestCaseRunner.runChild(LuceneTestCase.java:693)
    [junit] 	at org.apache.lucene.util.LuceneTestCase$LuceneTestCaseRunner.runChild(LuceneTestCase.java:666)
    [junit] 	at org.junit.runners.ParentRunner$3.run(ParentRunner.java:193)
    [junit] 	at org.junit.runners.ParentRunner$1.schedule(ParentRunner.java:52)
    [junit] 	at org.junit.runners.ParentRunner.runChildren(ParentRunner.java:191)
    [junit] 	at org.junit.runners.ParentRunner.access$000(ParentRunner.java:42)
    [junit] 	at org.junit.runners.ParentRunner$2.evaluate(ParentRunner.java:184)
    [junit] 	at org.junit.internal.runners.statements.RunBefores.evaluate(RunBefores.java:28)
    [junit] 	at org.junit.internal.runners.statements.RunAfters.evaluate(RunAfters.java:31)
    [junit] 	at org.junit.runners.ParentRunner.run(ParentRunner.java:236)
    [junit] 	at junit.framework.JUnit4TestAdapter.run(JUnit4TestAdapter.java:39)
    [junit] 	at org.apache.tools.ant.taskdefs.optional.junit.JUnitTestRunner.run(JUnitTestRunner.java:421)
    [junit] 	at org.apache.tools.ant.taskdefs.optional.junit.JUnitTestRunner.launch(JUnitTestRunner.java:912)
    [junit] 	at org.apache.tools.ant.taskdefs.optional.junit.JUnitTestRunner.main(JUnitTestRunner.java:743)
    [junit] Caused by: java.text.ParseException: Unparseable date: "1970-01-01 00:00:00"
    [junit] 	at java.text.DateFormat.parse(DateFormat.java:354)
    [junit] 	at org.apache.solr.handler.dataimport.TestSqlEntityProcessor2$DateFormatValidatingEvaluator.evaluate(TestSqlEntityProcessor2.java:226)
    [junit] 	... 47 more
    [junit] ------------- ---------------- ---------------
    [junit] TEST org.apache.solr.handler.dataimport.TestSqlEntityProcessor2 FAILED
    [junit] Testsuite: org.apache.solr.handler.dataimport.TestSqlEntityProcessorDelta
    [junit] Tests run: 8, Failures: 0, Errors: 0, Time elapsed: 1.19 sec
    [junit] 
    [junit] Testsuite: org.apache.solr.handler.dataimport.TestSqlEntityProcessorDelta2
    [junit] Tests run: 8, Failures: 0, Errors: 0, Time elapsed: 1.223 sec
    [junit] 
    [junit] Testsuite: org.apache.solr.handler.dataimport.TestTemplateString
    [junit] Tests run: 1, Failures: 0, Errors: 0, Time elapsed: 0.007 sec
    [junit] 
    [junit] Testsuite: org.apache.solr.handler.dataimport.TestTemplateTransformer
    [junit] Tests run: 1, Failures: 0, Errors: 0, Time elapsed: 0.007 sec
    [junit] 
    [junit] Testsuite: org.apache.solr.handler.dataimport.TestThreaded
    [junit] Tests run: 1, Failures: 0, Errors: 0, Time elapsed: 0.315 sec
    [junit] 
    [junit] Testsuite: org.apache.solr.handler.dataimport.TestURLDataSource
    [junit] Tests run: 1, Failures: 0, Errors: 0, Time elapsed: 0.008 sec
    [junit] 
    [junit] Testsuite: org.apache.solr.handler.dataimport.TestVariableResolver
    [junit] Tests run: 9, Failures: 0, Errors: 0, Time elapsed: 0.018 sec
    [junit] 
    [junit] Testsuite: org.apache.solr.handler.dataimport.TestXPathEntityProcessor
    [junit] Tests run: 8, Failures: 0, Errors: 0, Time elapsed: 0.497 sec
    [junit] 
    [junit] Testsuite: org.apache.solr.handler.dataimport.TestXPathRecordReader
    [junit] Tests run: 21, Failures: 0, Errors: 0, Time elapsed: 0.042 sec
    [junit] 
    [junit] Tests FAILED

BUILD FAILED
/usr<https://hudson.apache.org/hudson/job/Lucene-Solr-tests-only-3.x/ws/checkout/build.xml>:27:
The following error occurred while executing this line:
/usr<https://hudson.apache.org/hudson/job/Lucene-Solr-tests-only-3.x/ws/checkout/solr/common-build.xml>:460:
The following error occurred while executing this line:
/usr<https://hudson.apache.org/hudson/job/Lucene-Solr-tests-only-3.x/ws/checkout/solr/common-build.xml>:317:
The following error occurred while executing this line:
/usr<https://hudson.apache.org/hudson/job/Lucene-Solr-tests-only-3.x/ws/checkout/solr/contrib/dataimporthandler/build.xml>:171:
Tests failed!

Total time: 5 minutes 42 seconds
Recording test results


---------------------------------------------------------------------
To unsubscribe, e-mail: dev-unsubscribe@lucene.apache.org
For additional commands, e-mail: dev-help@lucene.apache.org


Mime
View raw message