lucene-dev mailing list archives

Site index · List index
Message view « Date » · « Thread »
Top « Date » · « Thread »
From Mark Miller <markrmil...@gmail.com>
Subject Re: Build failed in Hudson: Lucene-Solr-tests-only-trunk #267
Date Tue, 19 Oct 2010 04:14:01 GMT
bq. java.util.concurrent.TimeoutException: Could not connect to
ZooKeeper 127.0.0.1:29700/solr within 1000 ms

This should probably be 10 seconds rather than one - I'll make the change.

- Mark

On 10/18/10 11:54 PM, Apache Hudson Server wrote:
> See <https://hudson.apache.org/hudson/job/Lucene-Solr-tests-only-trunk/267/>
> 
> ------------------------------------------
> [...truncated 8438 lines...]
>     [junit] Tests run: 1, Failures: 0, Errors: 0, Time elapsed: 0.017 sec
>     [junit] 
>     [junit] Testsuite: org.apache.solr.schema.NumericFieldsTest
>     [junit] Tests run: 1, Failures: 0, Errors: 0, Time elapsed: 2.238 sec
>     [junit] 
>     [junit] Testsuite: org.apache.solr.analysis.TestHindiFilters
>     [junit] Tests run: 4, Failures: 0, Errors: 0, Time elapsed: 0.152 sec
>     [junit] 
>     [junit] Testsuite: org.apache.solr.analysis.TestPortugueseLightStemFilterFactory
>     [junit] Tests run: 1, Failures: 0, Errors: 0, Time elapsed: 0.03 sec
>     [junit] 
>     [junit] Testsuite: org.apache.solr.analysis.TestReverseStringFilterFactory
>     [junit] Tests run: 1, Failures: 0, Errors: 0, Time elapsed: 0.016 sec
>     [junit] 
>     [junit] Testsuite: org.apache.solr.analysis.TestRussianFilters
>     [junit] Tests run: 3, Failures: 0, Errors: 0, Time elapsed: 0.066 sec
>     [junit] 
>     [junit] Testsuite: org.apache.solr.analysis.TestWikipediaTokenizerFactory
>     [junit] Tests run: 1, Failures: 0, Errors: 0, Time elapsed: 0.018 sec
>     [junit] 
>     [junit] Testsuite: org.apache.solr.spelling.DirectSolrSpellCheckerTest
>     [junit] Tests run: 1, Failures: 0, Errors: 0, Time elapsed: 1.138 sec
>     [junit] 
>     [junit] Testsuite: org.apache.solr.search.TestQueryUtils
>     [junit] Tests run: 1, Failures: 0, Errors: 0, Time elapsed: 1.204 sec
>     [junit] 
>     [junit] Testsuite: org.apache.solr.client.solrj.embedded.LargeVolumeEmbeddedTest
>     [junit] Tests run: 1, Failures: 0, Errors: 0, Time elapsed: 1.226 sec
>     [junit] 
>     [junit] Testsuite: org.apache.solr.client.solrj.request.TestUpdateRequestCodec
>     [junit] Tests run: 2, Failures: 0, Errors: 0, Time elapsed: 0.044 sec
>     [junit] 
>     [junit] Testsuite: org.apache.solr.client.solrj.response.QueryResponseTest
>     [junit] Tests run: 1, Failures: 0, Errors: 0, Time elapsed: 0.079 sec
>     [junit] 
>     [junit] Testsuite: org.apache.solr.core.SolrCoreTest
>     [junit] Tests run: 5, Failures: 0, Errors: 0, Time elapsed: 13.675 sec
>     [junit] 
>     [junit] Testsuite: org.apache.solr.search.function.distance.DistanceFunctionTest
>     [junit] Tests run: 3, Failures: 0, Errors: 0, Time elapsed: 1.25 sec
>     [junit] 
>     [junit] Testsuite: org.apache.solr.update.processor.SignatureUpdateProcessorFactoryTest
>     [junit] Tests run: 4, Failures: 0, Errors: 0, Time elapsed: 2.29 sec
>     [junit] 
>     [junit] ------------- Standard Error -----------------
>     [junit] 19/Out/2010 12:52:03 org.apache.solr.SolrTestCaseJ4 endTrackingSearchers
>     [junit] SEVERE: ERROR: SolrIndexSearcher opens=42 closes=35
>     [junit] ------------- ---------------- ---------------
>     [junit] Testsuite: org.apache.solr.util.TestUtils
>     [junit] Tests run: 3, Failures: 0, Errors: 0, Time elapsed: 0.018 sec
>     [junit] 
>     [junit] Testsuite: org.apache.solr.servlet.DirectSolrConnectionTest
>     [junit] Tests run: 2, Failures: 0, Errors: 0, Time elapsed: 0.628 sec
>     [junit] 
>     [junit] Testsuite: org.apache.solr.core.TestPropInjectDefaults
>     [junit] Tests run: 2, Failures: 0, Errors: 0, Time elapsed: 1.349 sec
>     [junit] 
>     [junit] Testsuite: org.apache.solr.request.TestFaceting
>     [junit] Tests run: 3, Failures: 0, Errors: 0, Time elapsed: 5.331 sec
>     [junit] 
>     [junit] Testsuite: org.apache.solr.handler.FieldAnalysisRequestHandlerTest
>     [junit] Tests run: 3, Failures: 0, Errors: 0, Time elapsed: 0.666 sec
>     [junit] 
>     [junit] Testsuite: org.apache.solr.schema.TestBinaryField
>     [junit] Tests run: 1, Failures: 0, Errors: 0, Time elapsed: 1.386 sec
>     [junit] 
>     [junit] Testsuite: org.apache.solr.spelling.SpellPossibilityIteratorTest
>     [junit] Tests run: 1, Failures: 0, Errors: 0, Time elapsed: 0.316 sec
>     [junit] 
>     [junit] Testsuite: org.apache.solr.handler.component.SpellCheckComponentTest
>     [junit] Tests run: 8, Failures: 0, Errors: 0, Time elapsed: 1.444 sec
>     [junit] 
>     [junit] Testsuite: org.apache.solr.search.TestDocSet
>     [junit] Tests run: 2, Failures: 0, Errors: 0, Time elapsed: 1.479 sec
>     [junit] 
>     [junit] Testsuite: org.apache.solr.cloud.ZkControllerTest
>     [junit] Testcase: testReadConfigName(org.apache.solr.cloud.ZkControllerTest):	Caused
an ERROR
>     [junit] Could not connect to ZooKeeper 127.0.0.1:29700/solr within 1000 ms
>     [junit] java.util.concurrent.TimeoutException: Could not connect to ZooKeeper 127.0.0.1:29700/solr
within 1000 ms
>     [junit] 	at org.apache.solr.common.cloud.ConnectionManager.waitForConnected(ConnectionManager.java:124)
>     [junit] 	at org.apache.solr.common.cloud.SolrZkClient.<init>(SolrZkClient.java:122)
>     [junit] 	at org.apache.solr.common.cloud.SolrZkClient.<init>(SolrZkClient.java:69)
>     [junit] 	at org.apache.solr.cloud.ZkController.<init>(ZkController.java:104)
>     [junit] 	at org.apache.solr.cloud.ZkControllerTest.testReadConfigName(ZkControllerTest.java:162)
>     [junit] 	at org.apache.lucene.util.LuceneTestCase$LuceneTestCaseRunner.runChild(LuceneTestCase.java:881)
>     [junit] 	at org.apache.lucene.util.LuceneTestCase$LuceneTestCaseRunner.runChild(LuceneTestCase.java:847)
>     [junit] 
>     [junit] 
>     [junit] Tests run: 3, Failures: 0, Errors: 1, Time elapsed: 7.872 sec
>     [junit] 
>     [junit] ------------- Standard Output ---------------
>     [junit] NOTE: reproduce with: ant test -Dtestcase=ZkControllerTest -Dtestmethod=testReadConfigName
-Dtests.seed=-8752836615282960093:-804711121443148662 -Dtests.multiplier=3
>     [junit] NOTE: test params are: codec=Pulsing(freqCutoff=10), locale=ar, timezone=MET
>     [junit] ------------- ---------------- ---------------
>     [junit] ------------- Standard Error -----------------
>     [junit] NOTE: all tests run in this JVM:
>     [junit] [ConvertedLegacyTest, TestDistributedSearch, TestCzechStemFilterFactory,
TestDelimitedPayloadTokenFilterFactory, TestEnglishMinimalStemFilterFactory, TestHindiFilters,
TestPortugueseLightStemFilterFactory, TestReverseStringFilterFactory, TestRussianFilters,
TestWikipediaTokenizerFactory, LargeVolumeEmbeddedTest, TestUpdateRequestCodec, QueryResponseTest,
ZkControllerTest]
>     [junit] ------------- ---------------- ---------------
>     [junit] TEST org.apache.solr.cloud.ZkControllerTest FAILED
>     [junit] Testsuite: org.apache.solr.common.params.ModifiableSolrParamsTest
>     [junit] Tests run: 5, Failures: 0, Errors: 0, Time elapsed: 0.068 sec
>     [junit] 
>     [junit] Testsuite: org.apache.solr.search.TestSolrQueryParser
>     [junit] Tests run: 1, Failures: 0, Errors: 0, Time elapsed: 0.814 sec
>     [junit] 
>     [junit] Testsuite: org.apache.solr.common.util.TestNamedListCodec
>     [junit] Tests run: 4, Failures: 0, Errors: 0, Time elapsed: 0.511 sec
>     [junit] 
>     [junit] Testsuite: org.apache.solr.spelling.FileBasedSpellCheckerTest
>     [junit] Tests run: 3, Failures: 0, Errors: 0, Time elapsed: 0.819 sec
>     [junit] 
>     [junit] Testsuite: org.apache.solr.update.DirectUpdateHandlerTest
>     [junit] Tests run: 7, Failures: 0, Errors: 0, Time elapsed: 2.655 sec
>     [junit] 
>     [junit] Testsuite: org.apache.solr.core.TestQuerySenderListener
>     [junit] Tests run: 2, Failures: 0, Errors: 0, Time elapsed: 0.81 sec
>     [junit] 
>     [junit] Testsuite: org.apache.solr.core.TestSolrDeletionPolicy2
>     [junit] Tests run: 1, Failures: 0, Errors: 0, Time elapsed: 0.846 sec
>     [junit] 
>     [junit] Testsuite: org.apache.solr.handler.component.StatsComponentTest
>     [junit] Tests run: 1, Failures: 0, Errors: 0, Time elapsed: 3.018 sec
>     [junit] 
>     [junit] Testsuite: org.apache.solr.velocity.VelocityResponseWriterTest
>     [junit] Tests run: 1, Failures: 0, Errors: 0, Time elapsed: 1.077 sec
>     [junit] 
>     [junit] Testsuite: org.apache.solr.schema.DateFieldTest
>     [junit] Tests run: 6, Failures: 0, Errors: 0, Time elapsed: 0.063 sec
>     [junit] 
>     [junit] Testsuite: org.apache.solr.update.TestIndexingPerformance
>     [junit] Tests run: 1, Failures: 0, Errors: 0, Time elapsed: 1.284 sec
>     [junit] 
>     [junit] Testsuite: org.apache.solr.search.TestLRUCache
>     [junit] Tests run: 3, Failures: 0, Errors: 0, Time elapsed: 0.024 sec
>     [junit] 
>     [junit] Testsuite: org.apache.solr.util.DateMathParserTest
>     [junit] Tests run: 7, Failures: 0, Errors: 0, Time elapsed: 0.082 sec
>     [junit] 
>     [junit] Testsuite: org.apache.solr.handler.TestCSVLoader
>     [junit] Tests run: 4, Failures: 0, Errors: 0, Time elapsed: 1.469 sec
>     [junit] 
>     [junit] Testsuite: org.apache.solr.handler.XmlUpdateRequestHandlerTest
>     [junit] Tests run: 1, Failures: 0, Errors: 0, Time elapsed: 0.488 sec
>     [junit] 
>     [junit] Testsuite: org.apache.solr.search.TestSort
>     [junit] Tests run: 1, Failures: 0, Errors: 0, Time elapsed: 1.971 sec
>     [junit] 
>     [junit] Testsuite: org.apache.solr.spelling.IndexBasedSpellCheckerTest
>     [junit] Tests run: 5, Failures: 0, Errors: 0, Time elapsed: 0.596 sec
>     [junit] 
>     [junit] Testsuite: org.apache.solr.handler.component.DebugComponentTest
>     [junit] Tests run: 2, Failures: 0, Errors: 0, Time elapsed: 0.911 sec
>     [junit] 
>     [junit] Testsuite: org.apache.solr.schema.IndexSchemaTest
>     [junit] Tests run: 5, Failures: 0, Errors: 0, Time elapsed: 0.678 sec
>     [junit] 
>     [junit] Testsuite: org.apache.solr.schema.PolyFieldTest
>     [junit] Tests run: 4, Failures: 0, Errors: 0, Time elapsed: 0.848 sec
>     [junit] 
>     [junit] Testsuite: org.apache.solr.search.TestFastLRUCache
>     [junit] Tests run: 6, Failures: 0, Errors: 0, Time elapsed: 0.028 sec
>     [junit] 
>     [junit] Testsuite: org.apache.solr.update.AutoCommitTest
>     [junit] Tests run: 1, Failures: 0, Errors: 0, Time elapsed: 4.219 sec
>     [junit] 
>     [junit] Testsuite: org.apache.solr.util.SolrPluginUtilsTest
>     [junit] Tests run: 7, Failures: 0, Errors: 0, Time elapsed: 0.737 sec
>     [junit] 
>     [junit] Testsuite: org.apache.solr.search.function.TestFunctionQuery
>     [junit] Tests run: 7, Failures: 0, Errors: 0, Time elapsed: 4.336 sec
>     [junit] 
>     [junit] Testsuite: org.apache.solr.servlet.SolrRequestParserTest
>     [junit] Tests run: 4, Failures: 0, Errors: 0, Time elapsed: 0.752 sec
>     [junit] 
>     [junit] Testsuite: org.apache.solr.spelling.suggest.SuggesterTest
>     [junit] Tests run: 2, Failures: 0, Errors: 0, Time elapsed: 0.296 sec
>     [junit] 
>     [junit] Testsuite: org.apache.solr.update.DocumentBuilderTest
>     [junit] Tests run: 3, Failures: 0, Errors: 0, Time elapsed: 0.695 sec
>     [junit] 
>     [junit] Testsuite: org.apache.solr.handler.TestReplicationHandler
>     [junit] Tests run: 7, Failures: 0, Errors: 0, Time elapsed: 30.398 sec
>     [junit] 
>     [junit] ------------- Standard Error -----------------
>     [junit] 19.10.2010 9:52:30 org.apache.solr.handler.SnapPuller fetchLatestIndex
>     [junit] SEVERE: Master at: http://localhost:29729/solr/replication is not available.
Index fetch failed. Exception: The host did not accept the connection within timeout of 5000
ms
>     [junit] 19.10.2010 9:52:30 org.apache.solr.SolrTestCaseJ4 endTrackingSearchers
>     [junit] SEVERE: ERROR: SolrIndexSearcher opens=49 closes=48
>     [junit] ------------- ---------------- ---------------
>     [junit] Testsuite: org.apache.solr.handler.component.QueryElevationComponentTest
>     [junit] Tests run: 3, Failures: 0, Errors: 0, Time elapsed: 1.183 sec
>     [junit] 
>     [junit] Testsuite: org.apache.solr.request.TestWriterPerf
>     [junit] Tests run: 1, Failures: 0, Errors: 0, Time elapsed: 0.917 sec
>     [junit] 
>     [junit] Tests FAILED
>     [junit] Testsuite: org.apache.solr.schema.BadIndexSchemaTest
>     [junit] Tests run: 3, Failures: 0, Errors: 0, Time elapsed: 3.168 sec
>     [junit] 
>     [junit] ------------- Standard Error -----------------
>     [junit] 19-10-2010 03:52:34 org.apache.solr.handler.SnapPuller fetchLatestIndex
>     [junit] SEVERE: Master at: http://localhost:29739/solr/replication is not available.
Index fetch failed. Exception: The host did not accept the connection within timeout of 5000
ms
>     [junit] 19-10-2010 03:52:35 org.apache.solr.handler.SnapPuller fetchLatestIndex
>     [junit] SEVERE: Master at: http://localhost:29729/solr/replication is not available.
Index fetch failed. Exception: The host did not accept the connection within timeout of 5000
ms
>     [junit] ------------- ---------------- ---------------
>     [junit] Testsuite: org.apache.solr.schema.LegacyDateFieldTest
>     [junit] Tests run: 4, Failures: 0, Errors: 0, Time elapsed: 0.017 sec
>     [junit] 
>     [junit] Testsuite: org.apache.solr.search.TestRangeQuery
>     [junit] Tests run: 2, Failures: 0, Errors: 0, Time elapsed: 12.444 sec
>     [junit] 
>     [junit] ------------- Standard Error -----------------
>     [junit] 2010 Okt 18 22:52:40 org.apache.solr.handler.SnapPuller fetchLatestIndex
>     [junit] SEVERE: Master at: http://localhost:29729/solr/replication is not available.
Index fetch failed. Exception: The host did not accept the connection within timeout of 5000
ms
>     [junit] 2010 Okt 18 22:52:45 org.apache.solr.handler.SnapPuller fetchLatestIndex
>     [junit] SEVERE: Master at: http://localhost:29729/solr/replication is not available.
Index fetch failed. Exception: The host did not accept the connection within timeout of 5000
ms
>     [junit] 2010 Okt 18 22:52:50 org.apache.solr.handler.SnapPuller fetchLatestIndex
>     [junit] SEVERE: Master at: http://localhost:29729/solr/replication is not available.
Index fetch failed. Exception: The host did not accept the connection within timeout of 5000
ms
>     [junit] ------------- ---------------- ---------------
>     [junit] Testsuite: org.apache.solr.search.function.SortByFunctionTest
>     [junit] Tests run: 2, Failures: 0, Errors: 0, Time elapsed: 1.301 sec
>     [junit] 
>     [junit] Testsuite: org.apache.solr.servlet.CacheHeaderTest
>     [junit] Tests run: 5, Failures: 0, Errors: 0, Time elapsed: 0.814 sec
>     [junit] 
>     [junit] Testsuite: org.apache.solr.spelling.SpellingQueryConverterTest
>     [junit] Tests run: 4, Failures: 0, Errors: 0, Time elapsed: 0.07 sec
>     [junit] 
>     [junit] Testsuite: org.apache.solr.update.processor.UpdateRequestProcessorFactoryTest
>     [junit] Tests run: 1, Failures: 0, Errors: 0, Time elapsed: 0.787 sec
>     [junit] 
>     [junit] ------------- Standard Error -----------------
>     [junit] 19.Eki.2010 06:52:55 org.apache.solr.handler.SnapPuller fetchLatestIndex
>     [junit] SEVERE: Master at: http://localhost:29729/solr/replication is not available.
Index fetch failed. Exception: The host did not accept the connection within timeout of 5000
ms
>     [junit] ------------- ---------------- ---------------
>     [junit] Testsuite: org.apache.solr.util.PrimUtilsTest
>     [junit] Tests run: 2, Failures: 0, Errors: 0, Time elapsed: 0.038 sec
>     [junit] 
> 
> BUILD FAILED
> /usr<https://hudson.apache.org/hudson/job/Lucene-Solr-tests-only-trunk/ws/checkout/build.xml>:23:
The following error occurred while executing this line:
> /usr<https://hudson.apache.org/hudson/job/Lucene-Solr-tests-only-trunk/ws/checkout/solr/build.xml>:389:

> The following error occurred while executing this line:
> /usr<https://hudson.apache.org/hudson/job/Lucene-Solr-tests-only-trunk/ws/checkout/solr/build.xml>:482:
Tests failed!
> The following error occurred while executing this line:
> /usr<https://hudson.apache.org/hudson/job/Lucene-Solr-tests-only-trunk/ws/checkout/solr/build.xml>:482:
Tests failed!
> 
> Total time: 11 minutes 0 seconds
> Recording test results
> 
> 
> ---------------------------------------------------------------------
> To unsubscribe, e-mail: dev-unsubscribe@lucene.apache.org
> For additional commands, e-mail: dev-help@lucene.apache.org
> 


---------------------------------------------------------------------
To unsubscribe, e-mail: dev-unsubscribe@lucene.apache.org
For additional commands, e-mail: dev-help@lucene.apache.org


Mime
View raw message